siren,nic,siret,statutDiffusionEtablissement,dateCreationEtablissement,trancheEffectifsEtablissement,anneeEffectifsEtablissement,activitePrincipaleRegistreMetiersEtablissement,dateDernierTraitementEtablissement,etablissementSiege,nombrePeriodesEtablissement,complementAdresseEtablissement,numeroVoieEtablissement,indiceRepetitionEtablissement,typeVoieEtablissement,libelleVoieEtablissement,codePostalEtablissement,libelleCommuneEtablissement,libelleCommuneEtrangerEtablissement,distributionSpecialeEtablissement,codeCommuneEtablissement,codeCedexEtablissement,libelleCedexEtablissement,codePaysEtrangerEtablissement,libellePaysEtrangerEtablissement,complementAdresse2Etablissement,numeroVoie2Etablissement,indiceRepetition2Etablissement,typeVoie2Etablissement,libelleVoie2Etablissement,codePostal2Etablissement,libelleCommune2Etablissement,libelleCommuneEtranger2Etablissement,distributionSpeciale2Etablissement,codeCommune2Etablissement,codeCedex2Etablissement,libelleCedex2Etablissement,codePaysEtranger2Etablissement,libellePaysEtranger2Etablissement,dateDebut,etatAdministratifEtablissement,enseigne1Etablissement,enseigne2Etablissement,enseigne3Etablissement,denominationUsuelleEtablissement,activitePrincipaleEtablissement,nomenclatureActivitePrincipaleEtablissement,caractereEmployeurEtablissement,longitude,latitude,geo_score,geo_type,geo_adresse,geo_id,geo_ligne,geo_l4,geo_l5
038690046,00016,03869004600016,O,1995-12-25,NN,,,2010-04-18T03:01:27,true,3,RIS REP PAR,,,CHE,DAMILAVILLE,76790,ETRETAT,,,76254,,,,,,,,,,,,,,,,,,,2008-03-31,A,,,,,81.10Z,NAFRev2,N,0.214627,49.709932,0.77,street,Impasse Damilaville 76790 Étretat,76254_0221,G,IMPASSE DAMILAVILLE,
039366737,00011,03936673700011,O,1995-12-25,NN,,,2008-01-04T18:03:06,true,2,UR PHILIPPE,,,CHE,DAMILAVILLE,76790,ETRETAT,,,76254,,,,,,,,,,,,,,,,,,,2008-01-01,A,,,,,81.10Z,NAFRev2,N,0.214627,49.709932,0.77,street,Impasse Damilaville 76790 Étretat,76254_0221,G,IMPASSE DAMILAVILLE,
041688771,00017,04168877100017,O,1994-12-25,NN,,,2015-05-05T04:35:47,true,3,,,,BD,RENE COTY,76790,ETRETAT,,,76254,,,,,,,,,,,,,,,,,,,2011-12-31,A,,,,,81.10Z,NAFRev2,N,0.203452,49.708404,0.72,street,Boulevard Président René Coty 76790 Étretat,76254_0770,G,BOULEVARD PRESIDENT RENE COTY,
217602549,00016,21760254900016,O,1983-03-01,12,2020,,2022-08-29T09:08:52,true,4,,,,PL,MAURICE GUILLARD,76790,ETRETAT,,,76254,,,,,,,,,,,,,,,,,,,2008-01-01,A,MAIRIE,,,,84.11Z,NAFRev2,O,0.205603,49.70761,0.85,street,Place Maurice Guillard 76790 Étretat,76254_0645,G,PLACE MAURICE GUILLARD,
217602549,00024,21760254900024,O,1983-03-16,01,2020,,2022-08-29T09:08:52,false,3,,,,RUE,GUY DE MAUPASSANT,76790,ETRETAT,,,76254,,,,,,,,,,,,,,,,,,,2008-01-01,A,CAMPING MUNICIPAL,,,,55.30Z,NAFRev2,N,0.210836,49.703509,0.96,street,Rue Guy de Maupassant 76790 Étretat,76254_0460,G,RUE GUY DE MAUPASSANT,
217602549,00032,21760254900032,O,1983-12-21,02,2020,,2022-08-29T09:08:52,false,4,,44,,RUE,GUY DE MAUPASSANT,76790,ETRETAT,,,76254,,,,,,,,,,,,,,,,,,,2020-12-25,A,ECOLE ELEMENTAIRE PUBLIQUE ROSE DUCHEMIN,,,,85.20Z,NAFRev2,N,0.209449,49.704322,0.96,housenumber,44 Rue Guy de Maupassant 76790 Étretat,76254_0460_00044,G,44 RUE GUY DE MAUPASSANT,
217602549,00040,21760254900040,O,1983-12-21,01,2020,,2022-08-29T09:08:52,false,4,,4,,RUE,DES ECOLES,76790,ETRETAT,,,76254,,,,,,,,,,,,,,,,,,,2022-05-11,A,ECOLE MATERNELLE PUBLIQUE LA SIRENE,,,,85.10Z,NAFRev2,N,0.208954,49.704054,0.95,housenumber,4 Rue des Ecoles 76790 Étretat,76254_0320_00004,G,4 RUE DES ECOLES,
217602549,00057,21760254900057,O,1995-12-25,NN,,,2018-01-09T15:28:54,false,3,MAIRIE,,,PL,GUILLARD,76790,ETRETAT,,,76254,,,,,,,,,,,,,,,,,,,2017-10-31,F,SERVICE EAU ET ASSAINISSEMENT,,,,84.12Z,NAFRev2,N,0.205603,49.70761,0.77,street,Place Maurice Guillard 76790 Étretat,76254_0645,G,PLACE MAURICE GUILLARD,
217602549,00065,21760254900065,O,1998-04-21,NN,,,2010-06-30T12:21:09,false,4,MAIRIE,,,PL,MAURICE GUILLARD,76790,ETRETAT,,,76254,,,,,,,,,,,,,,,,,,,2010-06-29,F,REGIE MUNICIPALE POMPES FUNEBRES,,,,96.03Z,NAFRev2,N,0.205603,49.70761,0.85,street,Place Maurice Guillard 76790 Étretat,76254_0645,G,PLACE MAURICE GUILLARD,
217602549,00081,21760254900081,O,2014-10-01,01,2020,,2022-08-29T09:08:52,false,1,,,,PL,MAURICE GUILLARD,76790,ETRETAT,,,76254,,,,,,,,,,,,,,,,,,,2014-10-01,A,LE CLOS LUPIN,,,,91.02Z,NAFRev2,O,0.205603,49.70761,0.85,street,Place Maurice Guillard 76790 Étretat,76254_0645,G,PLACE MAURICE GUILLARD,
227605409,00068,22760540900068,O,1967-07-01,NN,,,,false,4,,,,,,76790,ETRETAT,,,76254,,,,,,,,,,,,,,,,,,,1996-12-25,F,FOYER DU TILLEUL,,,,85.3B,NAF1993,N,,,0,,,,,,
257604645,00016,25760464500016,O,2001-01-22,NN,,,2014-06-13T23:44:07,false,4,MAIRIE,,,PL,MAURICE GUILLARD,76790,ETRETAT,,,76254,,,,,,,,,,,,,,,,,,,2012-01-18,F,,,,,84.13Z,NAFRev2,O,0.205603,49.70761,0.85,street,Place Maurice Guillard 76790 Étretat,76254_0645,G,PLACE MAURICE GUILLARD,
267600815,00018,26760081500018,O,1983-03-01,NN,,,2018-09-29T12:08:41,true,4,,,,RUE,GUY DE MAUPASSANT,76790,ETRETAT,,,76254,,,,,,,,,,,,,,,,,,,2008-01-01,A,CCAS,,,,88.99B,NAFRev2,O,0.210836,49.703509,0.96,street,Rue Guy de Maupassant 76790 Étretat,76254_0460,G,RUE GUY DE MAUPASSANT,
267600815,00026,26760081500026,O,1985-01-01,03,2020,,2022-08-29T09:10:43,false,5,,,,RUE,GUY DE MAUPASSANT,76790,ETRETAT,,,76254,,,,,,,,,,,,,,,,,,,2017-12-25,A,RESIDENCE GERMAINE COTY,,,,87.30A,NAFRev2,O,0.210836,49.703509,0.96,street,Rue Guy de Maupassant 76790 Étretat,76254_0460,G,RUE GUY DE MAUPASSANT,
300432317,00018,30043231700018,O,,NN,,,,true,1,,,,RUE,DES ECOLES,76790,ETRETAT,,,76254,,,,,,,,,,,,,,,,,,,1985-04-16,F,,,,,81.11,NAP,N,0.209688,49.703232,0.95,street,Rue des Ecoles 76790 Étretat,76254_0320,G,RUE DES ECOLES,
301567285,00012,30156728500012,O,1975-01-01,NN,,,2007-05-19T08:30:37,true,3,,,,RUE,A BOISSAYE,76790,ETRETAT,,,76254,,,,,,,,,,,,,,,,,,,2005-12-21,F,,,,,52.4W,NAFRev1,N,0.202467,49.708203,0.82,street,Rue Adolphe Boissaye 76790 Étretat,76254_0040,G,RUE ADOLPHE BOISSAYE,
301689618,00017,30168961800017,O,,,,,,true,1,,1,,BD,DU PRESIDENT COTY,76790,ETRETAT,,,76254,,,,,,,,,,,,,,,,,,,,F,,,,,67.09,NAP,N,0.203641,49.708227,0.66,housenumber,1 Boulevard Président René Coty 76790 Étretat,76254_0770_00001,G,1 BOULEVARD PRESIDENT RENE COTY,
302326970,00019,30232697000019,O,1965-01-01,NN,,,2008-11-07T00:18:23,true,3,,33,,RUE,ALPHONSE KARR,76790,ETRETAT,,,76254,,,,,,,,,,,,,,,,,,,2007-09-30,F,,,,,93.0D,NAFRev1,N,0.202768,49.707267,0.96,housenumber,33 Rue Alphonse Karr 76790 Étretat,76254_0060_00033,G,33 RUE ALPHONSE KARR,
302327309,00019,30232730900019,O,,NN,,,,true,1,,,,BD,RENE COTY,76790,ETRETAT,,,76254,,,,,,,,,,,,,,,,,,,1996-12-19,F,,,,,52.4Z,NAF1993,N,0.203452,49.708404,0.72,street,Boulevard Président René Coty 76790 Étretat,76254_0770,G,BOULEVARD PRESIDENT RENE COTY,
302385257,00019,30238525700019,O,1974-01-01,,,,,true,1,,49,,RUE,ALPHONSE KARR,76790,ETRETAT,,,76254,,,,,,,,,,,,,,,,,,,1999-11-04,F,,,,,70.2C,NAF1993,N,0.20209,49.707472,0.96,housenumber,49 Rue Alphonse Karr 76790 Étretat,76254_0060_00049,G,49 RUE ALPHONSE KARR,
302404702,00011,30240470200011,O,,,,,,true,1,,27,,RUE,ALPHONSE KARR,76790,ETRETAT,,,76254,,,,,,,,,,,,,,,,,,,,F,,,,,64.11,NAP,N,0.202943,49.707215,0.96,housenumber,27 Rue Alphonse Karr 76790 Étretat,76254_0060_00027,G,27 RUE ALPHONSE KARR,
302404744,00013,30240474400013,O,,,,,,true,1,,,,PL,VICTOR HUGO,76790,ETRETAT,,,76254,,,,,,,,,,,,,,,,,,,1984-12-25,F,,,,,64.13,NAP,N,0.203332,49.709046,0.82,street,Place Victor Hugo 76790 Étretat,76254_0920,G,PLACE VICTOR HUGO,
302634365,00019,30263436500019,O,1975-01-01,,,,,true,1,,5,,RUE,ALPHONSE KARR,76790,ETRETAT,,,76254,,,,,,,,,,,,,,,,,,,1999-06-30,F,,,,,52.4X,NAF1993,N,0.204292,49.7067,0.96,housenumber,5 Rue Alphonse Karr 76790 Étretat,76254_0060_00005,G,5 RUE ALPHONSE KARR,
303643316,00019,30364331600019,O,1975-01-01,NN,,1413ZD,2014-06-27T00:10:34,true,3,,52,,RUE,MARTIN VATINEL,76790,ETRETAT,,,76254,,,,,,,,,,,,,,,,,,,2008-01-01,A,,,,,13.30Z,NAFRev2,N,0.203473,49.708135,0.95,housenumber,52 Rue Martin Vatinel 76790 Étretat,76254_0620_00052,G,52 RUE MARTIN VATINEL,
303931562,00019,30393156200019,O,,,,,,true,1,,2,,AV,GEORGES 5,76790,ETRETAT,,,76254,,,,,,,,,,,,,,,,,,,1984-12-25,F,,,,,65.02,NAP,N,0.205261,49.707005,0.59,housenumber,2 Avenue George V 76790 Étretat,76254_0420_00002,G,2 AVENUE GEORGE V,
303937544,00011,30393754400011,O,1991-01-12,NN,,,2016-04-26T01:44:53,true,5,,11,,RUE,TRAZ PERIER,76790,ETRETAT,,,76254,,,,,,,,,,,,,,,,,,,2012-02-01,A,L'EFFET MER,,,L'EFFET MER,56.10A,NAFRev2,O,0.201395,49.707178,0.94,housenumber,11 Rue de Traz Périer 76790 Étretat,76254_0900_00011,G,11 RUE DE TRAZ PERIER,
303937544,00029,30393754400029,O,1991-07-04,NN,,,,false,4,,35,,AV,GEORGES V,76790,ETRETAT,,,76254,,,,,,,,,,,,,,,,,,,2002-08-19,F,HOTEL D ANGLETERRE,,,,55.1A,NAF1993,N,0.203546,49.706059,0.67,housenumber,35 Avenue George V 76790 Étretat,76254_0420_00035,G,35 AVENUE GEORGE V,
303937544,00052,30393754400052,O,2000-02-05,,,,,false,3,,6,,AV,GEORGE 5,76790,ETRETAT,,,76254,,,,,,,,,,,,,,,,,,,2003-03-18,F,,,,,55.1A,NAFRev1,N,0.205008,49.706809,0.69,housenumber,6 Avenue George V 76790 Étretat,76254_0420_00006,G,6 AVENUE GEORGE V,
303937544,00060,30393754400060,O,2000-09-15,NN,,,2008-01-04T19:27:51,false,3,VILLA BLIGNY,5,,AV,DE VERDUN,76790,ETRETAT,,,76254,,,,,,,,,,,,,,,,,,,2008-01-01,A,L'HUITRIERE,,,,55.10Z,NAFRev2,N,0.206467,49.707483,0.83,housenumber,5 Avenue de Verdun 76790 Étretat,76254_0910_00005,G,5 AVENUE DE VERDUN,
304377393,00018,30437739300018,O,1976-01-01,,,,2006-12-15T00:15:34,false,4,,4,,PL,FOCH,76790,ETRETAT,,,76254,,,,,,,,,,,,,,,,,,,2004-09-30,F,,,,,55.3A,NAFRev1,N,0.204021,49.707795,0.64,street,Place Maréchal Foch 76790 Étretat,76254_0600,G,PLACE MARECHAL FOCH,
304377393,00034,30437739300034,O,2004-09-30,NN,,,2008-01-04T19:29:56,true,3,,8,,RUE,ABBE COCHET,76790,ETRETAT,,,76254,,,,,,,,,,,,,,,,,,,2008-01-01,A,,,,,68.20B,NAFRev2,N,0.205276,49.707389,0.95,housenumber,8 Rue Abbé Cochet 76790 Étretat,76254_0020_00008,G,8 RUE ABBE COCHET,
304594252,00013,30459425200013,O,,,,,,true,1,,9,,AV,GEORGES 5,76790,ETRETAT,,,76254,,,,,,,,,,,,,,,,,,,1985-12-25,F,,,,,67.09,NAP,N,0.205074,49.70675,0.59,housenumber,9 Avenue George V 76790 Étretat,76254_0420_00009,G,9 AVENUE GEORGE V,
304836554,00044,30483655400044,O,1996-06-01,NN,,,,true,1,,90,A,,MAUPASSANT,76790,ETRETAT,,,76254,,,,,,,,,,,,,,,,,,,2001-09-30,F,,,,,70.2A,NAF1993,N,0.214911,49.700476,0.88,housenumber,90a Rue Guy de Maupassant 76790 Étretat,76254_0460_00090_a,G,90A RUE GUY DE MAUPASSANT,
305358798,00018,30535879800018,O,1975-01-01,NN,,,2007-05-19T08:37:42,true,4,,12,,RUE,ALPHONSE KHARR,76790,ETRETAT,,,76254,,,,,,,,,,,,,,,,,,,2005-11-30,F,,,,,55.1A,NAFRev1,O,0.20359,49.707064,0.84,housenumber,12 Rue Alphonse Karr 76790 Étretat,76254_0060_00012,G,12 RUE ALPHONSE KARR,
305992331,00010,30599233100010,O,,,,,,true,1,,6,,AV,GEORGE 5,76790,ETRETAT,,,76254,,,,,,,,,,,,,,,,,,,1990-01-31,F,,,,,67.08,NAP,N,0.205008,49.706809,0.69,housenumber,6 Avenue George V 76790 Étretat,76254_0420_00006,G,6 AVENUE GEORGE V,
305992497,00019,30599249700019,O,,,,,,true,1,,,,,,76790,ETRETAT,,,76254,,,,,,,,,,,,,,,,,,,1984-12-25,F,,,,,,,N,,,0,,,,,,
306572793,00017,30657279300017,O,1900-01-01,,,,2012-06-11T08:23:20,false,3,,41,,RUE,ALPHONSE KARR,76790,ETRETAT,,,76254,,,,,,,,,,,,,,,,,,,1999-04-01,F,,,,,70.2C,NAF1993,N,0.20237,49.707379,0.96,housenumber,41 Rue Alphonse Karr 76790 Étretat,76254_0060_00041,G,41 RUE ALPHONSE KARR,
307595413,00013,30759541300013,O,,NN,,,,true,1,,15,,RUE,GEORGEV,76790,ETRETAT,,,76254,,,,,,,,,,,,,,,,,,,1991-11-15,F,,,,,64.11,NAP,N,0.203751,49.708822,0.62,street,Rue Georges Bureau 76790 Étretat,76254_0440,G,RUE GEORGES BUREAU,
307682427,00017,30768242700017,O,,,,,,true,1,,,,PL,DU MARECHAL FOCH,76790,ETRETAT,,,76254,,,,,,,,,,,,,,,,,,,1989-08-31,F,,,,,67.01,NAP,N,0.204021,49.707795,0.71,street,Place Maréchal Foch 76790 Étretat,76254_0600,G,PLACE MARECHAL FOCH,
307682799,00019,30768279900019,O,,NN,,,,true,1,,1,,BD,DU PRESIDENT RENE COTY,76790,ETRETAT,,,76254,,,,,,,,,,,,,,,,,,,,F,,,,,67.09,NAP,N,0.203641,49.708227,0.75,housenumber,1 Boulevard Président René Coty 76790 Étretat,76254_0770_00001,G,1 BOULEVARD PRESIDENT RENE COTY,
309266005,00029,30926600500029,O,1972-03-17,NN,,,2009-04-28T06:02:17,true,4,ETRETAT,1,,ALL,AUGENE LE POTTEVIN,76790,ETRETAT,,,76254,,,,,,,,,,,,,,,,,,,2008-11-10,F,,,,,68.20A,NAFRev2,N,0.205162,49.708675,0.66,housenumber,1 Avenue Eugène Le Poittevin 76790 Étretat,76254_0330_00001,G,1 AVENUE EUGENE LE POITTEVIN,
309303188,00028,30930318800028,O,,,,,,true,1,,40,,RUE,NOTRE DAME,76790,ETRETAT,,,76254,,,,,,,,,,,,,,,,,,,1988-03-04,F,,,,,49.04,NAP,N,0.204723,49.708281,0.96,housenumber,40 Rue Notre-Dame 76790 Étretat,76254_0680_00040,G,40 RUE NOTRE DAME,
309619492,00015,30961949200015,O,1977-01-01,NN,,,,true,1,,8,,RUE,ADOLPHE BOISSAYE,76790,ETRETAT,,,76254,,,,,,,,,,,,,,,,,,,2000-12-15,F,,,,,55.3B,NAF1993,O,0.202288,49.708069,0.95,housenumber,8 Rue Adolphe Boissaye 76790 Étretat,76254_0040_00008,G,8 RUE ADOLPHE BOISSAYE,
309640209,00016,30964020900016,O,1977-01-01,NN,,,,true,1,,15,,RUE,ALPHONSE KARR,76790,ETRETAT,,,76254,,,,,,,,,,,,,,,,,,,1998-04-30,F,,,,,93.0D,NAF1993,O,0.203773,49.706926,0.96,housenumber,15 Rue Alphonse Karr 76790 Étretat,76254_0060_00015,G,15 RUE ALPHONSE KARR,
309750602,00026,30975060200026,O,,NN,,,,true,1,,38,,RUE,ALPHONSE KARR,76790,ETRETAT,,,76254,,,,,,,,,,,,,,,,,,,1989-06-30,F,,,,,64.11,NAP,N,0.202226,49.707502,0.96,housenumber,38 Rue Alphonse Karr 76790 Étretat,76254_0060_00038,G,38 RUE ALPHONSE KARR,
309901650,00031,30990165000031,O,1996-01-01,NN,,,,true,1,,3,B,RUE,DOCTEUR FIDELIN,76790,ETRETAT,,,76254,,,,,,,,,,,,,,,,,,,2001-11-17,F,,,,,70.2C,NAF1993,N,0.203546,49.70738,0.79,housenumber,3bis Rue des Docteurs Fidelin 76790 Étretat,76254_0280_00003_bis,G,3BIS RUE DES DOCTEURS FIDELIN,
310973821,00021,31097382100021,O,1900-01-01,,,,2006-10-27T00:28:18,true,4,,9,,AV,DE VERDUN,76790,ETRETAT,,,76254,,,,,,,,,,,,,,,,,,,2004-05-31,F,,,,,70.2C,NAFRev1,N,0.207024,49.707698,0.83,housenumber,9 Avenue de Verdun 76790 Étretat,76254_0910_00009,G,9 AVENUE DE VERDUN,
311272140,00014,31127214000014,O,,NN,,,,true,1,,44,,RUE,ALPHONSE KARR,76790,ETRETAT,,,76254,,,,,,,,,,,,,,,,,,,1990-12-31,F,,,,,64.25,NAP,N,0.201974,49.707589,0.96,housenumber,44 Rue Alphonse Karr 76790 Étretat,76254_0060_00044,G,44 RUE ALPHONSE KARR,
311399851,00022,31139985100022,O,,NN,,,,true,1,,44,B,RUE,ALPHONSE KARR,76790,ETRETAT,,,76254,,,,,,,,,,,,,,,,,,,2001-12-31,F,,,,,55.3A,NAF1993,N,0.201916,49.707614,0.87,housenumber,44bis Rue Alphonse Karr 76790 Étretat,76254_0060_00044_bis,G,44BIS RUE ALPHONSE KARR,
312040876,00012,31204087600012,O,1978-01-01,NN,,,2006-12-15T00:17:35,false,3,,,,RUE,GENERAL LECLERC,76790,ETRETAT,,,76254,,,,,,,,,,,,,,,,,,,2000-12-30,F,,,,,55.3A,NAF1993,,0.202051,49.708089,0.94,street,Rue Général Leclerc 76790 Étretat,76254_0400,G,RUE GENERAL LECLERC,
312040876,00020,31204087600020,O,2003-04-04,NN,,,2017-05-04T02:22:04,true,6,,,,RUE,MONGE,76790,ETRETAT,,,76254,,,,,,,,,,,,,,,,,,,2015-09-02,F,,,,,47.78C,NAFRev2,O,0.204779,49.707588,0.95,street,Rue Monge 76790 Étretat,76254_0660,G,RUE MONGE,
312258627,00016,31225862700016,O,1966-01-01,NN,,,2008-01-04T20:13:10,true,6,,23,,AV,GEORGE 5,76790,ETRETAT,,,76254,,,,,,1,,RUE,ALPHONSE KARR,76790,ETRETAT,,,76254,,,,,2008-01-01,A,,,,,68.20B,NAFRev2,N,0.204566,49.706531,0.71,housenumber,23 Avenue George V 76790 Étretat,76254_0420_00023,G,23 AVENUE GEORGE V,
312824311,00012,31282431100012,O,,NN,,,,true,1,,,,RUE,ANICET BOURGEOIS,76790,ETRETAT,,,76254,,,,,,,,,,,,,,,,,,,,F,,,,,66.02,NAP,N,0.203212,49.706476,0.95,street,Rue Anicet Bourgeois 76790 Étretat,76254_0080,G,RUE ANICET BOURGEOIS,
313101362,00025,31310136200025,O,1900-01-01,NN,,,2011-04-28T00:14:22,false,3,,21,,RUE,NOTRE DAME,76790,ETRETAT,,,76254,,,,,,,,,,,,,,,,,,,1986-12-05,F,,,,,,,N,0.206428,49.708219,0.96,housenumber,21 Rue Notre-Dame 76790 Étretat,76254_0680_00021,G,21 RUE NOTRE DAME,
313101990,00023,31310199000023,O,1980-12-01,NN,,,,false,5,,55,,RUE,NOTRE DAME,76790,ETRETAT,,,76254,,,,,,,,,,,,,,,,,,,2001-12-25,F,,,,,70.2C,NAF1993,O,0.204393,49.708154,0.96,housenumber,55 Rue Notre-Dame 76790 Étretat,76254_0680_00055,G,55 RUE NOTRE DAME,
313101990,00064,31310199000064,O,2008-03-14,NN,,,2010-04-18T03:39:55,false,1,,40,,RUE,NOTRE DAME,76790,ETRETAT,,,76254,,,,,,,,,,,,,,,,,,,2008-03-14,A,,,,,43.34Z,NAFRev2,O,0.204723,49.708281,0.96,housenumber,40 Rue Notre-Dame 76790 Étretat,76254_0680_00040,G,40 RUE NOTRE DAME,
313295602,00103,31329560200103,O,2014-04-01,,,,2014-05-21T10:12:51,false,2,,27,B,RUE,ALPHONSE KARR,76790,ETRETAT,,,76254,,,,,,,,,,,,,,,,,,,2014-05-02,F,WEEK-END FRUITS,,,,47.11B,NAFRev2,N,0.203005,49.707206,0.87,housenumber,27bis Rue Alphonse Karr 76790 Étretat,76254_0060_00027_bis,G,27BIS RUE ALPHONSE KARR,
313494940,00015,31349494000015,O,,NN,,,,true,1,,,,RUE,DES ECOLES,76790,ETRETAT,,,76254,,,,,,,,,,,,,,,,,,,,F,,,,,55.10,NAP,N,0.209688,49.703232,0.95,street,Rue des Ecoles 76790 Étretat,76254_0320,G,RUE DES ECOLES,
313791717,00017,31379171700017,O,,,,,,true,1,,14,,AV,GEORGES 5,76790,ETRETAT,,,76254,,,,,,,,,,,,,,,,,,,1992-06-15,F,,,,,50.1Z,NAF1993,N,0.204186,49.706458,0.61,housenumber,14 Avenue George V 76790 Étretat,76254_0420_00014,G,14 AVENUE GEORGE V,
314015819,00019,31401581900019,O,1978-01-01,NN,,,2020-12-13T03:38:23,true,5,,,,CHE,DE SAINT CLAIR,76790,ETRETAT,,,76254,,,,,,,,,,,,,,,,,,,2011-10-01,F,,,,,68.20B,NAFRev2,N,0.212082,49.706694,0.85,street,Chemin de Saint-Clair 76790 Étretat,76254_0840,G,CHEMIN DE SAINT CLAIR,
314022955,00012,31402295500012,O,1978-01-01,,,,2008-12-18T04:09:38,true,5,,14,,AV,GEORGE V,76790,ETRETAT,,,76254,,,,,,,,,,,,,,,,,,,2008-12-31,F,,,,,45.11Z,NAFRev2,N,0.204186,49.706458,0.83,housenumber,14 Avenue George V 76790 Étretat,76254_0420_00014,G,14 AVENUE GEORGE V,
314023078,00012,31402307800012,O,1900-01-01,NN,,,2006-12-15T00:18:11,false,4,,14,,AV,GEORGE V,76790,ETRETAT,,,76254,,,,,,,,,,,,,,,,,,,1992-05-14,F,,,,,50.1Z,NAF1993,N,0.204186,49.706458,0.83,housenumber,14 Avenue George V 76790 Étretat,76254_0420_00014,G,14 AVENUE GEORGE V,
314099409,00091,31409940900091,O,2000-01-01,NN,,,2006-10-27T00:40:56,false,3,,29,,,ALPHONSE KARR,76790,ETRETAT,,,76254,,,,,,,,,,,,,,,,,,,2004-07-16,F,,,,,52.6E,NAFRev1,N,0.202896,49.707228,0.9,housenumber,29 Rue Alphonse Karr 76790 Étretat,76254_0060_00029,G,29 RUE ALPHONSE KARR,
314099409,00109,31409940900109,O,2006-08-01,,,,2021-02-23T10:40:27,true,2,,29,,RUE,A KAAR,76790,ETRETAT,,,76254,,,,,,,,,,,,,,,,,,,2008-01-01,A,LA FRITERIE,,,,47.81Z,NAFRev2,N,0.202896,49.707228,0.63,housenumber,29 Rue Alphonse Karr 76790 Étretat,76254_0060_00029,G,29 RUE ALPHONSE KARR,
315142489,00022,31514248900022,O,1988-05-12,NN,,3213ZZ,2015-03-17T00:13:38,false,3,,29,,RUE,ALPHONSE KARR,76790,ETRETAT,,,76254,,,,,,,,,,,,,,,,,,,1990-05-12,F,,,,,36.6A,NAF1993,N,0.202896,49.707228,0.96,housenumber,29 Rue Alphonse Karr 76790 Étretat,76254_0060_00029,G,29 RUE ALPHONSE KARR,
315142489,00030,31514248900030,O,1990-05-12,,,3213ZZ,2023-05-24T11:08:20,true,3,,4,,BD,PRESIDENT RENE COTY,76790,ETRETAT,,,76254,,,,,,,,,,,,,,,,,,,2022-12-22,F,,,,,32.13Z,NAFRev2,N,0.203494,49.708489,0.87,housenumber,4 Boulevard Président René Coty 76790 Étretat,76254_0770_00004,G,4 BOULEVARD PRESIDENT RENE COTY,
315170134,00011,31517013400011,O,,,,,,true,1,,9,,RUE,PROSPERE BRINDEJONT,76790,ETRETAT,,,76254,,,,,,,,,,,,,,,,,,,1985-12-25,F,,,,,69.23,NAP,N,0.204337,49.707254,0.86,housenumber,9 Rue Prosper Brindejont 76790 Étretat,76254_0800_00009,G,9 RUE PROSPER BRINDEJONT,
316378058,00010,31637805800010,O,1979-01-01,NN,,,2007-05-19T08:57:43,true,4,,25,,AV,GEORGE 5,76790,ETRETAT,,,76254,,,,,,,,,,,,,,,,,,,2006-01-31,F,,,,,50.2Z,NAFRev1,O,0.204323,49.706429,0.71,housenumber,25 Avenue George V 76790 Étretat,76254_0420_00025,G,25 AVENUE GEORGE V,
317850998,00012,31785099800012,O,1971-01-01,NN,,,2014-06-14T00:54:12,true,9,,,,RUE,ADOLPHE BOISSAYE,76790,ETRETAT,,,76254,,,,,,,,,,,,,,,,,,,2012-09-30,F,,,,,96.02A,NAFRev2,O,0.202467,49.708203,0.95,street,Rue Adolphe Boissaye 76790 Étretat,76254_0040,G,RUE ADOLPHE BOISSAYE,
318810199,00014,31881019900014,O,1900-01-01,NN,,,2011-12-09T11:34:09,true,3,,7,,RUE,ANICET BOURGEOIS,76790,ETRETAT,,,76254,,,,,,,,,,,,,,,,,,,1985-03-31,F,,,,,52.6E,NAF1993,N,0.202945,49.7067,0.95,housenumber,7 Rue Anicet Bourgeois 76790 Étretat,76254_0080_00007,G,7 RUE ANICET BOURGEOIS,
318840238,00014,31884023800014,O,1980-04-01,NN,,,2008-11-07T00:34:39,false,2,,4,,AV,GEORGES 5,76790,ETRETAT,,,76254,,,,,,,,,,,,,,,,,,,1993-05-13,F,,,,,,,,0.205096,49.70685,0.59,housenumber,4 Avenue George V 76790 Étretat,76254_0420_00004,G,4 AVENUE GEORGE V,
318840238,00048,31884023800048,O,2015-01-05,,,,2019-05-22T03:56:56,true,2,ET 1 RUE DES DOCTEURS FIDELIN,1,A,CRS,TURIN,76790,ETRETAT,,,76254,,,,,,,,,,,,,,,,,,,2018-12-31,F,,,,,55.20Z,NAFRev2,N,0.203336,49.707268,0.68,housenumber,1 Rue des Docteurs Fidelin 76790 Étretat,76254_0280_00001,D,1 RUE DES DOCTEURS FIDELIN,
318977501,00010,31897750100010,O,1980-02-01,,,,,false,3,,7,,RUE,ALPHONSE KARR,76790,ETRETAT,,BP 1,76254,,,,,,,,,,,,,,,,,,,1993-12-25,F,,,,,52.3A,NAF1993,N,0.204217,49.706735,0.96,housenumber,7 Rue Alphonse Karr 76790 Étretat,76254_0060_00007,G,7 RUE ALPHONSE KARR,
318977501,00028,31897750100028,O,1992-04-21,NN,,,2006-10-27T01:02:11,true,4,,2,,AV,GEORGE 5,76790,ETRETAT,,,76254,,,,,,,,,,,,,,,,,,,2004-10-01,F,,,,,52.3A,NAFRev1,O,0.205261,49.707005,0.69,housenumber,2 Avenue George V 76790 Étretat,76254_0420_00002,G,2 AVENUE GEORGE V,
319180782,00017,31918078200017,O,1969-08-29,NN,,,2021-12-11T08:32:30,true,5,IMMEUBLE LE BEAU SITE,22,,RUE,PROSPER BRINDEJONT,76790,ETRETAT,,,76254,,,,,,,,,,,,,,,,,,,2019-02-28,A,,,,,68.20A,NAFRev2,N,0.203938,49.70739,0.95,housenumber,22 Rue Prosper Brindejont 76790 Étretat,76254_0800_00022,G,22 RUE PROSPER BRINDEJONT,
319186250,00019,31918625000019,O,,,,,,true,1,,,,BD,RENE COTY,76790,ETRETAT,,,76254,,,,,,,,,,,,,,,,,,,1984-12-25,F,,,,,67.09,NAP,N,0.203452,49.708404,0.72,street,Boulevard Président René Coty 76790 Étretat,76254_0770,G,BOULEVARD PRESIDENT RENE COTY,
319390209,00033,31939020900033,O,1987-04-01,NN,,,2013-08-09T03:46:15,true,4,,12,,AV,/GEORGE/5,76790,ETRETAT,,,76254,,,,,,,,,,,,,,,,,,,2012-12-31,F,,,,,43.12A,NAFRev2,N,0.204396,49.706537,0.71,housenumber,12 Avenue George V 76790 Étretat,76254_0420_00012,G,12 AVENUE GEORGE V,
319720439,00011,31972043900011,O,1980-04-01,NN,,,2008-01-04T18:05:44,true,3,,,,CHE,DU PETIT VALAINE,76790,ETRETAT,,,76254,,,,,,,,,,,,,,,,,,,2008-01-01,A,,,,,68.20B,NAFRev2,N,0.199384,49.703715,0.85,street,Chemin du Petit Valaine 76790 Étretat,76254_0772,G,CHEMIN DU PETIT VALAINE,
320682354,00040,32068235400040,O,1900-01-01,NN,,,2011-04-28T00:18:36,false,3,,,,,MARCHE COUVERT,76790,ETRETAT,,,76254,,,,,,,,,,,,,,,,,,,1992-12-25,F,,,,,52.4Z,NAF1993,N,2.933293,45.053608,0.9,poi.community_centre,Marché Couvert (Salle des fêtes) Valuéjols,https://osm.org/way/223911272,G,,
321039893,00011,32103989300011,O,1981-01-01,NN,,,2011-04-27T08:05:33,true,4,,17,,RUE,TRAZ PERIER,76790,ETRETAT,,,76254,,,,,,,,,,,,,,,,,,,2011-03-31,F,,,,,47.78C,NAFRev2,N,0.201202,49.707249,0.94,housenumber,17 Rue de Traz Périer 76790 Étretat,76254_0900_00017,G,17 RUE DE TRAZ PERIER,
321478703,00036,32147870300036,O,,NN,,,,true,1,,,,RUE,GUY DE MAUPASSANT,76790,ETRETAT,,,76254,,,,,,,,,,,,,,,,,,,,F,,,,,87.06,NAP,N,0.210836,49.703509,0.96,street,Rue Guy de Maupassant 76790 Étretat,76254_0460,G,RUE GUY DE MAUPASSANT,
322619107,00012,32261910700012,O,,,,,,true,1,,,,PL,VICTOR HUGO,76790,ETRETAT,,,76254,,,,,,,,,,,,,,,,,,,1985-12-25,F,,,,,62.43,NAP,N,0.203332,49.709046,0.82,street,Place Victor Hugo 76790 Étretat,76254_0920,G,PLACE VICTOR HUGO,
322741448,00037,32274144800037,O,2002-01-01,NN,,,2008-01-04T18:38:51,true,3,,16,B,RUE,RENE TOURETOT,76790,ETRETAT,,,76254,,,,,,,,,,,,,,,,,,,2008-01-01,A,,,,,55.20Z,NAFRev2,N,0.213009,49.70052,0.74,housenumber,16bis Rue René Tonnetot 76790 Étretat,76254_0830_00016_bis,G,16BIS RUE RENE TONNETOT,