siren,nic,siret,statutDiffusionEtablissement,dateCreationEtablissement,trancheEffectifsEtablissement,anneeEffectifsEtablissement,activitePrincipaleRegistreMetiersEtablissement,dateDernierTraitementEtablissement,etablissementSiege,nombrePeriodesEtablissement,complementAdresseEtablissement,numeroVoieEtablissement,indiceRepetitionEtablissement,typeVoieEtablissement,libelleVoieEtablissement,codePostalEtablissement,libelleCommuneEtablissement,libelleCommuneEtrangerEtablissement,distributionSpecialeEtablissement,codeCommuneEtablissement,codeCedexEtablissement,libelleCedexEtablissement,codePaysEtrangerEtablissement,libellePaysEtrangerEtablissement,complementAdresse2Etablissement,numeroVoie2Etablissement,indiceRepetition2Etablissement,typeVoie2Etablissement,libelleVoie2Etablissement,codePostal2Etablissement,libelleCommune2Etablissement,libelleCommuneEtranger2Etablissement,distributionSpeciale2Etablissement,codeCommune2Etablissement,codeCedex2Etablissement,libelleCedex2Etablissement,codePaysEtranger2Etablissement,libellePaysEtranger2Etablissement,dateDebut,etatAdministratifEtablissement,enseigne1Etablissement,enseigne2Etablissement,enseigne3Etablissement,denominationUsuelleEtablissement,activitePrincipaleEtablissement,nomenclatureActivitePrincipaleEtablissement,caractereEmployeurEtablissement,longitude,latitude,geo_score,geo_type,geo_adresse,geo_id,geo_ligne,geo_l4,geo_l5
217700236,00011,21770023600011,O,1983-03-01,02,2020,,2022-08-29T09:08:56,true,4,,7,,,RUELLE DU CURE,77910,BARCY,,,77023,,,,,,,,,,,,,,,,,,,2008-01-01,A,MAIRIE,,,,84.11Z,NAFRev2,O,2.880827,49.017209,0.94,street,Ruelle du Curé 77910 Barcy,77023_0060,G,RUELLE DU CURE,
217700236,00029,21770023600029,O,1983-12-21,01,2020,,2022-08-29T09:08:56,false,3,,,,RUE,DE L'ECOLE,77910,BARCY,,,77023,,,,,,,,,,,,,,,,,,,2008-01-01,A,ECOLE ELEMENTAIRE PUBLIQUE,,,,85.20Z,NAFRev2,N,2.881702,49.017134,0.45,street,Rue de Meaux 77910 Barcy,77023_0120,G,RUE DE MEAUX,
257700203,00017,25770020300017,O,1983-03-01,NN,,,2021-10-27T08:12:27,true,4,,,,,,77910,BARCY,,,77023,,,,,,,,,,,,,,,,,,,2020-01-01,F,,,,,36.00Z,NAFRev2,N,,,0,,,,,,
267704211,00015,26770421100015,O,1983-03-01,NN,,,2016-07-23T12:06:25,true,5,MAIRIE,,,,RUELLE DU CURE,77910,BARCY,,,77023,,,,,,,,,,,,,,,,,,,2016-01-01,F,,,,,88.99B,NAFRev2,N,2.880827,49.017209,0.94,street,Ruelle du Curé 77910 Barcy,77023_0060,G,RUELLE DU CURE,
297702474,00018,29770247400018,O,,NN,,,2006-11-25T09:11:06,true,1,,,,,,77910,BARCY,,,77023,,,,,,,,,,,,,,,,,,,1983-08-10,F,,,,,90.12,NAP,N,,,0,,,,,,
297705436,00014,29770543600014,O,1956-10-25,,,,2006-11-25T09:11:06,true,3,,,,RTE,CURE,77910,BARCY,,,77023,,,,,,,,,,,,,,,,,,,1996-12-25,F,,,,,70.1C,NAF1993,N,2.880827,49.017209,0.52,street,Ruelle du Curé 77910 Barcy,77023_0060,G,RUELLE DU CURE,
297705956,00011,29770595600011,O,1995-12-25,NN,,,2006-10-26T23:46:32,true,2,,,,RTE,CURE,77910,BARCY,,,77023,,,,,,,,,,,,,,,,,,,2004-01-29,F,,,,,70.1C,NAFRev1,N,2.880827,49.017209,0.52,street,Ruelle du Curé 77910 Barcy,77023_0060,G,RUELLE DU CURE,
297706293,00018,29770629300018,O,2003-12-12,,,,2013-11-26T14:39:58,true,3,MAIRIE,,,,RUELLE DU CURE,77910,BARCY,,,77023,,,,,,,,,,,,,,,,,,,2008-01-01,A,,,,,42.99Z,NAFRev2,N,2.880827,49.017209,0.94,street,Ruelle du Curé 77910 Barcy,77023_0060,G,RUELLE DU CURE,
304513963,00021,30451396300021,O,,,,,,true,1,,10,,RUE,DES PRES,77910,BARCY,,,77023,,,,,,,,,,,,,,,,,,,1985-12-25,F,,,,,62.46,NAP,N,2.879966,49.017598,0.95,housenumber,10 Rue des Prés 77910 Barcy,77023_0140_00010,G,10 RUE DES PRES,
310495593,00017,31049559300017,O,,,,,,true,1,,24,,RUE,DES PRES,77910,BARCY,,,77023,,,,,,,,,,,,,,,,,,,1990-06-30,F,,,,,55.70,NAP,N,2.879258,49.017103,0.95,housenumber,24 Rue des Prés 77910 Barcy,77023_0140_00024,G,24 RUE DES PRES,
314131426,00012,31413142600012,O,1978-01-01,NN,,,,false,4,,2,,RUE,MARDELLE,77910,BARCY,,,77023,,,,,,,,,,,,,,,,,,,2000-01-01,F,,,,,70.2B,NAF1993,N,2.881328,49.017781,0.95,housenumber,2 Rue Mardelle 77910 Barcy,77023_0100_00002,G,2 RUE MARDELLE,
314131517,00018,31413151700018,O,,,,,,true,1,,,,,,77910,BARCY,,,77023,,,,,,,,,,,,,,,,,,,1990-04-01,F,,,,,01.1A,NAF1993,N,,,0,,,,,,
314131582,00012,31413158200012,O,,,,,,true,1,,,,,FERME ST GOBERT,77910,BARCY,,,77023,,,,,,,,,,,,,,,,,,,1997-01-27,F,,,,,01.1A,NAF1993,N,2.872741,49.026274,0.81,locality,Ferme de Saint Gobert 77910 Barcy,77023_B009,G,FERME DE SAINT GOBERT,
315007278,00015,31500727800015,O,,NN,,,,true,1,,3,,RUE,DE MEAUX,77910,BARCY,,,77023,,,,,,,,,,,,,,,,,,,1993-12-31,F,,,,,01.1A,NAF1993,N,2.881991,49.01718,0.94,housenumber,3 Rue de Meaux 77910 Barcy,77023_0120_00003,G,3 RUE DE MEAUX,
317021723,00034,31702172300034,O,2000-08-11,NN,,,2006-11-25T09:39:34,false,4,EURL DEPANNAGE SERVICE,7,,RUE,DES PRES,77910,BARCY,,,77023,,,,,,,,,,,,,,,,,,,2002-04-01,F,,,,,74.1J,NAF1993,N,2.879354,49.017054,0.95,housenumber,7 Rue des Prés 77910 Barcy,77023_0140_00007,G,7 RUE DES PRES,
319044590,00028,31904459000028,O,1983-01-01,,,,2008-11-07T00:34:54,true,4,,6,,RUE,MARDELLE,77910,BARCY,,,77023,,,,,,,,,,,,,,,,,,,1993-12-25,F,,,,,45.4D,NAF1993,N,2.881769,49.018895,0.95,housenumber,6 Rue Mardelle 77910 Barcy,77023_0100_00006,G,6 RUE MARDELLE,
323180372,00019,32318037200019,O,1981-11-23,NN,,,2015-04-22T04:50:21,true,3,,,,,FERME DE ST GOBERT,77910,BARCY,,,77023,,,,,,,,,,,,,,,,,,,2008-01-01,A,,,,,68.20B,NAFRev2,N,2.872741,49.026274,0.84,locality,Ferme de Saint Gobert 77910 Barcy,77023_B009,G,FERME DE SAINT GOBERT,
332636398,00015,33263639800015,O,,NN,,,,true,1,,5,,RUE,DE MEAUX,77910,BARCY,,,77023,,,,,,,,,,,,,,,,,,,1997-06-30,F,,,,,45.2V,NAF1993,N,2.882026,49.017097,0.94,housenumber,5 Rue de Meaux 77910 Barcy,77023_0120_00005,G,5 RUE DE MEAUX,
337808356,00022,33780835600022,O,2015-12-18,,,,2023-06-20T19:37:02,true,1,,2,,RUE,DE MARDELLE,77910,BARCY,,,77023,,,,,,,,,,,,,,,,,,,2015-12-18,A,,,,,01.24Z,NAFRev2,N,2.881328,49.017781,0.81,housenumber,2 Rue Mardelle 77910 Barcy,77023_0100_00002,G,2 RUE MARDELLE,
353694144,00018,35369414400018,O,1989-11-04,NN,,,2008-01-04T23:57:17,true,3,,1,,RUE,CHATEL,77910,BARCY,,,77023,,,,,,,,,,,,,,,,,,,2008-01-01,A,,,,,68.20B,NAFRev2,N,2.880424,49.018453,0.94,housenumber,1 Rue Chatel 77910 Barcy,77023_0041_00001,G,1 RUE CHATEL,
353986763,00012,35398676300012,O,,,,,,true,1,,1,,RUE,DE MEAUX,77910,BARCY,,,77023,,,,,,,,,,,,,,,,,,,1990-12-31,F,,,,,55.73,NAP,N,2.881676,49.017445,0.94,housenumber,1 Rue de Meaux 77910 Barcy,77023_0120_00001,G,1 RUE DE MEAUX,
377972872,00016,37797287200016,O,1990-04-01,01,2020,,2023-09-05T19:41:56,true,3,,1,,RUE,CHATEL,77910,BARCY,,,77023,,,,,,,,,,,,,,,,,,,2008-01-01,A,,,,,01.11Z,NAFRev2,N,2.880424,49.018453,0.94,housenumber,1 Rue Chatel 77910 Barcy,77023_0041_00001,G,1 RUE CHATEL,
379095029,00011,37909502900011,O,1990-07-01,,,,,true,1,,24,,RUE,DES PRES,77910,BARCY,,,77023,,,,,,,,,,,,,,,,,,,2000-09-30,F,,,,,45.3E,NAF1993,N,2.879258,49.017103,0.95,housenumber,24 Rue des Prés 77910 Barcy,77023_0140_00024,G,24 RUE DES PRES,
380982488,00021,38098248800021,O,1994-10-03,NN,,,2008-11-08T00:38:29,false,5,,1,B,RUE,DE MEAUX,77910,BARCY,,,77023,,,,,,,,,,,,,,,,,,,2003-01-02,F,,,,,45.4J,NAFRev1,O,2.881725,49.017389,0.83,housenumber,1bis Rue de Meaux 77910 Barcy,77023_0120_00001_bis,G,1BIS RUE DE MEAUX,
387707771,00037,38770777100037,O,1999-10-01,NN,,,2008-12-06T05:12:10,true,3,,3,,,RLE DU CURE,77910,BARCY,,,77023,,,,,,,,,,,,,,,,,,,2008-01-01,A,,,,,49.32Z,NAFRev2,N,2.8808,49.017088,0.81,housenumber,3 Ruelle du Curé 77910 Barcy,77023_0060_00003,G,3 RUELLE DU CURE,
390505329,00016,39050532900016,O,1993-01-01,,,,,true,1,,2,,RUE,MARDELLE,77910,BARCY,,,77023,,,,,,,,,,,,,,,,,,,2000-05-14,F,,,,,01.1A,NAF1993,N,2.881328,49.017781,0.95,housenumber,2 Rue Mardelle 77910 Barcy,77023_0100_00002,G,2 RUE MARDELLE,
391212222,00015,39121222200015,O,1993-05-21,NN,,,2022-12-22T03:34:16,true,4,,6,,RUE,CHATEL,77910,BARCY,,,77023,,,,,,,,,,,,,,,,,,,2019-08-06,F,,,,,68.20B,NAFRev2,N,2.879422,49.018802,0.82,street,Rue Chatel 77910 Barcy,77023_0041,G,RUE CHATEL,
391825429,00015,39182542900015,O,1963-12-31,NN,,,2008-01-04T23:57:23,true,3,,23,,RUE,MARDELLE,77910,BARCY,,,77023,,,,,,,,,,,,,,,,,,,2008-01-01,A,,,,,01.11Z,NAFRev2,N,2.883221,49.019604,0.95,housenumber,23 Rue Mardelle 77910 Barcy,77023_0100_00023,G,23 RUE MARDELLE,
391825452,00017,39182545200017,O,1963-12-31,NN,,,2008-01-04T23:57:23,true,3,,23,,RUE,MARDELLE,77910,BARCY,,,77023,,,,,,,,,,,,,,,,,,,2008-01-01,A,,,,,01.11Z,NAFRev2,N,2.883221,49.019604,0.95,housenumber,23 Rue Mardelle 77910 Barcy,77023_0100_00023,G,23 RUE MARDELLE,
391825502,00019,39182550200019,O,1963-12-31,NN,,,2006-01-10T12:59:37,true,3,,23,,RUE,MARDELLE,77910,BARCY,,,77023,,,,,,,,,,,,,,,,,,,1998-12-25,F,,,,,01.1A,NAF1993,N,2.883221,49.019604,0.95,housenumber,23 Rue Mardelle 77910 Barcy,77023_0100_00023,G,23 RUE MARDELLE,
391827680,00011,39182768000011,O,1992-01-01,NN,,,,true,1,,6,,RUE,DU CLOSEAU,77910,BARCY,,,77023,,,,,,,,,,,,,,,,,,,2002-12-31,F,,,,,01.1A,NAF1993,N,2.878389,49.017392,0.94,housenumber,6 Rue du Closeau 77910 Barcy,77023_0047_00006,G,6 RUE DU CLOSEAU,
398712315,00025,39871231500025,O,1996-02-01,NN,,,,true,1,,,,CHE,DEPARTEMENTAL 38,77910,BARCY,,,77023,,,,,,,,,,,,,,,,,,,1996-02-01,F,,,,,74.2C,NAF1993,O,5.7000938,45.1883491,0.72,poi.community_centre,Association Départementale pour la Sauvegarde des Enfants et des Adultes 38 (Salle des fêtes) Fontaine,https://osm.org/node/5468076462,G,,
402336937,00048,40233693700048,O,2015-01-26,,,,2016-03-16T05:14:13,true,2,,13,,RUE,DES PRES,77910,BARCY,,,77023,,,,,,,,,,,,,,,,,,,2016-01-01,F,,,,,71.12B,NAFRev2,N,2.878913,49.016907,0.95,housenumber,13 Rue des Prés 77910 Barcy,77023_0140_00013,G,13 RUE DES PRES,
405114851,00018,40511485100018,O,1963-01-01,NN,,,,true,1,,10,,RUE,CHATEL,77910,BARCY,,,77023,,,,,,,,,,,,,,,,,,,1998-08-16,F,,,,,01.1A,NAF1993,N,2.879676,49.018947,0.94,housenumber,10 Rue Chatel 77910 Barcy,77023_0041_00010,G,10 RUE CHATEL,
405114869,00010,40511486900010,O,1981-01-01,NN,,,,true,3,,9,,RUE,DES PRES,77910,BARCY,,,77023,,,,,,,,,,,,,,,,,,,2003-12-22,F,,,,,01.1A,NAFRev1,N,2.879261,49.017028,0.95,housenumber,9 Rue des Prés 77910 Barcy,77023_0140_00009,G,9 RUE DES PRES,
407560887,00017,40756088700017,O,1996-05-15,01,2020,,2022-08-29T09:25:28,true,3,,2,,RUE,MARDELLE,77910,BARCY,,,77023,,,,,,,,,,,,,,,,,,,2008-01-01,A,,,,,01.11Z,NAFRev2,N,2.881328,49.017781,0.95,housenumber,2 Rue Mardelle 77910 Barcy,77023_0100_00002,G,2 RUE MARDELLE,
408695096,00011,40869509600011,O,1986-04-01,NN,,,2016-01-12T00:17:50,true,3,,3,,RUE,DE MEAUX,77910,BARCY,,,77023,,,,,,,,,,,,,,,,,,,2008-01-01,A,,,,,01.11Z,NAFRev2,N,2.881991,49.01718,0.94,housenumber,3 Rue de Meaux 77910 Barcy,77023_0120_00003,G,3 RUE DE MEAUX,
409115268,00024,40911526800024,O,2011-01-07,,,,2022-11-05T03:41:43,true,4,,16,,RUE,CHATEL,77910,BARCY,,,77023,,,,,,,,,,,,,,,,,,,2022-10-31,F,,,,FRANCISCO,43.32A,NAFRev2,N,2.879139,49.019247,0.94,housenumber,16 Rue Chatel 77910 Barcy,77023_0041_00016,G,16 RUE CHATEL,
409422615,00016,40942261500016,O,1996-09-12,NN,,,2007-04-12T06:48:05,true,3,,23,B,RUE,MARDELLE,77910,BARCY,,,77023,,,,,,,,,,,,,,,,,,,2004-09-25,F,,,,,01.1A,NAFRev1,N,2.883071,49.019914,0.84,housenumber,23bis Rue Mardelle 77910 Barcy,77023_0100_00023_bis,G,23BIS RUE MARDELLE,
411085855,00012,41108585500012,O,1997-01-28,00,2020,,2022-08-29T09:28:03,true,3,FERME DE SAINT GOBERT,,,,FERME DE ST GOBERT,77910,BARCY,,,77023,,,,,,,,,,,,,,,,,,,2008-01-01,A,,,,,01.11Z,NAFRev2,N,2.872741,49.026274,0.84,locality,Ferme de Saint Gobert 77910 Barcy,77023_B009,G,FERME DE SAINT GOBERT,
411806706,00015,41180670600015,P,1997-01-28,NN,,,2023-04-19T09:27:41,true,3,[ND],[ND],[ND],[ND],[ND],[ND],BARCY,,[ND],77023,[ND],[ND],,,[ND],[ND],[ND],[ND],[ND],[ND],,,[ND],,[ND],[ND],,,2008-01-01,A,[ND],[ND],[ND],[ND],68.20B,NAFRev2,N,,,0,,,,,,
420300386,00026,42030038600026,O,2000-09-01,NN,,,2008-11-08T01:37:21,true,3,,16,,RUE,DES PRES,77910,BARCY,,,77023,,,,,,,,,,,,,,,,,,,2006-06-30,F,,,,,45.3C,NAFRev1,O,2.879987,49.017319,0.95,housenumber,16 Rue des Prés 77910 Barcy,77023_0140_00016,G,16 RUE DES PRES,
431797513,00014,43179751300014,O,2000-05-15,NN,,,2009-06-27T09:42:59,true,3,,2,,RUE,MARDELLE,77910,BARCY,,,77023,,,,,,,,,,,,,,,,,,,2008-01-01,A,,,,,01.11Z,NAFRev2,N,2.881328,49.017781,0.95,housenumber,2 Rue Mardelle 77910 Barcy,77023_0100_00002,G,2 RUE MARDELLE,
432700169,00019,43270016900019,O,2000-08-11,NN,,,2008-11-08T01:56:49,false,4,,7,,RUE,DES PRES,77910,BARCY,,,77023,,,,,,,,,,,,,,,,,,,2002-04-01,F,,,,,45.3F,NAF1993,O,2.879354,49.017054,0.95,housenumber,7 Rue des Prés 77910 Barcy,77023_0140_00007,G,7 RUE DES PRES,
435269386,00015,43526938600015,O,2001-04-02,NN,,4312BA,2022-09-28T15:29:03,false,5,,10,,RUE,MARDELLE,77910,BARCY,,,77023,,,,,,,,,,,,,,,,,,,2020-11-09,F,,,,,43.12A,NAFRev2,N,2.883057,49.019467,0.95,housenumber,10 Rue Mardelle 77910 Barcy,77023_0100_00010,G,10 RUE MARDELLE,
444390942,00019,44439094200019,O,2002-12-05,NN,,,2015-08-06T03:37:30,true,3,,,,,FERME DE SAINT GOBERT,77910,BARCY,,,77023,,,,,,,,,,,,,,,,,,,2008-01-01,A,,,,,01.11Z,NAFRev2,N,2.872741,49.026274,0.93,locality,Ferme de Saint Gobert 77910 Barcy,77023_B009,G,FERME DE SAINT GOBERT,
452300684,00035,45230068400035,O,2014-02-07,,,,2021-02-23T13:36:07,true,1,,2,,RUE,DE MARDELLE,77910,BARCY,,,77023,,,,,,,,,,,,,,,,,,,2014-02-07,A,,,,,59.20Z,NAFRev2,N,2.881328,49.017781,0.81,housenumber,2 Rue Mardelle 77910 Barcy,77023_0100_00002,G,2 RUE MARDELLE,
479291429,00013,47929142900013,O,2004-11-01,NN,,,2008-11-08T02:44:50,false,5,,18,,RUE,DES PRES,77910,BARCY,,,77023,,,,,,,,,,,,,,,,,,,2007-02-08,F,,,,,45.4A,NAFRev1,N,2.879839,49.017276,0.95,housenumber,18 Rue des Prés 77910 Barcy,77023_0140_00018,G,18 RUE DES PRES,
480024322,00012,48002432200012,P,2005-01-01,,,,2016-11-15T10:28:11,false,2,[ND],[ND],[ND],[ND],[ND],[ND],BARCY,,[ND],77023,[ND],[ND],,,[ND],[ND],[ND],[ND],[ND],[ND],,,[ND],,[ND],[ND],,,2006-06-01,F,[ND],[ND],[ND],[ND],74.8K,NAFRev1,N,,,0,,,,,,
481245009,00016,48124500900016,O,2005-04-01,,,4932ZA,2017-03-14T03:35:26,true,3,,22,,RUE,DES PRES,77910,BARCY,,,77023,,,,,,,,,,,,,,,,,,,2017-02-28,F,,,,,49.32Z,NAFRev2,N,2.87959,49.017206,0.95,housenumber,22 Rue des Prés 77910 Barcy,77023_0140_00022,G,22 RUE DES PRES,
481470417,00017,48147041700017,O,2005-04-01,01,2020,4312BA,2022-08-29T09:14:55,true,2,,10,,RUE,CHATEL,77910,BARCY,,,77023,,,,,,,,,,,,,,,,,,,2008-01-01,A,,,,,81.30Z,NAFRev2,N,2.879676,49.018947,0.94,housenumber,10 Rue Chatel 77910 Barcy,77023_0041_00010,G,10 RUE CHATEL,
483014684,00037,48301468400037,O,2011-09-01,,,,2019-09-16T03:39:47,true,2,,,,,SAINT GOBERT,77910,BARCY,,,77023,,,,,,,,,,,,,,,,,,,2019-06-01,F,,,,,66.22Z,NAFRev2,N,2.873088,49.026918,0.93,street,Chemin de Saint Gobert 77910 Barcy,77023_0154,G,CHEMIN DE SAINT GOBERT,
483971347,00016,48397134700016,O,2005-09-02,,,,2023-01-19T15:31:29,true,4,,32,,RUE,DES PRES,77910,BARCY,,,77023,,,,,,,,,,,,,,,,,,,2022-12-31,F,,,,,90.03A,NAFRev2,N,2.878824,49.016949,0.95,housenumber,32 Rue des Prés 77910 Barcy,77023_0140_00032,G,32 RUE DES PRES,
487774317,00027,48777431700027,O,2007-01-01,,,2829BZ,2017-12-06T03:38:56,true,3,,21,,RUE,CHATEL,77910,BARCY,,,77023,,,,,,,,,,,,,,,,,,,2016-01-31,F,HP - SYSTEME,,,,28.29B,NAFRev2,N,2.877696,49.019044,0.94,housenumber,21 Rue Chatel 77910 Barcy,77023_0041_00021,G,21 RUE CHATEL,
491021168,00019,49102116800019,O,2006-07-17,NN,,,2021-07-09T19:37:10,true,6,,4,,RLE,DU CURE,77910,BARCY,,,77023,,,,,,,,,,,,,,,,,,,2020-12-31,F,,,,,46.19B,NAFRev2,N,2.881008,49.017183,0.81,housenumber,4 Ruelle du Curé 77910 Barcy,77023_0060_00004,G,4 RUELLE DU CURE,
492499355,00013,49249935500013,O,2005-12-15,NN,,,2011-04-23T15:49:16,true,3,,11,,RUE,CHATEL,77910,BARCY,,,77023,,,,,,,,,,,,,,,,,,,2008-04-01,A,,,,,94.99Z,NAFRev2,O,2.879415,49.019036,0.94,housenumber,11 Rue Chatel 77910 Barcy,77023_0041_00011,G,11 RUE CHATEL,
493379713,00016,49337971300016,O,2006-10-01,,,,2014-01-22T15:05:17,false,3,SAINT GOBERT,,,,,77910,BARCY,,,77023,,,,,,,,,,,,,,,,,,,2012-11-15,F,,,,,90.03B,NAFRev2,N,2.873088,49.026918,0.93,street,Chemin de Saint Gobert 77910 Barcy,77023_0154,D,CHEMIN DE SAINT GOBERT,
494409568,00024,49440956800024,O,2011-01-01,NN,,4399CZ,2021-10-27T08:34:01,true,2,,16,,RUE,CHATEL,77910,BARCY,,,77023,,,,,,,,,,,,,,,,,,,2020-06-08,F,,,,MACONNERIE GENERALE MARQUES,43.99C,NAFRev2,O,2.879139,49.019247,0.94,housenumber,16 Rue Chatel 77910 Barcy,77023_0041_00016,G,16 RUE CHATEL,
498100023,00023,49810002300023,O,2012-01-01,00,2020,,2022-08-29T09:29:50,true,2,,2,,RUE,MARDELLE,77910,BARCY,,,77023,,,,,,,,,,,,,,,,,,,2013-02-10,A,,,,,59.11B,NAFRev2,O,2.881328,49.017781,0.95,housenumber,2 Rue Mardelle 77910 Barcy,77023_0100_00002,G,2 RUE MARDELLE,
501676647,00016,50167664700016,O,2007-10-01,,,,2008-01-05T02:17:21,true,2,,16,,RUE,CHATEL,77910,BARCY,,,77023,,,,,,,,,,,,,,,,,,,2008-01-01,A,,,,,68.20B,NAFRev2,N,2.879139,49.019247,0.94,housenumber,16 Rue Chatel 77910 Barcy,77023_0041_00016,G,16 RUE CHATEL,
503748840,00025,50374884000025,O,2016-03-03,,,,2021-02-23T14:15:51,true,1,,3,B,RUE,DE MEAUX,77910,BARCY,,,77023,,,,,,,,,,,,,,,,,,,2016-03-03,A,,,,,46.19B,NAFRev2,N,2.882128,49.017007,0.83,housenumber,3bis Rue de Meaux 77910 Barcy,77023_0120_00003_bis,G,3BIS RUE DE MEAUX,
510917669,00010,51091766900010,O,2009-04-01,,,,2011-01-06T19:58:42,true,2,,14,,RUE,CHATEL,77910,BARCY,,,77023,,,,,,,,,,,,,,,,,,,2010-12-31,F,,,,,43.34Z,NAFRev2,N,2.879304,49.01916,0.94,housenumber,14 Rue Chatel 77910 Barcy,77023_0041_00014,G,14 RUE CHATEL,
518599287,00019,51859928700019,O,2010-01-02,,,,2012-11-10T01:33:17,true,2,,15,,RUE,CHATEL,77910,BARCY,,,77023,,,,,,,,,,,,,,,,,,,2010-10-03,F,,,,,47.81Z,NAFRev2,N,2.878676,49.019368,0.94,housenumber,15 Rue Chatel 77910 Barcy,77023_0041_00015,G,15 RUE CHATEL,
531046183,00012,53104618300012,O,2011-04-14,,,,2013-04-04T19:28:11,false,3,,4,T,RUE,MARDELLE,77910,BARCY,,,77023,,,,,,,,,,,,,,,,,,,2013-04-03,F,,,,TAXI DES VILLAGES DE MEAUX,49.32Z,NAFRev2,N,2.881623,49.018712,0.83,housenumber,4ter Rue Mardelle 77910 Barcy,77023_0100_00004_ter,G,4TER RUE MARDELLE,
531277002,00022,53127700200022,O,2022-01-24,,,,2022-12-30T08:53:39,true,2,LA CHAPELLE DE SAINT GOBERT,,,,,77910,BARCY,,,77023,,,,,,,,,,,,,,,,,,,2022-12-13,F,,,,,46.18Z,NAFRev2,N,2.873088,49.026918,0.61,street,Chemin de Saint Gobert 77910 Barcy,77023_0154,D,CHEMIN DE SAINT GOBERT,
746001726,00015,74600172600015,O,,NN,,,,true,1,,,,,77 BARCY,77910,BARCY,,,77023,,,,,,,,,,,,,,,,,,,,F,,,,,65.06,NAP,N,2.879966,49.017598,0.72,street,Rue des Prés 77910 Barcy,77023_0140,G,RUE DES PRES,
746143700,00019,74614370000019,O,,NN,,,,true,1,,4,,RUE,DE MEAUX,77910,BARCY,,,77023,,,,,,,,,,,,,,,,,,,1996-06-30,F,,,,,60.2L,NAF1993,O,2.881757,49.017274,0.94,housenumber,4 Rue de Meaux 77910 Barcy,77023_0120_00004,G,4 RUE DE MEAUX,
750564486,00017,75056448600017,O,2012-04-10,,,9602BB,2017-05-18T09:52:22,false,2,,1,T,RUE,DE MEAUX,77910,BARCY,,,77023,,,,,,,,,,,,,,,,,,,2017-05-16,F,,,,DREAM BEAUTY,96.02B,NAFRev2,N,2.881792,49.017321,0.83,housenumber,1ter Rue de Meaux 77910 Barcy,77023_0120_00001_ter,G,1TER RUE DE MEAUX,
751021767,00015,75102176700015,O,2012-03-01,,,,2014-11-05T03:36:27,true,2,,15,B,RUE,MARDELLE,77910,BARCY,,,77023,,,,,,,,,,,,,,,,,,,2014-09-30,F,,,,,74.90B,NAFRev2,N,2.882041,49.019071,0.84,housenumber,15bis Rue Mardelle 77910 Barcy,77023_0100_00015_bis,G,15BIS RUE MARDELLE,
752071266,00015,75207126600015,O,2012-06-07,,,,2018-06-08T04:07:05,true,1,,2,,RUE,MARDELLE,77910,BARCY,,,77023,,,,,,,,,,,,,,,,,,,2012-06-07,A,,,,,64.20Z,NAFRev2,N,2.881328,49.017781,0.95,housenumber,2 Rue Mardelle 77910 Barcy,77023_0100_00002,G,2 RUE MARDELLE,
784898090,00013,78489809000013,O,,,,,,true,1,,,,,,77910,BARCY,,,77023,,,,,,,,,,,,,,,,,,,1984-12-25,F,,,,,55.60,NAP,N,,,0,,,,,,
789339124,00016,78933912400016,O,2012-10-16,,,,2015-07-08T09:00:07,true,2,,16,,RUE,CHATEL,77910,BARCY,,,77023,,,,,,,,,,,,,,,,,,,2015-07-05,F,,,,,74.90B,NAFRev2,N,2.879139,49.019247,0.94,housenumber,16 Rue Chatel 77910 Barcy,77023_0041_00016,G,16 RUE CHATEL,
789801818,00012,78980181800012,O,2012-12-04,,,,2012-12-07T08:42:16,true,1,,2,,HAM,DE PRINGY,77910,BARCY,,,77023,,,,,,,,,,,,,,,,,,,2012-12-04,A,,,,,64.20Z,NAFRev2,N,2.857742,49.010427,0.85,housenumber,2 Hameau de Pringy 77910 Barcy,77023_b016_00002,G,2 HAMEAU DE PRINGY,
791225022,00023,79122502200023,O,2020-01-02,,,8121ZZ,2022-03-05T12:36:10,true,2,,6,,RUE,MARDELLE,77910,BARCY,,,77023,,,,,,,,,,,,,,,,,,,2022-02-18,A,,,,MPS CONCEPT,81.21Z,NAFRev2,N,2.881769,49.018895,0.95,housenumber,6 Rue Mardelle 77910 Barcy,77023_0100_00006,G,6 RUE MARDELLE,
793440512,00028,79344051200028,P,2016-03-20,,,,2022-02-03T04:04:39,false,2,[ND],[ND],[ND],[ND],[ND],[ND],BARCY,,[ND],77023,[ND],[ND],,,[ND],[ND],[ND],[ND],[ND],[ND],,,[ND],,[ND],[ND],,,2022-02-03,F,[ND],[ND],[ND],[ND],86.22C,NAFRev2,N,,,0,,,,,,
793602228,00017,79360222800017,O,2013-05-15,,,,2020-10-21T03:37:56,true,2,,,,RUE,DES PRES,77910,BARCY,,,77023,,,,,,,,,,,,,,,,,,,2020-06-02,F,,,,,68.20B,NAFRev2,N,2.879966,49.017598,0.95,street,Rue des Prés 77910 Barcy,77023_0140,G,RUE DES PRES,
818848293,00010,81884829300010,O,2016-03-02,,,,2022-09-23T08:39:32,true,2,,5,,RUE,DE MEAUX,77910,BARCY,,,77023,,,,,,,,,,,,,,,,,,,2021-12-31,F,,,,,96.09Z,NAFRev2,N,2.882026,49.017097,0.94,housenumber,5 Rue de Meaux 77910 Barcy,77023_0120_00005,G,5 RUE DE MEAUX,
820575991,00022,82057599100022,O,2019-10-01,,,,2021-02-23T17:39:32,true,1,,12,,RUE,DES PRES,77910,BARCY,,,77023,,,,,,,,,,,,,,,,,,,2019-10-01,A,,,,,74.90B,NAFRev2,N,2.880068,49.017491,0.95,housenumber,12 Rue des Prés 77910 Barcy,77023_0140_00012,G,12 RUE DES PRES,
822777710,00028,82277771000028,O,2022-09-01,,,4322AZ,2023-04-03T11:10:39,true,1,,10,,ALL,DE LA MARNIERE,77910,BARCY,,,77023,,,,,,,,,,,,,,,,,,,2022-09-01,A,,,,ALEX SOLUTIONS PLOMBERIE CHAUFFAGE,43.22A,NAFRev2,N,2.881984,49.019884,0.86,housenumber,10 Allée de la Marnière 77910 Barcy,77023_0105_00010,G,10 ALLEE DE LA MARNIERE,
824626022,00027,82462602200027,O,2020-11-28,,,,2023-01-17T11:53:09,true,2,,4,,RUE,DES PRES,77910,BARCY,,,77023,,,,,,,,,,,,,,,,,,,2023-01-01,F,,,,,43.29B,NAFRev2,N,2.880556,49.017619,0.95,housenumber,4 Rue des Prés 77910 Barcy,77023_0140_00004,G,4 RUE DES PRES,
828008474,00011,82800847400011,O,2017-01-11,,,,2017-03-01T07:50:19,true,1,,,,,RUELLE DU CURE,77910,BARCY,,,77023,,,,,,,,,,,,,,,,,,,2017-01-11,A,,,,,94.99Z,NAFRev2,N,2.880827,49.017209,0.94,street,Ruelle du Curé 77910 Barcy,77023_0060,G,RUELLE DU CURE,
830142899,00012,83014289900012,O,2017-06-09,,,,2023-08-05T11:42:02,true,2,,2,,HAM,DE PRINGY,77910,BARCY,,,77023,,,,,,,,,,,,,,,,,,,2021-09-09,A,,,,,68.10Z,NAFRev2,N,2.857742,49.010427,0.85,housenumber,2 Hameau de Pringy 77910 Barcy,77023_b016_00002,G,2 HAMEAU DE PRINGY,
830853982,00015,83085398200015,O,2017-07-10,,,,2017-07-12T09:52:38,true,1,,,,,FRM DE SAINT GOBERT,77910,BARCY,,,77023,,,,,,,,,,,,,,,,,,,2017-07-10,A,,,,,64.20Z,NAFRev2,N,2.872741,49.026274,0.76,locality,Ferme de Saint Gobert 77910 Barcy,77023_B009,G,FERME DE SAINT GOBERT,
831752001,00014,83175200100014,O,2017-09-01,,,,2017-09-04T08:19:16,true,1,,1,,RUE,MEAUX,77910,BARCY,,,77023,,,,,,,,,,,,,,,,,,,2017-09-01,A,,,,,90.03B,NAFRev2,N,2.881676,49.017445,0.93,housenumber,1 Rue de Meaux 77910 Barcy,77023_0120_00001,G,1 RUE DE MEAUX,
831778535,00037,83177853500037,O,2023-08-25,,,,2023-09-02T13:30:56,true,1,,10,,RUE,DES PRES,77910,BARCY,,,77023,,,,,,,,,,,,,,,,,,,2023-08-25,A,,,,LAURYN BARREIRO,96.02B,NAFRev2,N,2.879966,49.017598,0.95,housenumber,10 Rue des Prés 77910 Barcy,77023_0140_00010,G,10 RUE DES PRES,
833731524,00017,83373152400017,O,2017-12-01,,,,2017-12-04T14:03:44,true,1,,,,,FERME DE SAINT GOBERT,77910,BARCY,,,77023,,,,,,,,,,,,,,,,,,,2017-12-01,A,,,,,68.20B,NAFRev2,N,2.872741,49.026274,0.93,locality,Ferme de Saint Gobert 77910 Barcy,77023_B009,G,FERME DE SAINT GOBERT,
834474637,00016,83447463700016,O,2017-12-12,,,,2021-10-26T10:48:02,false,2,,10,,RUE,DU CLOSEAU,77910,BARCY,,,77023,,,,,,,,,,,,,,,,,,,2021-09-30,F,,,,,46.19B,NAFRev2,N,2.878235,49.017458,0.94,housenumber,10 Rue du Closeau 77910 Barcy,77023_0047_00010,G,10 RUE DU CLOSEAU,