siren,nic,siret,statutDiffusionEtablissement,dateCreationEtablissement,trancheEffectifsEtablissement,anneeEffectifsEtablissement,activitePrincipaleRegistreMetiersEtablissement,dateDernierTraitementEtablissement,etablissementSiege,nombrePeriodesEtablissement,complementAdresseEtablissement,numeroVoieEtablissement,indiceRepetitionEtablissement,typeVoieEtablissement,libelleVoieEtablissement,codePostalEtablissement,libelleCommuneEtablissement,libelleCommuneEtrangerEtablissement,distributionSpecialeEtablissement,codeCommuneEtablissement,codeCedexEtablissement,libelleCedexEtablissement,codePaysEtrangerEtablissement,libellePaysEtrangerEtablissement,complementAdresse2Etablissement,numeroVoie2Etablissement,indiceRepetition2Etablissement,typeVoie2Etablissement,libelleVoie2Etablissement,codePostal2Etablissement,libelleCommune2Etablissement,libelleCommuneEtranger2Etablissement,distributionSpeciale2Etablissement,codeCommune2Etablissement,codeCedex2Etablissement,libelleCedex2Etablissement,codePaysEtranger2Etablissement,libellePaysEtranger2Etablissement,dateDebut,etatAdministratifEtablissement,enseigne1Etablissement,enseigne2Etablissement,enseigne3Etablissement,denominationUsuelleEtablissement,activitePrincipaleEtablissement,nomenclatureActivitePrincipaleEtablissement,caractereEmployeurEtablissement,longitude,latitude,geo_score,geo_type,geo_adresse,geo_id,geo_ligne,geo_l4,geo_l5
218005148,00018,21800514800018,O,1983-03-01,02,2020,,2022-08-29T09:09:09,true,3,,,,,,80270,METIGNY,,,80543,,,,,,,,,,,,,,,,,,,2008-01-01,A,MAIRIE,,,,84.11Z,NAFRev2,N,,,0,,,,,,
268005808,00012,26800580800012,O,1983-03-01,NN,,,2019-08-14T16:33:34,true,4,,,,,,80270,METIGNY,,,80543,,,,,,,,,,,,,,,,,,,2019-01-01,F,CCAS,,,,88.99B,NAFRev2,N,,,0,,,,,,
298000712,00018,29800071200018,O,,NN,,,2006-11-25T09:11:08,true,1,,,,,,80270,METIGNY,,,80543,,,,,,,,,,,,,,,,,,,1994-12-25,F,,,,,70.1C,NAF1993,N,,,0,,,,,,
323345231,00019,32334523100019,O,,NN,,,,true,1,,,,,,80270,METIGNY,,,80543,,,,,,,,,,,,,,,,,,,1990-08-31,F,,,,,78.02,NAP,N,,,0,,,,,,
327638862,00018,32763886200018,O,,NN,,,,true,1,,,,,,80270,METIGNY,,,80543,,,,,,,,,,,,,,,,,,,1995-12-31,F,,,,,67.2Z,NAF1993,N,,,0,,,,,,
331590885,00025,33159088500025,O,1987-05-27,NN,,,2011-11-18T00:12:17,true,7,,11,,RUE,DU MERMONT,80270,METIGNY,,,80543,,,,,,,,,,,,,,,,,,,2008-10-31,F,,,,,47.78B,NAFRev2,N,1.929998,49.946269,0.94,housenumber,11 Rue du Mermont 80270 Métigny,80543_0100_00011,G,11 RUE DU MERMONT,
332939446,00016,33293944600016,O,,NN,,,,true,1,,,,RUE,DE LALEU,80270,METIGNY,,,80543,,,,,,,,,,,,,,,,,,,,F,,,,,77.10,NAP,N,1.928529,49.944269,0.58,street,Rue de l’Eglise 80270 Métigny,80543_0056,G,RUE DE L EGLISE,
333833655,00025,33383365500025,O,2003-12-20,,,,2011-04-23T05:48:36,false,4,,8,,RUE,DE L EGLISE,80270,METIGNY,,,80543,,,,,,,,,,,,,,,,,,,2009-06-01,F,,,,,01.16Z,NAFRev2,N,1.928915,49.94505,0.94,housenumber,8 Rue de l’Eglise 80270 Métigny,80543_0056_00008,G,8 RUE DE L EGLISE,
342501772,00038,34250177200038,O,2003-12-20,NN,,,2009-07-24T08:44:22,false,4,,8,,RUE,DE L'EGLISE,80270,METIGNY,,,80543,,,,,,,,,,,,,,,,,,,2009-06-01,F,,,,,01.11Z,NAFRev2,N,1.928915,49.94505,0.94,housenumber,8 Rue de l’Eglise 80270 Métigny,80543_0056_00008,G,8 RUE DE L EGLISE,
349321539,00018,34932153900018,O,1989-01-10,NN,,,2008-11-08T00:24:11,true,3,,,,,,80270,METIGNY,,,80543,,,,,,,,,,,,,,,,,,,2005-12-25,F,,,,,45.1A,NAFRev1,N,,,0,,,,,,
350885968,00015,35088596800015,O,,,,,,true,1,,,,,,80270,METIGNY,,,80543,,,,,,,,,,,,,,,,,,,1994-05-06,F,,,,,01.1A,NAF1993,N,,,0,,,,,,
384172805,00010,38417280500010,O,1991-12-06,01,2020,,2022-08-29T09:11:11,true,4,,9,,RUE,DE L'EGLISE,80270,METIGNY,,,80543,,,,,,,,,,,,,,,,,,,2022-03-23,A,,,,,03.22Z,NAFRev2,N,1.929107,49.944715,0.94,housenumber,9 Rue de l’Eglise 80270 Métigny,80543_0056_00009,G,9 RUE DE L EGLISE,
394512347,00011,39451234700011,O,1981-10-01,NN,,,2013-05-18T03:28:10,true,4,,,,,,80270,METIGNY,,,80543,,,,,,,,,,,,,,,,,,,2011-01-31,F,,,,,01.11Z,NAFRev2,N,,,0,,,,,,
395084072,00010,39508407200010,O,1994-04-15,NN,,,2023-06-20T03:46:16,true,4,,,,,,80270,METIGNY,,,80543,,,,,,,,,,,,,,,,,,,2023-03-31,F,,,,,01.50Z,NAFRev2,N,,,0,,,,,,
395084072,00028,39508407200028,O,2022-08-05,,,,2023-06-20T03:46:16,false,2,,1,,RUE,DE L'EGLISE,80270,METIGNY,,,80543,,,,,,,,,,,,,,,,,,,2023-03-31,F,,,,,35.11Z,NAFRev2,N,1.927681,49.944529,0.94,housenumber,1 Rue de l’Eglise 80270 Métigny,80543_0056_00001,G,1 RUE DE L EGLISE,
408940880,00011,40894088000011,O,1970-01-01,NN,,,2008-01-04T21:18:44,true,3,,,,RUE,DU FOURNIVAL,80270,METIGNY,,,80543,,,,,,,,,,,,,,,,,,,2008-01-01,A,,,,,01.11Z,NAFRev2,N,1.925154,49.943482,0.94,street,Rue du Fournival 80270 Métigny,80543_0055,G,RUE DU FOURNIVAL,
408940898,00013,40894089800013,O,1977-10-01,NN,,,,true,1,,,,RUE,DU QUAYET,80270,METIGNY,,,80543,,,,,,,,,,,,,,,,,,,2002-09-30,F,,,,,01.1A,NAF1993,N,1.927298,49.945999,0.94,street,Rue du Quayet 80270 Métigny,80543_0160,G,RUE DU QUAYET,
408940906,00014,40894090600014,O,1962-01-01,NN,,,,true,1,,,,,,80270,METIGNY,,,80543,,,,,,,,,,,,,,,,,,,1999-12-31,F,,,,,01.1A,NAF1993,N,,,0,,,,,,
439000571,00018,43900057100018,O,2001-09-01,NN,,,,true,5,,11,,RUE,DU MOULIN,80270,METIGNY,,,80543,,,,,,,,,,,,,,,,,,,2003-07-31,F,,,,,51.4S,NAFRev1,O,1.929998,49.946269,0.62,housenumber,11 Rue du Mermont 80270 Métigny,80543_0100_00011,G,11 RUE DU MERMONT,
441813490,00014,44181349000014,O,2002-04-18,NN,,,2013-03-22T10:19:55,false,4,,1,,RUE,DE L'EGLISE,80270,METIGNY,,,80543,,,,,,,,,,,,,,,,,,,2012-12-31,F,,,,,01.61Z,NAFRev2,N,1.927681,49.944529,0.94,housenumber,1 Rue de l’Eglise 80270 Métigny,80543_0056_00001,G,1 RUE DE L EGLISE,
441813490,00030,44181349000030,O,2020-02-24,,,,2021-02-23T13:23:31,false,1,,2,,RUE,DE L'EGLISE,80270,METIGNY,,,80543,,,,,,,,,,,,,,,,,,,2020-02-24,A,,,,,01.41Z,NAFRev2,N,1.927242,49.944821,0.94,housenumber,2 Rue de l’Eglise 80270 Métigny,80543_0056_00002,G,2 RUE DE L EGLISE,
448628057,00060,44862805700060,O,2021-12-13,,,,2022-05-07T12:10:37,true,1,,13,,RUE,DU MERMONT,80270,METIGNY,,,80543,,,,,,,,,,,,,,,,,,,2021-12-13,A,,,,,68.31Z,NAFRev2,N,1.930331,49.946482,0.94,housenumber,13 Rue du Mermont 80270 Métigny,80543_0100_00013,G,13 RUE DU MERMONT,
493831937,00013,49383193700013,O,2007-01-19,,,,2010-03-05T11:13:01,false,3,,6,,RUE,DE L'EGLISE,80270,METIGNY,,,80543,,,,,,,,,,,,,,,,,,,2009-06-20,F,,,,,81.30Z,NAFRev2,N,1.928603,49.944956,0.94,housenumber,6 Rue de l’Eglise 80270 Métigny,80543_0056_00006,G,6 RUE DE L EGLISE,
530781723,00016,53078172300016,O,2011-02-01,01,2020,,2022-08-29T09:31:47,true,2,,12,,RUE,DU FOURNIVAL,80270,METIGNY,,,80543,,,,,,,,,,,,,,,,,,,2012-12-31,A,,,,,01.50Z,NAFRev2,O,1.925002,49.943122,0.94,housenumber,12 Rue du Fournival 80270 Métigny,80543_0055_00012,G,12 RUE DU FOURNIVAL,
531943173,00017,53194317300017,O,2011-05-02,,,9602BB,2014-06-27T01:17:20,true,1,,12,,RUE,DU FOURNIVAL,80270,METIGNY,,,80543,,,,,,,,,,,,,,,,,,,2011-05-02,A,,,,,96.02B,NAFRev2,N,1.925002,49.943122,0.94,housenumber,12 Rue du Fournival 80270 Métigny,80543_0055_00012,G,12 RUE DU FOURNIVAL,
533366852,00010,53336685200010,O,2011-03-26,,,,2011-07-04T17:05:00,true,1,,8,,RUE,DU MERMONT,80270,METIGNY,,,80543,,,,,,,,,,,,,,,,,,,2011-03-26,A,,,,,94.99Z,NAFRev2,N,1.929257,49.94598,0.94,housenumber,8 Rue du Mermont 80270 Métigny,80543_0100_00008,G,8 RUE DU MERMONT,
537795106,00013,53779510600013,O,2011-11-10,,,,2016-02-04T08:37:47,true,2,,16,,RUE,DE L EGLISE,80270,METIGNY,,,80543,,,,,,,,,,,,,,,,,,,2016-02-01,F,,,,,47.99A,NAFRev2,N,1.928951,49.944357,0.94,housenumber,16 Rue de l’Eglise 80270 Métigny,80543_0056_00016,G,16 RUE DE L EGLISE,
539531038,00013,53953103800013,O,2012-01-05,,,,2013-12-22T04:18:14,true,2,,5,,RUE,DU MERMONT,80270,METIGNY,,,80543,80270,,,,,,,,,,,,,,,,,,2013-12-01,F,,,,,23.70Z,NAFRev2,N,1.92949,49.945223,0.94,housenumber,5 Rue du Mermont 80270 Métigny,80543_0100_00005,G,5 RUE DU MERMONT,
775632359,00029,77563235900029,O,1900-01-01,,,,2016-01-12T00:30:38,true,4,,,,,,80270,METIGNY,,,80543,,,,,,,,,,,,,,,,,,,2008-01-01,A,,,,,03.21Z,NAFRev2,N,,,0,,,,,,
841034259,00017,84103425900017,O,2018-07-01,01,2020,4399CZ,2022-08-29T10:28:12,true,2,,13,,RUE,DU MERMONT,80270,METIGNY,,,80543,,,,,,,,,,,,,,,,,,,2018-09-01,A,,,,,43.99C,NAFRev2,O,1.930331,49.946482,0.94,housenumber,13 Rue du Mermont 80270 Métigny,80543_0100_00013,G,13 RUE DU MERMONT,
843088584,00019,84308858400019,O,2018-09-06,,,,2018-11-09T04:20:26,true,2,,8,,RUE,DE L'EGLISE,80270,METIGNY,,,80543,,,,,,,,,,,,,,,,,,,2018-11-06,A,,,,,68.20B,NAFRev2,N,1.928915,49.94505,0.94,housenumber,8 Rue de l’Eglise 80270 Métigny,80543_0056_00008,G,8 RUE DE L EGLISE,
877805978,00013,87780597800013,O,2019-10-03,,,1629ZA,2019-12-23T10:44:13,false,2,,5,,RUE,QUAYET,80270,METIGNY,,,80543,,,,,,,,,,,,,,,,,,,2019-12-01,F,PLB' CREA BOIS,,,PLB' CREA BOIS,16.29Z,NAFRev2,N,1.927206,49.945441,0.86,housenumber,5 Rue du Quayet 80270 Métigny,80543_0160_00005,G,5 RUE DU QUAYET,
877805978,00021,87780597800021,O,2019-12-01,,,1629ZA,2022-03-05T13:25:23,true,1,,5,,RUE,DU MERMONT,80270,METIGNY,,,80543,,,,,,,,,,,,,,,,,,,2019-12-01,A,PLB' CREA BOIS,,,PLB' CREA BOIS,16.29Z,NAFRev2,N,1.92949,49.945223,0.94,housenumber,5 Rue du Mermont 80270 Métigny,80543_0100_00005,G,5 RUE DU MERMONT,
901909507,00013,90190950700013,O,2021-07-28,,,,2021-07-31T08:32:35,true,1,,13,,RUE,DU MERMONT,80270,METIGNY,,,80543,,,,,,,,,,,,,,,,,,,2021-07-28,A,,,,,68.20B,NAFRev2,N,1.930331,49.946482,0.94,housenumber,13 Rue du Mermont 80270 Métigny,80543_0100_00013,G,13 RUE DU MERMONT,
908046451,00013,90804645100013,P,2021-01-01,,,,2021-12-10T04:11:31,true,1,[ND],[ND],[ND],[ND],[ND],[ND],METIGNY,,[ND],80543,[ND],[ND],,,[ND],[ND],[ND],[ND],[ND],[ND],,,[ND],,[ND],[ND],,,2021-01-01,A,[ND],[ND],[ND],[ND],01.11Z,NAFRev2,N,,,0,,,,,,
919173427,00015,91917342700015,P,2022-10-03,,,,2022-09-13T09:09:34,true,1,[ND],[ND],[ND],[ND],[ND],[ND],METIGNY,,[ND],80543,[ND],[ND],,,[ND],[ND],[ND],[ND],[ND],[ND],,,[ND],,[ND],[ND],,,2022-10-03,A,[ND],[ND],[ND],[ND],70.22Z,NAFRev2,N,,,0,,,,,,
920855806,00013,92085580600013,O,2022-09-19,,,,2022-10-28T08:40:36,true,1,,13,,R,DU MERMONT,80270,METIGNY,,,80543,,,,,,,,,,,,,,,,,,,2022-09-19,A,,,,,68.20B,NAFRev2,N,1.930331,49.946482,0.83,housenumber,13 Rue du Mermont 80270 Métigny,80543_0100_00013,G,13 RUE DU MERMONT,
949104442,00015,94910444200015,O,2023-02-15,,,,2023-06-20T03:46:16,true,1,,1,,RUE,DE L EGLISE,80270,METIGNY,,,80543,,,,,,,,,,,,,,,,,,,2023-02-15,A,,,,,01.11Z,NAFRev2,N,1.927681,49.944529,0.94,housenumber,1 Rue de l’Eglise 80270 Métigny,80543_0056_00001,G,1 RUE DE L EGLISE,
951005123,00017,95100512300017,P,2023-04-17,,,,2023-04-01T16:05:59,true,1,[ND],[ND],[ND],[ND],[ND],[ND],METIGNY,,[ND],80543,[ND],[ND],,,[ND],[ND],[ND],[ND],[ND],[ND],,,[ND],,[ND],[ND],,,2023-04-17,A,[ND],[ND],[ND],[ND],25.62B,NAFRev2,N,,,0,,,,,,
