siren,nic,siret,statutDiffusionEtablissement,dateCreationEtablissement,trancheEffectifsEtablissement,anneeEffectifsEtablissement,activitePrincipaleRegistreMetiersEtablissement,dateDernierTraitementEtablissement,etablissementSiege,nombrePeriodesEtablissement,complementAdresseEtablissement,numeroVoieEtablissement,indiceRepetitionEtablissement,typeVoieEtablissement,libelleVoieEtablissement,codePostalEtablissement,libelleCommuneEtablissement,libelleCommuneEtrangerEtablissement,distributionSpecialeEtablissement,codeCommuneEtablissement,codeCedexEtablissement,libelleCedexEtablissement,codePaysEtrangerEtablissement,libellePaysEtrangerEtablissement,complementAdresse2Etablissement,numeroVoie2Etablissement,indiceRepetition2Etablissement,typeVoie2Etablissement,libelleVoie2Etablissement,codePostal2Etablissement,libelleCommune2Etablissement,libelleCommuneEtranger2Etablissement,distributionSpeciale2Etablissement,codeCommune2Etablissement,codeCedex2Etablissement,libelleCedex2Etablissement,codePaysEtranger2Etablissement,libellePaysEtranger2Etablissement,dateDebut,etatAdministratifEtablissement,enseigne1Etablissement,enseigne2Etablissement,enseigne3Etablissement,denominationUsuelleEtablissement,activitePrincipaleEtablissement,nomenclatureActivitePrincipaleEtablissement,caractereEmployeurEtablissement,longitude,latitude,geo_score,geo_type,geo_adresse,geo_id,geo_ligne,geo_l4,geo_l5
218801694,00017,21880169400017,O,1983-03-01,02,2020,,2022-08-29T09:09:22,true,3,,97,,,GRANDE RUE,88600,FAYS,,,88169,,,,,,,,,,,,,,,,,,,2008-01-01,A,MAIRIE,,,,84.11Z,NAFRev2,O,6.675017,48.192719,0.94,housenumber,97 Grande Rue 88600 Fays,88169_0004_00097,G,97 GRANDE RUE,
218801694,00025,21880169400025,O,1983-12-21,NN,,,,false,4,,97,,,GRANDE RUE,88600,FAYS,,,88169,,,,,,,,,,,,,,,,,,,1999-09-01,F,ECOLE PRIMAIRE PUBLIQUE,,,,80.1Z,NAF1993,N,6.675017,48.192719,0.94,housenumber,97 Grande Rue 88600 Fays,88169_0004_00097,G,97 GRANDE RUE,
218801694,00033,21880169400033,O,1997-01-01,NN,,,2008-01-04T18:44:46,false,3,,97,,,GRANDE RUE,88600,FAYS,,,88169,,,,,,,,,,,,,,,,,,,2008-01-01,A,SCE EAUX,,,,36.00Z,NAFRev2,N,6.675017,48.192719,0.94,housenumber,97 Grande Rue 88600 Fays,88169_0004_00097,G,97 GRANDE RUE,
218801694,00041,21880169400041,O,1997-01-01,NN,,,2008-01-04T18:44:46,false,3,,97,,,GRANDE RUE,88600,FAYS,,,88169,,,,,,,,,,,,,,,,,,,2008-01-01,A,SCE ORDURES MENAGERES,,,,38.11Z,NAFRev2,N,6.675017,48.192719,0.94,housenumber,97 Grande Rue 88600 Fays,88169_0004_00097,G,97 GRANDE RUE,
268802626,00013,26880262600013,O,1992-01-01,NN,,,2016-07-23T12:07:54,true,4,MAIRIE,97,,,GRANDE RUE,88600,FAYS,,,88169,,,,,,,,,,,,,,,,,,,2016-01-01,F,CCAS,,,,88.99B,NAFRev2,N,6.675017,48.192719,0.94,housenumber,97 Grande Rue 88600 Fays,88169_0004_00097,G,97 GRANDE RUE,
305440562,00018,30544056200018,O,1954-01-01,NN,,,2008-08-18T13:46:12,false,2,,520,,,GRANDE RUE,88600,FAYS,,,88169,,,,,,,,,,,,,,,,,,,1989-06-13,F,,,,,,,,6.675038,48.194549,0.94,street,Grande Rue 88600 Fays,88169_0004,G,GRANDE RUE,
305440562,00026,30544056200026,O,2000-01-01,NN,,,2023-05-05T20:16:51,true,4,,520,,,GRANDE RUE,88600,FAYS,,,88169,,,,,,,,,,,,,,,,,,,2019-12-25,F,,,,,46.18Z,NAFRev2,N,6.675038,48.194549,0.94,street,Grande Rue 88600 Fays,88169_0004,G,GRANDE RUE,
305441644,00013,30544164400013,O,,NN,,,,true,1,,,,,,88600,FAYS,,,88169,,,,,,,,,,,,,,,,,,,1986-03-12,F,,,,,81.21,NAP,N,,,0,,,,,,
306340472,00019,30634047200019,O,,NN,,,,true,1,,,,,,88600,FAYS,,,88169,,,,,,,,,,,,,,,,,,,,F,,,,,64.24,NAP,N,,,0,,,,,,
307252940,00019,30725294000019,O,,NN,,,,true,1,,,,,,88600,FAYS,,,88169,,,,,,,,,,,,,,,,,,,1987-12-25,F,,,,,64.11,NAP,N,,,0,,,,,,
309815322,00016,30981532200016,O,,,,,,true,1,,,,,,88600,FAYS,,,88169,,,,,,,,,,,,,,,,,,,1987-09-22,F,,,,,69.11,NAP,N,,,0,,,,,,
315603035,00074,31560303500074,O,2009-04-24,,,,2011-01-26T19:42:16,true,2,,280,,RUE,DE LA ROCHE,88600,FAYS,,,88169,,,,,,,,,,,,,,,,,,,2011-01-31,F,PVM-AUTOS,,,,45.20A,NAFRev2,O,6.672542,48.19026,0.94,housenumber,280 Rue de la Roche 88600 Fays,88169_0007_00280,G,280 RUE DE LA ROCHE,
318274321,00021,31827432100021,O,1989-08-16,NN,,,2008-11-07T00:34:00,true,4,,441,,RUE,DU TINTURRON,88600,FAYS,,,88169,,,,,,,,,,,,,,,,,,,2004-12-31,F,,,,,20.1A,NAFRev1,N,6.67976,48.198901,0.86,housenumber,441 Rue du Tinturon 88600 Fays,88169_0010_00441,G,441 RUE DU TINTURON,
332767748,00020,33276774800020,O,,NN,,,,true,1,,56,,,RUELLE DU PAQUIS,88600,FAYS,,,88169,,,,,,,,,,,,,,,,,,,1989-09-05,F,,,,,58.04,NAP,N,6.673807,48.196357,0.94,housenumber,56 Ruelle du Paquis 88600 Fays,88169_0009_00056,G,56 RUELLE DU PAQUIS,
335305314,00031,33530531400031,P,2021-10-23,,,,2022-03-09T13:37:14,true,1,[ND],[ND],[ND],[ND],[ND],[ND],FAYS,,[ND],88169,[ND],[ND],,,[ND],[ND],[ND],[ND],[ND],[ND],,,[ND],,[ND],[ND],,,2021-10-23,A,[ND],[ND],[ND],[ND],55.20Z,NAFRev2,N,,,0,,,,,,
344239181,00011,34423918100011,O,1988-03-17,NN,,,2011-04-23T06:23:23,true,5,,50,R,RTE,DE FAYS,88600,FAYS,,,88169,,,,,,,,,,,,,,,,,,,2008-12-09,F,,,,,49.41A,NAFRev2,O,6.684393,48.190363,0.6,street,Route de Fays 88600 Fays,88169_0003,G,ROUTE DE FAYS,
347636292,00018,34763629200018,O,1988-07-25,NN,,,2014-07-08T00:50:46,true,4,,286,,,LA CROIX LIEGEY,88600,FAYS,,,88169,,,,,,,,,,,,,,,,,,,2008-01-01,A,GARAGE SALVESTRONI NEG VEHICULES OC,,,,45.11Z,NAFRev2,N,6.673217,48.197752,0.88,housenumber,286 Rue de la Croix Liegey 88600 Fays,88169_jn4pl3_00286,G,286 RUE DE LA CROIX LIEGEY,
348104431,00013,34810443100013,O,1900-01-01,NN,,,2013-08-28T09:16:19,false,3,,56,,RUE,DU PAQUIS,88600,FAYS,,,88169,,,,,,,,,,,,,,,,,,,1989-12-25,F,,,,,60.09,NAP,N,6.673807,48.196357,0.88,housenumber,56 Ruelle du Paquis 88600 Fays,88169_0009_00056,G,56 RUELLE DU PAQUIS,
378111553,00038,37811155300038,O,1999-09-01,NN,,,,false,4,,315,,RUE,DU TINTURON,88600,FAYS,,,88169,,,,,,,,,,,,,,,,,,,2003-04-01,F,,,,,85.1G,NAFRev1,N,6.678282,48.19834,0.94,housenumber,315 Rue du Tinturon 88600 Fays,88169_0010_00315,G,315 RUE DU TINTURON,
394623839,00013,39462383900013,O,1994-04-01,NN,,,2020-08-25T10:29:15,true,5,,411,,,LES MAUVAIS BLES,88600,FAYS,,,88169,,,,,,,,,,,,,,,,,,,2018-07-27,F,,,,,43.34Z,NAFRev2,O,6.669511,48.195705,0.84,housenumber,411 Rue des Mauvais Blés 88600 Fays,88169_0005_00411,G,411 RUE DES MAUVAIS BLES,
404452799,00038,40445279900038,O,2022-09-07,,,,2023-01-03T15:53:06,true,1,,202,,RUE,DE LA BASSE,88600,FAYS,,,88169,,,,,,,,,,,,,,,,,,,2022-09-07,A,,,,PM SERVICE,46.19B,NAFRev2,N,6.670185,48.190678,0.94,housenumber,202 Rue de la Basse 88600 Fays,88169_0001_00202,G,202 RUE DE LA BASSE,
407787803,00011,40778780300011,O,1996-06-17,NN,,,,true,1,,235,,RUE,DU TINTURON,88600,FAYS,,,88169,,,,,,,,,,,,,,,,,,,2000-12-31,F,,,,,70.2A,NAF1993,N,6.6773,48.198435,0.94,housenumber,235 Rue du Tinturon 88600 Fays,88169_0010_00235,G,235 RUE DU TINTURON,
407924109,00017,40792410900017,O,,NN,,,,true,1,,,,,,88600,FAYS,,,88169,,,,,,,,,,,,,,,,,,,1996-05-31,F,,,,,01.1A,NAF1993,N,,,0,,,,,,
413353236,00016,41335323600016,O,1997-07-04,NN,,,2022-08-02T09:21:52,true,3,,50,,RTE,DE FAYS,88600,FAYS,,,88169,,,,,,,,,,,,,,,,,,,2008-01-01,A,,,,,68.20A,NAFRev2,N,6.685711,48.190028,0.81,housenumber,50 Route de Fays 88600 Fays,88169_0003_00050,G,50 ROUTE DE FAYS,
415003193,00018,41500319300018,O,1992-01-01,NN,,,2008-01-04T22:57:34,true,3,,,,,MAISON POUR TOUS,88600,FAYS,,,88169,,,,,,,,,,,,,,,,,,,2008-01-01,A,,,,,93.12Z,NAFRev2,N,5.5923637,47.4422881,0.9,poi.park,Parc Maison pour Tous Gray,https://osm.org/way/40552542,G,,
430621235,00018,43062123500018,O,1982-07-01,NN,,,2006-12-20T10:13:13,true,3,,,,,L ETANG,88600,FAYS,,,88169,,,,,,,,,,,,,,,,,,,2005-12-31,F,,,,,70.2A,NAFRev1,N,2.2978905,44.4487282,0.9,poi.water,L'Étang (Eau) Bournazel,https://osm.org/way/42253212,G,,
432664860,00017,43266486000017,O,2000-09-01,NN,,,2016-02-22T10:20:33,false,3,,509,,RUE,DES MAUVAIS BLES,88600,FAYS,,,88169,,,,,,,,,,,,,,,,,,,2004-09-30,F,,,,,50.1Z,NAFRev1,N,6.668363,48.195647,0.94,housenumber,509 Rue des Mauvais Blés 88600 Fays,88169_0005_00509,G,509 RUE DES MAUVAIS BLES,
477629109,00018,47762910900018,O,2004-06-10,NN,,,2008-01-05T03:24:20,true,3,,64,,RUE,DE LA CREUSE,88600,FAYS,,,88169,,,,,,,,,,,,,,,,,,,2008-01-01,A,,,,,90.01Z,NAFRev2,N,6.674829,48.193426,0.94,housenumber,64 Rue de la Creuse 88600 Fays,88169_0002_00064,G,64 RUE DE LA CREUSE,
488585720,00011,48858572000011,O,1982-01-01,,,,2008-01-05T02:41:21,true,2,GRANMOUGIN PATRICK P ASS CAPS DOCELLES,719,,RUE,DES MAUVAIS BLES,88600,FAYS,,,88169,,,,,,,,,,,,,,,,,,,2008-01-01,A,,,,,93.12Z,NAFRev2,N,6.666816,48.194359,0.94,housenumber,719 Rue des Mauvais Blés 88600 Fays,88169_0005_00719,G,719 RUE DES MAUVAIS BLES,
493554240,00017,49355424000017,O,2007-01-02,,,,2020-09-19T03:52:59,true,4,,8,,RUE,DE LA FONTAINE,88600,FAYS,,,88169,,,,,,,,,,,,,,,,,,,2020-07-31,F,,,,,66.22Z,NAFRev2,N,6.675263,48.194692,0.94,housenumber,8 Rue de la Fontaine 88600 Fays,88169_v6zndi_00008,G,8 RUE DE LA FONTAINE,
502351521,00013,50235152100013,O,2007-12-02,,,,2008-02-01T14:57:14,true,1,MARCEL DURAND,74,,RUE,DE LA FONTAINE,88600,FAYS,,,88169,,,,,,,,,,,,,,,,,,,2007-12-02,A,,,,,94.99Z,NAFRev2,N,6.675886,48.19533,0.94,housenumber,74 Rue de la Fontaine 88600 Fays,88169_v6zndi_00074,G,74 RUE DE LA FONTAINE,
521005397,00018,52100539700018,O,2010-04-01,,,,2010-03-16T08:30:46,true,1,,,,,,88600,FAYS,,,88169,,,,,,,,,,,,,,,,,,,2010-04-01,A,RUCHER DU PRE DES JONCS,,,,01.49Z,NAFRev2,N,,,0,,,,,,
525226205,00017,52522620500017,O,2010-09-30,,,,2016-04-22T04:50:18,true,2,,387,,,GRANDE RUE,88600,FAYS,,,88169,,,,,,,,,,,,,,,,,,,2014-09-01,F,,,,,56.21Z,NAFRev2,N,6.674859,48.195149,0.94,housenumber,387 Grande Rue 88600 Fays,88169_0004_00387,G,387 GRANDE RUE,
533122198,00013,53312219800013,O,2011-09-01,,,,2014-01-03T09:30:03,false,2,DU TINTURON,185,,,RUE,88600,FAYS,,,88169,,,,,,,,,,,,,,,,,,,2014-01-02,F,,,,,96.09Z,NAFRev2,N,6.676603,48.198215,0.91,housenumber,185 Rue du Tinturon 88600 Fays,88169_0010_00185,G,185 RUE DU TINTURON,
533594339,00012,53359433900012,P,2011-08-01,,,,2015-06-15T19:29:47,false,2,[ND],[ND],[ND],[ND],[ND],[ND],FAYS,,[ND],88169,[ND],[ND],,,[ND],[ND],[ND],[ND],[ND],[ND],,,[ND],,[ND],[ND],,,2015-05-26,F,[ND],[ND],[ND],[ND],85.51Z,NAFRev2,N,,,0,,,,,,
751520313,00014,75152031300014,O,2012-05-14,,,,2021-05-17T16:01:03,true,3,,193,,RUE,DE LA ROCHE,88600,FAYS,,,88169,,,,,,,,,,,,,,,,,,,2021-03-12,A,,,,JP VERT SERVICES - JP BOIS VOSGIEN,81.30Z,NAFRev2,N,6.673159,48.190647,0.94,housenumber,193 Rue de la Roche 88600 Fays,88169_0007_00193,G,193 RUE DE LA ROCHE,
783442189,00016,78344218900016,O,,,,,,true,1,,,,,,88600,FAYS,,,88169,,,,,,,,,,,,,,,,,,,1985-12-25,F,,,,,55.71,NAP,N,,,0,,,,,,
783442197,00019,78344219700019,O,,NN,,,,true,1,,,,,,88600,FAYS,,,88169,,,,,,,,,,,,,,,,,,,,F,,,,,55.71,NAP,N,,,0,,,,,,
791573199,00019,79157319900019,O,2013-01-25,,,,2013-03-05T09:26:10,true,1,,2,,RUE,TINTURION,88600,FAYS,,,88169,,,,,,,,,,,,,,,,,,,2013-01-25,A,,,,,35.11Z,NAFRev2,N,6.675247,48.197047,0.71,housenumber,2 Rue du Tinturon 88600 Fays,88169_0010_00002,G,2 RUE DU TINTURON,
795329424,00019,79532942400019,O,2013-06-24,,,,2023-07-03T21:36:35,true,2,,411,,RUE,DES MAUVAIS BLES,88600,FAYS,,,88169,,,,,,,,,,,,,,,,,,,2017-12-25,F,,,,,35.11Z,NAFRev2,N,6.669511,48.195705,0.94,housenumber,411 Rue des Mauvais Blés 88600 Fays,88169_0005_00411,G,411 RUE DES MAUVAIS BLES,
798073219,00015,79807321900015,P,2013-10-14,,,,2021-10-06T15:13:46,false,2,[ND],[ND],[ND],[ND],[ND],[ND],FAYS,,[ND],88169,[ND],[ND],,,[ND],[ND],[ND],[ND],[ND],[ND],,,[ND],,[ND],[ND],,,2017-12-31,F,[ND],[ND],[ND],[ND],32.13Z,NAFRev2,N,,,0,,,,,,
803492735,00029,80349273500029,O,2022-04-21,,,,2022-04-11T09:53:39,true,1,,142,,,GRAND RUE,88600,FAYS,,,88169,,,,,,,,,,,,,,,,,,,2022-04-21,A,"LE BOOK TRUCK, LIBRAIRIE D'OCCASION",,,LE BOOK TRUCK,47.61Z,NAFRev2,N,6.675621,48.192839,0.81,housenumber,142 Grande Rue 88600 Fays,88169_0004_00142,G,142 GRANDE RUE,
804454270,00039,80445427000039,P,2021-01-01,,,,2021-04-07T10:03:11,true,1,[ND],[ND],[ND],[ND],[ND],[ND],FAYS,,[ND],88169,[ND],[ND],,,[ND],[ND],[ND],[ND],[ND],[ND],,,[ND],,[ND],[ND],,,2021-01-01,A,[ND],[ND],[ND],[ND],81.29B,NAFRev2,N,,,0,,,,,,
810115139,00018,81011513900018,O,2015-03-01,,,,2015-03-11T08:26:42,true,1,,387,,,GRAND RUE,88600,FAYS,,,88169,,,,,,,,,,,,,,,,,,,2015-03-01,A,,,,,47.99A,NAFRev2,N,6.674859,48.195149,0.81,housenumber,387 Grande Rue 88600 Fays,88169_0004_00387,G,387 GRANDE RUE,
828266817,00026,82826681700026,O,2017-02-11,,,,2021-02-23T17:47:21,true,1,,147,,RUE,DES MAUVAIS BLES,88600,FAYS,,,88169,,,,,,,,,,,,,,,,,,,2017-02-11,A,,,,,85.51Z,NAFRev2,N,6.6731,48.19574,0.94,housenumber,147 Rue des Mauvais Blés 88600 Fays,88169_0005_00147,G,147 RUE DES MAUVAIS BLES,
834847659,00010,83484765900010,O,2017-12-28,,,,2023-09-25T08:41:22,true,2,,719,,RUE,DU MAUVAIS BLE,88600,FAYS,,,88169,,,,,,,,,,,,,,,,,,,2020-01-01,F,,,,,47.99A,NAFRev2,N,6.666816,48.194359,0.79,housenumber,719 Rue des Mauvais Blés 88600 Fays,88169_0005_00719,G,719 RUE DES MAUVAIS BLES,
879534683,00013,87953468300013,P,2019-12-01,,,,2020-10-13T08:38:16,true,2,[ND],[ND],[ND],[ND],[ND],[ND],FAYS,,[ND],88169,[ND],[ND],,,[ND],[ND],[ND],[ND],[ND],[ND],,,[ND],,[ND],[ND],,,2020-10-01,F,[ND],[ND],[ND],[ND],90.03B,NAFRev2,N,,,0,,,,,,
879873511,00015,87987351100015,O,2020-01-02,,,,2020-01-31T04:00:08,true,1,,8,,RUE,DE LA FONTAINE,88600,FAYS,,,88169,,,,,,,,,,,,,,,,,,,2020-01-02,A,,,,FAYS ASSUR,66.22Z,NAFRev2,N,6.675263,48.194692,0.94,housenumber,8 Rue de la Fontaine 88600 Fays,88169_v6zndi_00008,G,8 RUE DE LA FONTAINE,
889542544,00016,88954254400016,P,2020-10-01,,,,2020-10-02T08:40:16,true,1,[ND],[ND],[ND],[ND],[ND],[ND],FAYS,,[ND],88169,[ND],[ND],,,[ND],[ND],[ND],[ND],[ND],[ND],,,[ND],,[ND],[ND],,,2020-10-01,A,[ND],[ND],[ND],[ND],58.14Z,NAFRev2,N,,,0,,,,,,
892329475,00016,89232947500016,O,2021-01-01,,,,2020-12-24T03:43:52,true,1,,31,,CHE,DE SAINT PIERREMONT,88600,FAYS,,,88169,,,,,,,,,,,,,,,,,,,2021-01-01,A,,,,,01.49Z,NAFRev2,N,6.669873,48.190457,0.87,housenumber,31 Chemin de Saint Pierremont 88600 Fays,88169_0006_00031,G,31 CHEMIN DE SAINT PIERREMONT,
892599218,00013,89259921800013,O,2020-12-18,,,,2021-08-13T08:46:55,true,1,,609,,RUE,DES MAUVAIS BLES,88600,FAYS,,,88169,,,,,,,,,,,,,,,,,,,2020-12-18,A,,,,,90.02Z,NAFRev2,O,6.667571,48.195069,0.94,housenumber,609 Rue des Mauvais Blés 88600 Fays,88169_0005_00609,G,609 RUE DES MAUVAIS BLES,
895249886,00014,89524988600014,O,2021-02-16,,,,2022-04-30T04:10:51,false,2,,227,,RUE,DU TINTURON,88600,FAYS,,,88169,,,,,,,,,,,,,,,,,,,2022-03-26,F,,,,,68.31Z,NAFRev2,N,6.677128,48.198506,0.94,housenumber,227 Rue du Tinturon 88600 Fays,88169_0010_00227,G,227 RUE DU TINTURON,
901433185,00013,90143318500013,O,2021-06-01,,,8129BP,2021-07-16T09:33:46,true,1,,78,,CHE,DE ST PIERREMONT,88600,FAYS,,,88169,,,,,,,,,,,,,,,,,,,2021-06-01,A,,,,EXCELSIOR SEV,81.21Z,NAFRev2,N,6.669064,48.190018,0.79,housenumber,78 Chemin de Saint Pierremont 88600 Fays,88169_0006_00078,G,78 CHEMIN DE SAINT PIERREMONT,
904433323,00014,90443332300014,O,2021-10-18,,,,2021-10-22T08:37:00,true,1,,86,,RUE,DE LA CROIX LIEGEY,88600,FAYS,,,88169,,,,,,,,,,,,,,,,,,,2021-10-18,A,,,,,66.30Z,NAFRev2,N,6.673828,48.196712,0.94,housenumber,86 Rue de la Croix Liegey 88600 Fays,88169_jn4pl3_00086,G,86 RUE DE LA CROIX LIEGEY,
911406056,00018,91140605600018,O,2022-03-14,,,,2022-03-16T10:52:42,true,1,,526,,,GRAND RUE,88600,FAYS,,,88169,,,,,,,,,,,,,,,,,,,2022-03-14,A,CELINE BENOIT,,,,01.50Z,NAFRev2,N,6.67489,48.19633,0.81,housenumber,526 Grande Rue 88600 Fays,88169_0004_00526,G,526 GRANDE RUE,
914057591,00010,91405759100010,O,1986-06-02,,,,2022-06-01T08:39:37,true,1,MAISON POUR TOUS,82,,,GRANDE RUE,88600,FAYS,,,88169,,,,,,,,,,,,,,,,,,,1986-06-02,A,,,,,93.29Z,NAFRev2,N,6.674744,48.192494,0.94,housenumber,82 Grande Rue 88600 Fays,88169_0004_00082,G,82 GRANDE RUE,
921009577,00013,92100957700013,O,2022-10-01,,,4391AZ,2022-11-03T04:25:51,true,1,,259,,,GRANDE RUE,88600,FAYS,,,88169,,,,,,,,,,,,,,,,,,,2022-10-01,A,,,,LF CHARPENTE,43.91A,NAFRev2,N,6.675293,48.194034,0.94,housenumber,259 Grande Rue 88600 Fays,88169_0004_00259,G,259 GRANDE RUE,
922381017,00016,92238101700016,O,2022-12-16,,,,2022-12-21T08:40:56,true,1,,64,,RUE,DE LA CREUSE,88600,FAYS,,,88169,,,,,,,,,,,,,,,,,,,2022-12-16,A,,,,RICHARD NORMAN,93.29Z,NAFRev2,N,6.674829,48.193426,0.94,housenumber,64 Rue de la Creuse 88600 Fays,88169_0002_00064,G,64 RUE DE LA CREUSE,
952939205,00011,95293920500011,O,2023-06-01,,,,2023-06-03T13:24:12,true,1,,64,,RUE,DE LA CREUSE,88600,FAYS,,,88169,,,,,,,,,,,,,,,,,,,2023-06-01,A,,,,MECA RICHARD,45.20A,NAFRev2,N,6.674829,48.193426,0.94,housenumber,64 Rue de la Creuse 88600 Fays,88169_0002_00064,G,64 RUE DE LA CREUSE,
