siren,nic,siret,statutDiffusionEtablissement,dateCreationEtablissement,trancheEffectifsEtablissement,anneeEffectifsEtablissement,activitePrincipaleRegistreMetiersEtablissement,dateDernierTraitementEtablissement,etablissementSiege,nombrePeriodesEtablissement,complementAdresseEtablissement,numeroVoieEtablissement,indiceRepetitionEtablissement,typeVoieEtablissement,libelleVoieEtablissement,codePostalEtablissement,libelleCommuneEtablissement,libelleCommuneEtrangerEtablissement,distributionSpecialeEtablissement,codeCommuneEtablissement,codeCedexEtablissement,libelleCedexEtablissement,codePaysEtrangerEtablissement,libellePaysEtrangerEtablissement,complementAdresse2Etablissement,numeroVoie2Etablissement,indiceRepetition2Etablissement,typeVoie2Etablissement,libelleVoie2Etablissement,codePostal2Etablissement,libelleCommune2Etablissement,libelleCommuneEtranger2Etablissement,distributionSpeciale2Etablissement,codeCommune2Etablissement,codeCedex2Etablissement,libelleCedex2Etablissement,codePaysEtranger2Etablissement,libellePaysEtranger2Etablissement,dateDebut,etatAdministratifEtablissement,enseigne1Etablissement,enseigne2Etablissement,enseigne3Etablissement,denominationUsuelleEtablissement,activitePrincipaleEtablissement,nomenclatureActivitePrincipaleEtablissement,caractereEmployeurEtablissement,longitude,latitude,geo_score,geo_type,geo_adresse,geo_id,geo_ligne,geo_l4,geo_l5
210103297,00011,21010329700011,O,1983-03-01,02,2021,,2023-11-27T13:19:04,true,3,,2,,RUE,HENRI BIDAULD,01510,ROSSILLON,,,01329,,,,,,,,,,,,,,,,,,,2008-01-01,A,MAIRIE,,,,84.11Z,NAFRev2,O,5.591737,45.833588,0.95,housenumber,2 Rue Henri Bidauld 01510 Rossillon,01329_0035_00002,G,2 RUE HENRI BIDAULD,
210103297,00029,21010329700029,O,1997-01-01,NN,,,2018-05-15T11:08:35,false,3,MAIRIE,2,,RUE,HENRI BIDAULD,01510,ROSSILLON,,,01329,,,,,,,,,,,,,,,,,,,2008-01-01,A,SCE ASSAINISSEMENT,,,,36.00Z,NAFRev2,N,5.591737,45.833588,0.95,housenumber,2 Rue Henri Bidauld 01510 Rossillon,01329_0035_00002,G,2 RUE HENRI BIDAULD,
210103297,00037,21010329700037,O,2018-04-13,,,,2023-03-08T14:01:59,false,1,MAIRIE,2,,RUE,HENRI BIDAULD,01510,ROSSILLON,,,01329,,,,,,,,,,,,,,,,,,,2018-04-13,A,COMMERCE MULTISERVICE,,,,68.20B,NAFRev2,N,5.591737,45.833588,0.95,housenumber,2 Rue Henri Bidauld 01510 Rossillon,01329_0035_00002,G,2 RUE HENRI BIDAULD,
250100872,00010,25010087200010,O,1983-03-01,01,2021,,2023-11-27T13:26:48,true,4,,,,,HOTEL DE VILLE,01510,ROSSILLON,,,01329,,,,,,,,,,,,,,,,,,,2023-02-02,F,,,,,36.00Z,NAFRev2,N,5.608619,45.843079,0.38,street,Allee de la Chapelle 01510 Rossillon,01329_0010,G,ALLEE DE LA CHAPELLE,
260104468,00012,26010446800012,O,1987-01-01,NN,,,2017-08-06T14:05:49,true,4,MAIRIE,,,,,01510,ROSSILLON,,,01329,,,,,,,,,,,,,,,,,,,2017-08-01,F,CCAS,,,,88.99B,NAFRev2,N,,,0,,,,,,
310924147,00047,31092414700047,P,1983-06-01,NN,,,2008-11-07T00:25:53,false,4,[ND],[ND],[ND],[ND],[ND],[ND],ROSSILLON,,[ND],01329,[ND],[ND],,,[ND],[ND],[ND],[ND],[ND],[ND],,,[ND],,[ND],[ND],,,2004-12-01,F,[ND],[ND],[ND],[ND],45.4C,NAFRev1,O,,,0,,,,,,
310924147,00070,31092414700070,P,2020-09-01,,,8121ZZ,2021-02-23T10:38:56,true,1,[ND],[ND],[ND],[ND],[ND],[ND],ROSSILLON,,[ND],01329,[ND],[ND],,,[ND],[ND],[ND],[ND],[ND],[ND],,,[ND],,[ND],[ND],,,2020-09-01,A,[ND],[ND],[ND],[ND],81.21Z,NAFRev2,N,,,0,,,,,,
315785329,00022,31578532900022,O,2009-04-07,NN,,,2014-01-17T03:51:22,true,2,,,,,EGIEU,01510,ROSSILLON,,,01329,,,,,,,,,,,,,,,,,,,2011-12-31,F,,,,,01.45Z,NAFRev2,N,5.596596,45.830073,0.43,street,Route de Cheignieu 01510 Rossillon,01329_0020,G,ROUTE DE CHEIGNIEU,
316646470,00039,31664647000039,O,1990-01-01,NN,,,2009-05-27T16:26:49,false,6,,,,LD,CHEF LIEU,01510,ROSSILLON,,,01329,,,,,,,,,,,,,,,,,,,2009-06-01,F,,,,,68.20B,NAFRev2,N,5.596596,45.830073,0.45,street,Route de Cheignieu 01510 Rossillon,01329_0020,G,ROUTE DE CHEIGNIEU,
316646470,00062,31664647000062,O,2020-11-06,,,,2021-02-23T10:41:56,true,1,,3,,RUE,HENRI BIDAULD,01510,ROSSILLON,,,01329,,,,,,,,,,,,,,,,,,,2020-11-06,A,,,,,43.34Z,NAFRev2,N,5.592535,45.833047,0.95,housenumber,3 Rue Henri Bidauld 01510 Rossillon,01329_0035_00003,G,3 RUE HENRI BIDAULD,
342660115,00045,34266011500045,O,2015-08-05,,,,2021-02-23T10:58:06,true,1,EGIEU,13,,CHE,DE RAVIERE,01510,ROSSILLON,,,01329,,,,,,,,,,,,,,,,,,,2015-08-05,A,,,,,43.12A,NAFRev2,N,5.609553,45.843375,0.83,housenumber,13 Chemin de Raviere 01510 Rossillon,01329_0065_00013,G,13 CHEMIN DE RAVIERE,
344550074,00027,34455007400027,O,2007-09-01,,,8121ZZ,2023-11-14T19:47:01,true,5,,31,,RUE,HENRI BIDAULD,01510,ROSSILLON,,,01329,,,,,,,,,,,,,,,,,,,2023-10-30,F,,,,,81.21Z,NAFRev2,N,5.593529,45.832146,0.95,housenumber,31 Rue Henri Bidauld 01510 Rossillon,01329_0035_00031,G,31 RUE HENRI BIDAULD,
350182549,00013,35018254900013,O,1989-05-01,NN,,,2022-06-22T15:33:50,true,3,RN 504,,,LD,ROSSILLON GARE,01510,ROSSILLON,,,01329,,,,,,,,,,,,,,,,,,,1992-11-05,F,,,,,55.3A,NAF1993,,5.595828,45.828585,0.82,street,Place de la Gare 01510 Rossillon,01329_0047,G,PLACE DE LA GARE,
388940132,00011,38894013200011,O,1992-09-21,NN,,,,true,4,,,,,ROSSILLON GARE,01510,ROSSILLON,,,01329,,,,,,,,,,,,,,,,,,,2001-01-11,F,,,,,55.3B,NAF1993,O,5.595828,45.828585,0.82,street,Place de la Gare 01510 Rossillon,01329_0047,G,PLACE DE LA GARE,
394569651,00018,39456965100018,O,,NN,,,,true,1,,,,,,01510,ROSSILLON,,,01329,,,,,,,,,,,,,,,,,,,1996-03-31,F,,,,,52.2P,NAF1993,N,,,0,,,,,,
402111892,00020,40211189200020,O,2007-01-02,,,4334ZC,2021-02-23T11:26:13,true,2,,,,,CHEF LIEU,01510,ROSSILLON,,,01329,,,,,,,,,,,,,,,,,,,2008-01-01,A,,,,,43.34Z,NAFRev2,N,5.596596,45.830073,0.45,street,Route de Cheignieu 01510 Rossillon,01329_0020,G,ROUTE DE CHEIGNIEU,
408557684,00011,40855768400011,O,1996-07-18,NN,,,,true,3,,,,,EGIEU,01510,ROSSILLON,,,01329,,,,,,,,,,,,,,,,,,,2003-01-10,F,,,,,01.2C,NAFRev1,N,5.596596,45.830073,0.43,street,Route de Cheignieu 01510 Rossillon,01329_0020,G,ROUTE DE CHEIGNIEU,
420408882,00017,42040888200017,O,1998-10-01,NN,,,2008-01-05T20:39:15,true,3,,,,,,01510,ROSSILLON,,,01329,,,,,,,,,,,,,,,,,,,2008-01-01,A,,,,,68.20B,NAFRev2,N,,,0,,,,,,
423567205,00012,42356720500012,O,1999-05-01,,,,2009-05-11T14:50:00,true,2,,,,,EGIEU,01510,ROSSILLON,,,01329,,,,,,,,,,,,,,,,,,,1999-12-25,F,,,,,01.2A,NAF1993,N,5.596596,45.830073,0.43,street,Route de Cheignieu 01510 Rossillon,01329_0020,G,ROUTE DE CHEIGNIEU,
424442762,00342,42444276200342,O,2017-03-06,,,,2021-03-17T11:48:56,false,2,,,,,EGIEU,01510,ROSSILLON,,,01329,,,,,,,,,,,,,,,,,,,2021-03-01,F,,,,PAR EOLIEN DE RAVIERE 2,35.11Z,NAFRev2,N,5.596596,45.830073,0.43,street,Route de Cheignieu 01510 Rossillon,01329_0020,G,ROUTE DE CHEIGNIEU,
484508429,00012,48450842900012,O,2005-04-01,,,,2008-05-07T04:59:47,false,2,,,,,EGIEU,01510,ROSSILLON,,,01329,,,,,,,,,,,,,,,,,,,2008-01-01,A,,,,,01.45Z,NAFRev2,N,5.596596,45.830073,0.43,street,Route de Cheignieu 01510 Rossillon,01329_0020,G,ROUTE DE CHEIGNIEU,
485359764,00019,48535976400019,O,2005-10-01,NN,,,2009-06-27T12:35:24,false,2,,,,,,01510,ROSSILLON,,,01329,,,,,,,,,,,,,,,,,,,2007-09-28,F,,,,,45.4J,NAFRev1,O,,,0,,,,,,
488001900,00015,48800190000015,O,2005-12-17,,,,2018-09-28T04:06:02,true,2,,,,,,01510,ROSSILLON,,,01329,,,,,,,,,,,,,,,,,,,2008-01-01,A,,,,,68.20B,NAFRev2,N,,,0,,,,,,
488076241,00014,48807624100014,O,2006-01-23,02,2021,,2023-11-27T13:39:49,true,3,,27,,RUE,HENRI BIDAULD,01510,ROSSILLON,,,01329,,,,,,,,,,,,,,,,,,,2008-03-03,A,,,,,71.20B,NAFRev2,O,5.593386,45.832285,0.95,housenumber,27 Rue Henri Bidauld 01510 Rossillon,01329_0035_00027,G,27 RUE HENRI BIDAULD,
493835227,00015,49383522700015,O,2007-01-01,,,,2010-07-09T14:36:02,false,2,,,,,LE BOURG,01510,ROSSILLON,,,01329,,,,,,,,,,,,,,,,,,,2008-01-01,A,NATH POINT BROD,,,,90.03B,NAFRev2,N,5.592638,45.833017,0.3,street,Le Grapillon 01510 Rossillon,01329_wwkhqx,G,LE GRAPILLON,
493835227,00023,49383522700023,O,2010-06-19,,,9003AP,2019-07-02T10:55:42,true,2,,4,,RUE,JOSEPHIN SOULARY,01510,ROSSILLON,,,01329,,,,,,,,,,,,,,,,,,,2019-05-15,A,,,,,13.99Z,NAFRev2,N,5.594329,45.83087,0.93,housenumber,4 Rue Josephin Soulary 01510 Rossillon,01329_0040_00004,G,4 RUE JOSEPHIN SOULARY,
494102833,00014,49410283300014,O,2007-02-01,,,,2009-04-06T11:40:29,false,3,,,,,CHEF LIEU,01510,ROSSILLON,,,01329,,,,,,,,,,,,,,,,,,,2009-03-01,F,SOLAIR,,,,85.59A,NAFRev2,N,5.596596,45.830073,0.45,street,Route de Cheignieu 01510 Rossillon,01329_0020,G,ROUTE DE CHEIGNIEU,
500860481,00018,50086048100018,O,2007-01-01,,,,2015-07-28T03:32:54,true,3,LES LOUPS BLEUS,,,,CHEF LIEU,01510,ROSSILLON,,,01329,,,,,,,,,,,,,,,,,,,2015-06-23,F,,,,,85.52Z,NAFRev2,N,5.596596,45.830073,0.45,street,Route de Cheignieu 01510 Rossillon,01329_0020,G,ROUTE DE CHEIGNIEU,
502314297,00024,50231429700024,O,2017-07-27,,,,2021-03-24T08:52:07,true,2,,15,,RUE,HENRI BIDAULT,01510,ROSSILLON,,,01329,,,,,,,,,,,,,,,,,,,2021-03-22,F,,,,,85.59B,NAFRev2,N,5.593027,45.832568,0.86,housenumber,15 Rue Henri Bidauld 01510 Rossillon,01329_0035_00015,G,15 RUE HENRI BIDAULD,
502539968,00029,50253996800029,O,2018-03-01,,,4391AZ,2021-02-27T03:38:28,true,3,,31,,RUE,HENRI BIDAULD,01510,ROSSILLON,,,01329,,,,,,,,,,,,,,,,,,,2020-07-31,F,SAS GOUMAZ,,,SAS GOUMAZ,43.91A,NAFRev2,O,5.593529,45.832146,0.95,housenumber,31 Rue Henri Bidauld 01510 Rossillon,01329_0035_00031,G,31 RUE HENRI BIDAULD,
504521782,00012,50452178200012,O,2008-04-15,,,4120BA,2020-03-21T03:34:26,true,2,,,,,,01510,ROSSILLON,,,01329,,,,,,,,,,,,,,,,,,,2018-10-05,F,,,,,41.20B,NAFRev2,N,,,0,,,,,,
507384717,00017,50738471700017,O,2008-07-01,NN,,4333ZZ,2015-03-18T00:18:10,false,3,,,,RUE,DU LAVOIR,01510,ROSSILLON,,,01329,,,,,,,,,,,,,,,,,,,2011-07-01,F,,,,,43.34Z,NAFRev2,O,5.593132,45.831945,0.93,street,Rue du Lavoir 01510 Rossillon,01329_0050,G,RUE DU LAVOIR,
511221475,00011,51122147500011,O,2009-04-01,,,,2012-12-13T14:40:33,false,2,,,,,LES LOUPS BLEU,01510,ROSSILLON,,,01329,,,,,,,,,,,,,,,,,,,2011-11-04,F,,,,,43.91B,NAFRev2,N,,,0,,,,,,
511221475,00045,51122147500045,O,2018-05-01,,,4391BZ,2022-06-08T08:39:19,false,2,A L'ASSOCIATION DE VEN,51,B,RUE,HENRI BIDAUD,01510,ROSSILLON,,,01329,,,,,,,,,,,,,,,,,,,2020-12-31,F,,,,ENTREPRISE EMMANUEL,43.91B,NAFRev2,N,5.59426,45.831179,0.86,interpolation,51 Rue Henri Bidauld 01510 Rossillon,,G,49 RUE HENRI BIDAULD,
513494575,00014,51349457500014,O,2009-04-23,,,,2009-12-11T15:03:43,true,2,,,,RUE,DU LAVOIR,01510,ROSSILLON,,,01329,,,,,,,,,,,,,,,,,,,2009-11-30,F,,,,,47.81Z,NAFRev2,N,5.593132,45.831945,0.93,street,Rue du Lavoir 01510 Rossillon,01329_0050,G,RUE DU LAVOIR,
513910968,00017,51391096800017,O,2009-07-01,,,,2012-11-10T01:07:12,false,2,,,,RUE,DU LAVOIR,01510,ROSSILLON,,,01329,,,,,,,,,,,,,,,,,,,2009-10-16,F,,,,,41.20B,NAFRev2,N,5.593132,45.831945,0.93,street,Rue du Lavoir 01510 Rossillon,01329_0050,G,RUE DU LAVOIR,
514051317,00014,51405131700014,O,2009-07-23,,,,2014-10-08T19:31:59,true,2,EGIEU,13,,CHE,DE RAVIERE,01510,ROSSILLON,,,01329,,,,,,,,,,,,,,,,,,,2014-05-05,F,,,,,81.30Z,NAFRev2,N,5.609553,45.843375,0.83,housenumber,13 Chemin de Raviere 01510 Rossillon,01329_0065_00013,G,13 CHEMIN DE RAVIERE,
517645925,00028,51764592500028,O,2013-01-01,,,4789ZP,2014-12-04T17:58:15,false,1,,34,,RUE,HENRI BIDAULT,01510,ROSSILLON,,,01329,,,,,,,,,,,,,,,,,,,2013-01-01,F,,,,L'ATELIER DE LA CONSERVERIE,47.89Z,NAFRev2,N,5.593396,45.83215,0.86,housenumber,34 Rue Henri Bidauld 01510 Rossillon,01329_0035_00034,G,34 RUE HENRI BIDAULD,
519103477,00013,51910347700013,O,2009-12-28,,,,2015-11-20T09:57:45,false,2,,,,,LE PONT DE GALTRIN,01510,ROSSILLON,,,01329,,,,,,,,,,,,,,,,,,,2013-12-31,F,,,,,96.09Z,NAFRev2,N,,,0,,,,,,
519103477,00021,51910347700021,O,2015-11-01,,,8121ZZ,2017-09-03T03:51:22,true,2,,,,,LA CRAZ DU SOLIAT,01510,ROSSILLON,,,01329,,,,,,,,,,,,,,,,,,,2017-09-01,F,,,,C' POUR VOUS,81.21Z,NAFRev2,N,5.570292,45.840977,0.93,locality,La Craz du Soliat 01510 Rossillon,01329_B031,G,LA CRAZ DU SOLIAT,
522117035,00017,52211703500017,O,2010-03-04,,,,2022-05-24T04:10:56,true,2,,,,RUE,DU LAVOIR,01510,ROSSILLON,,,01329,,,,,,,,,,,,,,,,,,,2022-02-22,F,,,,,68.20B,NAFRev2,N,5.593132,45.831945,0.93,street,Rue du Lavoir 01510 Rossillon,01329_0050,G,RUE DU LAVOIR,
532342466,00010,53234246600010,O,2011-01-11,,,,2014-07-10T02:03:40,false,2,,,,RUE,DU LAVOIR,01510,ROSSILLON,,,01329,,,,,,,,,,,,,,,,,,,2011-07-01,F,,,,,81.21Z,NAFRev2,O,5.593132,45.831945,0.93,street,Rue du Lavoir 01510 Rossillon,01329_0050,G,RUE DU LAVOIR,
533364303,00016,53336430300016,O,2011-06-14,,,8121ZZ,2015-03-18T00:37:51,true,1,,4,,RUE,HENRI BIDAULD,01510,ROSSILLON,,,01329,,,,,,,,,,,,,,,,,,,2011-06-14,A,,,,,81.21Z,NAFRev2,N,5.592361,45.833077,0.95,housenumber,4 Rue Henri Bidauld 01510 Rossillon,01329_0035_00004,G,4 RUE HENRI BIDAULD,
534641345,00010,53464134500010,O,2011-09-13,,,,2013-06-07T08:24:08,true,2,,1,,RTE,CHEIGNIEU,01510,ROSSILLON,,,01329,,,,,,,,,,,,,,,,,,,2013-02-16,F,,,,,88.10A,NAFRev2,N,5.596596,45.830073,0.81,housenumber,1 Route de Cheignieu 01510 Rossillon,01329_0020_00001,G,1 ROUTE DE CHEIGNIEU,
538907908,00015,53890790800015,O,2012-01-01,,,,2013-10-11T08:32:29,true,2,,4,,RUE,HENRI BIDAULD,01510,ROSSILLON,,,01329,,,,,,,,,,,,,,,,,,,2013-09-27,F,,,,,90.03B,NAFRev2,N,5.592361,45.833077,0.95,housenumber,4 Rue Henri Bidauld 01510 Rossillon,01329_0035_00004,G,4 RUE HENRI BIDAULD,
546011594,00019,54601159400019,O,,,,,,true,1,,,,,,01510,ROSSILLON,,,01329,,,,,,,,,,,,,,,,,,,1984-12-25,F,,,,,67.04,NAP,N,,,0,,,,,,
547010405,00017,54701040500017,O,,,,,,true,1,,,,LD,EGIEU,01510,ROSSILLON,,,01329,,,,,,,,,,,,,,,,,,,1984-12-25,F,,,,,67.04,NAP,N,5.596596,45.830073,0.43,street,Route de Cheignieu 01510 Rossillon,01329_0020,G,ROUTE DE CHEIGNIEU,
547010827,00012,54701082700012,O,,NN,,,,true,1,,,,,,01510,ROSSILLON,,,01329,,,,,,,,,,,,,,,,,,,,F,,,,,67.04,NAP,N,,,0,,,,,,
552049447,67872,55204944767872,O,1986-06-23,NN,,,,false,4,,,,LD,EMPRISE SNCF,01510,ROSSILLON,,,01329,,,,,,,,,,,,,,,,,,,1996-06-06,F,SECTION DE BOURG EN BRESSE,,,,60.1Z,NAF1993,O,,,0,,,,,,
552049447,68763,55204944768763,O,1986-06-23,,,,2014-03-08T12:30:12,false,4,,,,LD,EMPRISE SNCF,01510,ROSSILLON,,,01329,,,,,,,,,,,,,,,,,,,2013-12-31,F,DIR ENT   DIRECTION RH SS,,,,49.10Z,NAFRev2,N,,,0,,,,,,
552094112,02915,55209411202915,O,1992-12-31,NN,,,,false,3,,,,,,01510,ROSSILLON,,,01329,,,,,,,,,,,,,,,,,,,2001-06-05,F,,,,,41.0Z,NAF1993,N,,,0,,,,,,
603617390,00027,60361739000027,O,,NN,,,,true,1,,,,RTE,NATIONALE,01510,ROSSILLON,,,01329,,,,,,,,,,,,,,,,,,,,F,,,,,23.03,NAP,N,1.2279812,49.230352,0.77,poi,Route Nationale (Pont) Saint-Pierre-du-Vauvray,https://osm.org/way/95838375,G,,
749829602,00012,74982960200012,O,2011-11-24,,,,2015-02-17T04:27:32,true,2,,,,,LA CRAZ DU SOLIAT,01510,ROSSILLON,,,01329,,,,,,,,,,,,,,,,,,,2014-12-31,F,,,,,47.99A,NAFRev2,N,5.570292,45.840977,0.93,locality,La Craz du Soliat 01510 Rossillon,01329_B031,G,LA CRAZ DU SOLIAT,
752541185,00019,75254118500019,O,2012-01-01,,,,2013-06-20T08:31:21,false,2,EGIEU,1,,ALL,DE LA CHAPELLE,01510,ROSSILLON,,,01329,,,,,,,,,,,,,,,,,,,2013-05-13,F,,,,,01.45Z,NAFRev2,N,5.608619,45.843079,0.85,housenumber,1 Allee de la Chapelle 01510 Rossillon,01329_0010_00001,G,1 ALLEE DE LA CHAPELLE,
779382118,00023,77938211800023,O,,NN,,,,true,1,,,,,EGIEU,01510,ROSSILLON,,,01329,,,,,,,,,,,,,,,,,,,1995-07-31,F,,,,,45.4C,NAF1993,N,5.596596,45.830073,0.43,street,Route de Cheignieu 01510 Rossillon,01329_0020,G,ROUTE DE CHEIGNIEU,
792637050,00016,79263705000016,O,2013-05-01,,,,2014-10-21T19:26:29,false,2,,1,,CHE,DU CHATEAU,01510,ROSSILLON,,,01329,,,,,,,,,,,,,,,,,,,2014-09-30,F,,,,,96.09Z,NAFRev2,N,5.593301,45.833691,0.81,housenumber,1 Chemin du Chateau 01510 Rossillon,01329_0015_00001,G,1 CHEMIN DU CHATEAU,
800705733,00015,80070573300015,O,2014-01-01,,,,2015-08-10T14:19:39,true,2,13 CHEMIN DE RAVIERE,,,,EGIEU,01510,ROSSILLON,,,01329,,,,,,,,,,,,,,,,,,,2015-08-20,F,,,,,43.12B,NAFRev2,N,5.596596,45.830073,0.43,street,Route de Cheignieu 01510 Rossillon,01329_0020,G,ROUTE DE CHEIGNIEU,
801793894,00016,80179389400016,O,2014-04-14,,,,2015-12-29T04:02:27,true,2,,,,,LA MALADIERE,01510,ROSSILLON,,,01329,,,,,,,,,,,,,,,,,,,2015-11-26,F,,,,,70.22Z,NAFRev2,N,5.596518,45.8278,0.32,street,La Gare 01510 Rossillon,01329_j2bi7c,G,LA GARE,
802611830,00018,80261183000018,O,2014-04-01,,,4334ZB,2017-11-02T14:12:39,false,2,D 1504,,,,LA MALADIERE,01510,ROSSILLON,,,01329,,,,,,,,,,,,,,,,,,,2014-12-20,F,,,,,43.34Z,NAFRev2,N,5.596518,45.8278,0.32,street,La Gare 01510 Rossillon,01329_j2bi7c,G,LA GARE,
803674944,00027,80367494400027,O,2021-11-01,,,,2022-09-15T04:02:51,true,2,,42,B,RUE,HENRI BIDAULD,01510,ROSSILLON,,,01329,,,,,,,,,,,,,,,,,,,2022-08-31,F,,,,FRINGUE SHOP,46.42Z,NAFRev2,N,5.593702,45.831673,0.86,housenumber,42bis Rue Henri Bidauld 01510 Rossillon,01329_0035_00042_bis,G,42BIS RUE HENRI BIDAULD,
812443745,00029,81244374500029,O,2015-07-01,,,,2021-02-23T17:30:16,false,1,,48,,RUE,HENRI BIDAULD,01510,ROSSILLON,,,01329,,,,,,,,,,,,,,,,,,,2015-07-01,A,,,,,68.20A,NAFRev2,N,5.593893,45.831412,0.95,housenumber,48 Rue Henri Bidauld 01510 Rossillon,01329_0035_00048,G,48 RUE HENRI BIDAULD,
813619509,00025,81361950900025,O,2018-01-01,,,,2023-04-12T21:28:02,true,2,,51,,RUE,HENRI BIDAULD,01510,ROSSILLON,,,01329,,,,,,,,,,,,,,,,,,,2019-04-11,F,,,,,94.99Z,NAFRev2,N,5.594234,45.831186,0.95,housenumber,51 Rue Henri Bidauld 01510 Rossillon,01329_0035_00051,G,51 RUE HENRI BIDAULD,
818716664,00011,81871666400011,O,2016-01-01,,,4321AB,2023-09-11T19:44:30,true,2,,58,,RUE,HENRI BIDAULD,01510,ROSSILLON,,,01329,,,,,,,,,,,,,,,,,,,2023-08-04,F,FA ELEC,,,,43.21A,NAFRev2,N,5.594325,45.831016,0.95,housenumber,58 Rue Henri Bidauld 01510 Rossillon,01329_0035_00058,G,58 RUE HENRI BIDAULD,
827911561,00013,82791156100013,O,2017-02-09,,,4332BB,2017-02-24T03:40:14,true,1,,26,,RUE,HENRI BIDAULD,01510,ROSSILLON,,,01329,,,,,,,,,,,,,,,,,,,2017-02-09,A,,,,,31.09B,NAFRev2,N,5.593121,45.832364,0.95,housenumber,26 Rue Henri Bidauld 01510 Rossillon,01329_0035_00026,G,26 RUE HENRI BIDAULD,
843580150,00012,84358015000012,O,2018-10-15,01,2021,,2023-11-27T15:28:45,true,2,,2,,ALL,DE L'ABREUVOIR,01510,ROSSILLON,,,01329,,,,,,,,,,,,,,,,,,,2018-12-10,A,VAL'ESCALE,,,,56.10A,NAFRev2,O,5.591211,45.833761,0.75,street,allée de l'abreuvoir 01510 Rossillon,01329_5y4t02,G,ALLEE DE L ABREUVOIR,
878850551,00010,87885055100010,P,2019-11-11,,,,2022-10-04T09:32:46,true,2,[ND],[ND],[ND],[ND],[ND],[ND],ROSSILLON,,[ND],01329,[ND],[ND],,,[ND],[ND],[ND],[ND],[ND],[ND],,,[ND],,[ND],[ND],,,2021-12-31,F,[ND],[ND],[ND],[ND],81.21Z,NAFRev2,N,,,0,,,,,,
902628585,00017,90262858500017,O,2021-08-26,,,,2021-08-30T08:03:05,true,1,,,,,RUE JOSEPHIN SOULARY,01510,ROSSILLON,,,01329,,,,,,,,,,,,,,,,,,,2021-08-26,A,,,,ERIC BOUSQUIER,85.53Z,NAFRev2,N,5.592969,45.831831,0.93,street,Rue Josephin Soulary 01510 Rossillon,01329_0040,G,RUE JOSEPHIN SOULARY,
908575467,00018,90857546700018,O,2022-01-01,,,,2021-12-28T10:03:34,true,1,,2,,,DU LAVOIR ,01510,ROSSILLON,,,01329,,,,,,,,,,,,,,,,,,,2022-01-01,A,,,,,47.64Z,NAFRev2,N,5.593132,45.831945,0.85,housenumber,2 Rue du Lavoir 01510 Rossillon,01329_0050_00002,G,2 RUE DU LAVOIR,
919152157,00013,91915215700013,O,2022-10-01,,,,2023-01-31T07:45:53,true,2,EGIEU,3,,ALL,DE LA CHAPELLE,01510,ROSSILLON,,,01329,,,,,,,,,,,,,,,,,,,2023-02-01,A,,,,,46.71Z,NAFRev2,N,5.608619,45.843079,0.85,housenumber,3 Allee de la Chapelle 01510 Rossillon,01329_0010_00003,G,3 ALLEE DE LA CHAPELLE,
924166838,00012,92416683800012,O,2023-11-01,,,,2023-10-17T03:56:48,true,1,,34,,RUE,HENRI BIDAULD,01510,ROSSILLON,,,01329,,,,,,,,,,,,,,,,,,,2023-11-01,A,,,,SOLINKI,70.22Z,NAFRev2,N,5.593396,45.83215,0.95,housenumber,34 Rue Henri Bidauld 01510 Rossillon,01329_0035_00034,G,34 RUE HENRI BIDAULD,
948667779,00011,94866777900011,P,2023-02-01,,,,2023-03-04T14:26:48,true,1,[ND],[ND],[ND],[ND],[ND],[ND],ROSSILLON,,[ND],01329,[ND],[ND],,,[ND],[ND],[ND],[ND],[ND],[ND],,,[ND],,[ND],[ND],,,2023-02-01,A,[ND],[ND],[ND],[ND],01.13Z,NAFRev2,N,,,0,,,,,,
949082010,00016,94908201000016,O,2023-04-01,,,,2023-03-04T14:54:50,true,1,EGIEU,1,,ALL,DE LA CHAPELLE,01510,ROSSILLON,,,01329,,,,,,,,,,,,,,,,,,,2023-04-01,A,,,,PEP'AIN,01.30Z,NAFRev2,N,5.608619,45.843079,0.85,housenumber,1 Allee de la Chapelle 01510 Rossillon,01329_0010_00001,G,1 ALLEE DE LA CHAPELLE,
978372720,00018,97837272000018,O,2023-05-17,,,,2023-08-07T09:00:11,true,1,,2,,RUE,DU LAVOIR,01510,ROSSILLON,,,01329,,,,,,,,,,,,,,,,,,,2023-05-17,A,,,,A.M.O.,74.90A,NAFRev2,N,5.593132,45.831945,0.93,housenumber,2 Rue du Lavoir 01510 Rossillon,01329_0050_00002,G,2 RUE DU LAVOIR,
979633088,00013,97963308800013,O,2023-10-01,,,,2023-10-07T14:00:07,true,1,,46,,RUE,HENRI BIDAULD,01510,ROSSILLON,,,01329,,,,,,,,,,,,,,,,,,,2023-10-01,A,,,,,86.90F,NAFRev2,N,5.593801,45.831535,0.95,housenumber,46 Rue Henri Bidauld 01510 Rossillon,01329_0035_00046,G,46 RUE HENRI BIDAULD,
981564750,00017,98156475000017,O,2023-11-30,,,,2023-11-20T11:59:55,true,1,,42,B,RUE,HENRI BIDAULD,01510,ROSSILLON,,,01329,,,,,,,,,,,,,,,,,,,2023-11-30,A,,,,BEST STYLE,47.89Z,NAFRev2,N,5.593702,45.831673,0.86,housenumber,42bis Rue Henri Bidauld 01510 Rossillon,01329_0035_00042_bis,G,42BIS RUE HENRI BIDAULD,
