siren,nic,siret,statutDiffusionEtablissement,dateCreationEtablissement,trancheEffectifsEtablissement,anneeEffectifsEtablissement,activitePrincipaleRegistreMetiersEtablissement,dateDernierTraitementEtablissement,etablissementSiege,nombrePeriodesEtablissement,complementAdresseEtablissement,numeroVoieEtablissement,indiceRepetitionEtablissement,typeVoieEtablissement,libelleVoieEtablissement,codePostalEtablissement,libelleCommuneEtablissement,libelleCommuneEtrangerEtablissement,distributionSpecialeEtablissement,codeCommuneEtablissement,codeCedexEtablissement,libelleCedexEtablissement,codePaysEtrangerEtablissement,libellePaysEtrangerEtablissement,complementAdresse2Etablissement,numeroVoie2Etablissement,indiceRepetition2Etablissement,typeVoie2Etablissement,libelleVoie2Etablissement,codePostal2Etablissement,libelleCommune2Etablissement,libelleCommuneEtranger2Etablissement,distributionSpeciale2Etablissement,codeCommune2Etablissement,codeCedex2Etablissement,libelleCedex2Etablissement,codePaysEtranger2Etablissement,libellePaysEtranger2Etablissement,dateDebut,etatAdministratifEtablissement,enseigne1Etablissement,enseigne2Etablissement,enseigne3Etablissement,denominationUsuelleEtablissement,activitePrincipaleEtablissement,nomenclatureActivitePrincipaleEtablissement,caractereEmployeurEtablissement,longitude,latitude,geo_score,geo_type,geo_adresse,geo_id,geo_ligne,geo_l4,geo_l5
211400437,00011,21140043700011,O,1983-03-01,01,2021,,2023-11-27T13:19:55,true,3,,,,,,14620,BAROU-EN-AUGE,,,14043,,,,,,,,,,,,,,,,,,,2008-01-01,A,MAIRIE,,,,84.11Z,NAFRev2,N,,,0,,,,,,
261402309,00015,26140230900015,O,1995-12-25,,,,2019-11-14T14:00:19,true,3,,,,,MAIRIE,14620,BAROU-EN-AUGE,,,14043,,,,,,,,,,,,,,,,,,,2016-01-01,F,,,,,88.99B,NAFRev2,N,-0.047437,48.932952,0.91,street,Rue de la Mairie 14620 Barou-en-Auge,14043_0010,G,RUE DE LA MAIRIE,
313662553,00012,31366255300012,O,,,,,2019-11-14T14:00:19,true,1,,,,,,14620,BAROU-EN-AUGE,,,14043,,,,,,,,,,,,,,,,,,,1985-12-25,F,,,,,01.07,NAP,N,,,0,,,,,,
314507328,00016,31450732800016,O,,,,,2019-11-14T14:00:19,true,1,,,,,,14620,BAROU-EN-AUGE,,,14043,,,,,,,,,,,,,,,,,,,1992-12-31,F,,,,,45.2J,NAF1993,N,,,0,,,,,,
321019937,00010,32101993700010,O,,,,,2019-11-14T14:00:19,true,1,,,,,,14620,BAROU-EN-AUGE,,,14043,,,,,,,,,,,,,,,,,,,1984-12-25,F,,,,,55.40,NAP,N,,,0,,,,,,
323750117,00018,32375011700018,O,1982-01-01,NN,,,2020-06-10T03:44:32,true,4,,,,,,14620,BAROU-EN-AUGE,,,14043,,,,,,,,,,,,,,,,,,,2019-12-31,F,,,,,01.42Z,NAFRev2,N,,,0,,,,,,
326423605,00012,32642360500012,O,1983-01-01,NN,,,2019-11-14T14:00:19,true,3,,,,,,14620,BAROU-EN-AUGE,,,14043,,,,,,,,,,,,,,,,,,,2008-01-01,A,,,,,01.61Z,NAFRev2,N,,,0,,,,,,
340021880,00018,34002188000018,O,1987-01-01,NN,,,2019-11-14T14:00:19,true,4,,,,,,14620,BAROU-EN-AUGE,,,14043,,,,,,,,,,,,,,,,,,,2012-12-12,F,,,,,01.61Z,NAFRev2,N,,,0,,,,,,
342325271,00019,34232527100019,O,1986-01-07,NN,,,2021-02-23T10:57:51,true,5,,,,,,14620,BAROU-EN-AUGE,,,14043,,,,,,,,,,,,,,,,,,,2008-04-01,A,,,,,68.20B,NAFRev2,N,,,0,,,,,,
343923413,00052,34392341300052,O,2015-07-27,,,9524ZZ,2019-11-14T14:00:19,true,2,,10,,RUE,DE LA MAIRIE,14620,BAROU-EN-AUGE,,,14043,,,,,,,,,,,,,,,,,,,2015-09-01,F,,,,,43.32A,NAFRev2,N,-0.048347,48.9333,0.94,housenumber,10 Rue de la Mairie 14620 Barou-en-Auge,14043_0010_00010,G,10 RUE DE LA MAIRIE,
381779966,00013,38177996600013,O,1990-01-01,NN,,,2019-11-14T14:00:19,true,4,,,,,,14620,BAROU-EN-AUGE,,,14043,,,,,,,,,,,,,,,,,,,2009-12-31,F,,,,,01.11Z,NAFRev2,N,,,0,,,,,,
383634466,00015,38363446600015,O,1991-10-18,NN,,,2019-11-14T14:00:19,true,1,,,,,,14620,BAROU-EN-AUGE,,,14043,,,,,,,,,,,,,,,,,,,1998-12-07,F,,,,,45.4J,NAF1993,N,,,0,,,,,,
388967200,00014,38896720000014,O,,,,,2019-11-14T14:00:19,true,1,,,,,,14620,BAROU-EN-AUGE,,,14043,,,,,,,,,,,,,,,,,,,1993-12-31,F,,,,,01.3Z,NAF1993,N,,,0,,,,,,
391173309,00017,39117330900017,O,1993-03-01,NN,,,2019-11-14T14:00:19,true,3,,,,,,14620,BAROU-EN-AUGE,,,14043,,,,,,,,,,,,,,,,,,,2008-01-01,A,,,,,01.41Z,NAFRev2,N,,,0,,,,,,
410723274,00016,41072327400016,O,1997-01-01,NN,,,2019-11-14T14:00:19,true,4,,,,,LE BOURG,14620,BAROU-EN-AUGE,,,14043,,,,,,,,,,,,,,,,,,,2008-04-30,A,,,,,68.20B,NAFRev2,N,2.212915,47.9910304,0.9,poi.bar,Le Bourg (Bar) Ingrannes,https://osm.org/node/1718543174,G,,
414898510,00014,41489851000014,O,1982-12-31,NN,,,2019-11-14T14:00:19,true,3,,,,,,14620,BAROU-EN-AUGE,,,14043,,,,,,,,,,,,,,,,,,,2008-01-01,A,,,,,01.11Z,NAFRev2,N,,,0,,,,,,
418392726,00018,41839272600018,O,1998-04-01,,,,2019-11-14T14:00:19,true,4,,,,,,14620,BAROU-EN-AUGE,,,14043,,,,,,,,,,,,,,,,,,,2008-04-15,F,,,,,82.99Z,NAFRev2,N,,,0,,,,,,
430931915,00010,43093191500010,O,1997-11-15,NN,,,2019-11-14T14:00:19,true,3,,,,,LE BOURG,14620,BAROU-EN-AUGE,,,14043,,,,,,,,,,,,,,,,,,,2008-01-01,A,,,,,68.20B,NAFRev2,N,2.212915,47.9910304,0.9,poi.bar,Le Bourg (Bar) Ingrannes,https://osm.org/node/1718543174,G,,
439158817,00015,43915881700015,O,2001-07-02,NN,,,2019-11-14T14:00:19,true,3,,,,,LE CHATEAU,14620,BAROU-EN-AUGE,,,14043,,,,,,,,,,,,,,,,,,,2008-01-01,A,,,,,02.40Z,NAFRev2,N,2.263777,42.927921,0.89,poi.castle,Château Rennes-le-Château,https://osm.org/way/287034824,G,,
449743905,00019,44974390500019,O,2003-04-17,NN,,,2019-11-14T14:00:19,true,3,,,,,,14620,BAROU-EN-AUGE,,,14043,,,,,,,,,,,,,,,,,,,2006-12-31,F,,,,,01.1A,NAFRev1,N,,,0,,,,,,
497537944,00017,49753794400017,O,2007-04-04,,,,2019-11-14T14:00:19,false,4,,,,,LE BOURG,14620,BAROU-EN-AUGE,,,14043,,,,,,,,,,,,,,,,,,,2012-08-31,F,,,,,71.20B,NAFRev2,N,2.212915,47.9910304,0.9,poi.bar,Le Bourg (Bar) Ingrannes,https://osm.org/node/1718543174,G,,
497537944,00025,49753794400025,O,2017-04-08,,,,2019-11-14T14:00:19,true,1,,8,,RUE,DE LA MAIRIE,14620,BAROU-EN-AUGE,,,14043,,,,,,,,,,,,,,,,,,,2017-04-08,A,,,,,01.11Z,NAFRev2,N,-0.046937,48.932898,0.94,housenumber,8 Rue de la Mairie 14620 Barou-en-Auge,14043_0010_00008,G,8 RUE DE LA MAIRIE,
503784209,00010,50378420900010,O,2008-04-01,NN,,,2021-10-27T08:07:50,true,1,,,,,,14620,BAROU-EN-AUGE,,,14043,,,,,,,,,,,,,,,,,,,2008-04-01,A,,,,,01.11Z,NAFRev2,O,,,0,,,,,,
512679622,00013,51267962200013,O,2009-05-12,,,,2019-11-14T14:00:19,true,4,,5,,,LA PETITE RUE,14620,BAROU-EN-AUGE,,,14043,,,,,,,,,,,,,,,,,,,2016-05-20,F,,,,,47.78C,NAFRev2,N,-0.044607,48.931522,0.72,housenumber,5 Petite rue 14620 Barou-en-Auge,14043_0020_00005,G,5 PETITE RUE,
514492636,00014,51449263600014,O,2009-08-05,,,,2019-11-14T14:00:19,true,1,,,,,LES CLAIRS MONTS,14620,BAROU-EN-AUGE,,,14043,,,,,,,,,,,,,,,,,,,2009-08-05,A,,,,,68.20B,NAFRev2,N,-0.014177,48.925365,0.81,street,Chemin des Clairs Monts 14620 Barou-en-Auge,14043_fpbi3q,G,CHEMIN DES CLAIRS MONTS,
518709209,00010,51870920900010,O,2009-12-01,,,,2019-11-14T14:00:19,true,2,,,,,LE BOURG,14620,BAROU-EN-AUGE,,,14043,,,,,,,,,,,,,,,,,,,2012-12-31,F,,,,,47.99A,NAFRev2,N,2.212915,47.9910304,0.9,poi.bar,Le Bourg (Bar) Ingrannes,https://osm.org/node/1718543174,G,,
527518856,00010,52751885600010,O,2010-11-01,,,4339ZZ,2019-11-14T14:00:19,false,3,,17,,RTE,DE MORTEAUX COULIBOEUF,14620,BAROU-EN-AUGE,,,14043,,,,,,,,,,,,,,,,,,,2015-07-31,F,,,,LE JARDIN D'AUGE MULTISERVICES,81.30Z,NAFRev2,N,-0.045637,48.931789,0.58,housenumber,17 Route de Morteaux 14620 Barou-en-Auge,14043_0015_00017,G,17 ROUTE DE MORTEAUX,
528294515,00036,52829451500036,O,2019-06-16,,,,2021-02-23T15:44:54,true,1,,10,,RTE,DE TRUN,14620,BAROU-EN-AUGE,,,14043,,,,,,,,,,,,,,,,,,,2019-06-16,A,,,,,81.30Z,NAFRev2,N,-0.042451,48.931521,0.81,housenumber,10 Route de Trun 14620 Barou-en-Auge,14043_0025_00010,G,10 ROUTE DE TRUN,
753956630,00010,75395663000010,O,2012-09-08,NN,,,2019-11-14T14:00:19,true,2,,,,,,14620,BAROU-EN-AUGE,,,14043,,,,,,,,,,,,,,,,,,,2013-12-31,A,,,,,01.61Z,NAFRev2,O,,,0,,,,,,
799585427,00013,79958542700013,O,2014-01-02,,,,2019-11-14T14:00:19,true,1,,,,,LE BOURG,14620,BAROU-EN-AUGE,,,14043,,,,,,,,,,,,,,,,,,,2014-01-02,A,,,,,25.62B,NAFRev2,N,2.212915,47.9910304,0.9,poi.bar,Le Bourg (Bar) Ingrannes,https://osm.org/node/1718543174,G,,
801721960,00020,80172196000020,O,2015-09-01,,,,2021-02-23T17:16:59,true,1,,1,,CHE,DE COULIBOEUF,14620,BAROU-EN-AUGE,,,14043,,,,,,,,,,,,,,,,,,,2015-09-01,A,,,,,01.11Z,NAFRev2,N,-0.049731,48.933378,0.73,street,Chemin de Couliboeuf 14620 Barou-en-Auge,14043_B035,G,CHEMIN DE COULIBOEUF,
813594140,00010,81359414000010,O,2015-09-01,,,,2019-11-14T14:00:19,true,1,,9,,RTE,DE MORTEAUX,14620,BAROU-EN-AUGE,,,14043,,,,,,,,,,,,,,,,,,,2015-09-01,A,,,,CROQUE LA NORMANDIE,47.91B,NAFRev2,N,-0.044842,48.932317,0.88,housenumber,9 Route de Morteaux 14620 Barou-en-Auge,14043_0015_00009,G,9 ROUTE DE MORTEAUX,
819493503,00018,81949350300018,O,2016-04-01,,,,2019-11-14T14:00:19,true,2,,10,,RUE,DE LA MAIRIE,14620,BAROU-EN-AUGE,,,14043,,,,,,,,,,,,,,,,,,,2018-04-11,F,,,,,47.82Z,NAFRev2,N,-0.048347,48.9333,0.94,housenumber,10 Rue de la Mairie 14620 Barou-en-Auge,14043_0010_00010,G,10 RUE DE LA MAIRIE,
850336546,00013,85033654600013,O,2019-04-01,01,2021,,2023-11-27T15:35:31,true,1,,1,,CHE,DE COULIBOEUF,14620,BAROU-EN-AUGE,,,14043,,,,,,,,,,,,,,,,,,,2019-04-01,A,,,,,01.61Z,NAFRev2,N,-0.049731,48.933378,0.73,street,Chemin de Couliboeuf 14620 Barou-en-Auge,14043_B035,G,CHEMIN DE COULIBOEUF,
907919468,00013,90791946800013,O,1996-01-05,,,,2021-12-07T07:42:45,true,1,MAIRIE,,,,,14620,BAROU-EN-AUGE,,,14043,,,,,,,,,,,,,,,,,,,1996-01-05,A,,,,,93.29Z,NAFRev2,N,-0.047437,48.932952,0.91,street,Rue de la Mairie 14620 Barou-en-Auge,14043_0010,D,RUE DE LA MAIRIE,
