siren,nic,siret,statutDiffusionEtablissement,dateCreationEtablissement,trancheEffectifsEtablissement,anneeEffectifsEtablissement,activitePrincipaleRegistreMetiersEtablissement,dateDernierTraitementEtablissement,etablissementSiege,nombrePeriodesEtablissement,complementAdresseEtablissement,numeroVoieEtablissement,indiceRepetitionEtablissement,typeVoieEtablissement,libelleVoieEtablissement,codePostalEtablissement,libelleCommuneEtablissement,libelleCommuneEtrangerEtablissement,distributionSpecialeEtablissement,codeCommuneEtablissement,codeCedexEtablissement,libelleCedexEtablissement,codePaysEtrangerEtablissement,libellePaysEtrangerEtablissement,complementAdresse2Etablissement,numeroVoie2Etablissement,indiceRepetition2Etablissement,typeVoie2Etablissement,libelleVoie2Etablissement,codePostal2Etablissement,libelleCommune2Etablissement,libelleCommuneEtranger2Etablissement,distributionSpeciale2Etablissement,codeCommune2Etablissement,codeCedex2Etablissement,libelleCedex2Etablissement,codePaysEtranger2Etablissement,libellePaysEtranger2Etablissement,dateDebut,etatAdministratifEtablissement,enseigne1Etablissement,enseigne2Etablissement,enseigne3Etablissement,denominationUsuelleEtablissement,activitePrincipaleEtablissement,nomenclatureActivitePrincipaleEtablissement,caractereEmployeurEtablissement,longitude,latitude,geo_score,geo_type,geo_adresse,geo_id,geo_ligne,geo_l4,geo_l5
213105794,00019,21310579400019,O,1983-03-01,11,2021,,2023-11-27T13:21:23,true,4,,,,,,31380,VILLARIES,,,31579,,,,,,,,,,,,,,,,,,,2008-01-01,A,MAIRIE,,,,84.11Z,NAFRev2,O,,,0,,,,,,
213105794,00027,21310579400027,O,1983-12-21,NN,,,2008-01-04T18:30:52,false,3,,,,,,31380,VILLARIES,,,31579,,,,,,,,,,,,,,,,,,,2008-01-01,A,ECOLE PRIMAIRE PUBLIQUE,,,,85.20Z,NAFRev2,N,,,0,,,,,,
213105794,00035,21310579400035,O,1996-01-01,NN,,,2011-11-24T14:32:54,false,4,EGLISE,,,,,31380,VILLARIES,,,31579,,,,,,,,,,,,,,,,,,,2010-01-20,F,,,,,37.00Z,NAFRev2,N,1.491428,43.751253,0.94,street,Eglise 31380 Villariès,31579_p76sr1,D,EGLISE,
213105794,00043,21310579400043,O,1999-09-01,02,2021,,2023-11-27T13:21:23,false,4,,,,RUE,DE L'EGLISE,31380,VILLARIES,,,31579,,,,,,,,,,,,,,,,,,,2008-01-01,A,ECOLE MATERNELLE PUB  COQUELICOTS,,,,85.10Z,NAFRev2,N,1.491611,43.751217,0.95,street,Rue de l'Eglise 31380 Villariès,31579_0016,G,RUE DE L EGLISE,
263106791,00019,26310679100019,O,,NN,,,,true,1,,,,,MAIRIE,31380,VILLARIES,,,31579,,,,,,,,,,,,,,,,,,,1996-12-25,F,,,,,85.3K,NAF1993,N,1.491312,43.752375,0.92,street,Rue de la Mairie 31380 Villariès,31579_0380,G,RUE DE LA MAIRIE,
263107690,00012,26310769000012,O,1984-11-20,NN,,,,true,4,,,,,MAIRIE,31380,VILLARIES,,,31579,,,,,,,,,,,,,,,,,,,1996-12-25,F,CDE,,,,85.3K,NAF1993,N,1.491312,43.752375,0.92,street,Rue de la Mairie 31380 Villariès,31579_0380,G,RUE DE LA MAIRIE,
293101168,00012,29310116800012,O,1983-09-14,NN,,,2008-01-04T19:06:22,true,3,,,,,MAIRIE,31380,VILLARIES,,,31579,,,,,,,,,,,,,,,,,,,2008-01-01,A,,,,,42.99Z,NAFRev2,N,1.491312,43.752375,0.92,street,Rue de la Mairie 31380 Villariès,31579_0380,G,RUE DE LA MAIRIE,
300263555,00033,30026355500033,O,1900-01-01,NN,,,2011-04-28T00:10:42,false,3,,,,,CD 45,31380,VILLARIES,,,31579,,,,,,,,,,,,,,,,,,,1988-12-25,F,,,,,60.10,NAP,N,,,0,,,,,,
304253016,00022,30425301600022,O,,,,,,true,1,,,,,,31380,VILLARIES,,,31579,,,,,,,,,,,,,,,,,,,1984-12-25,F,,,,,15.03,NAP,N,,,0,,,,,,
304607609,00027,30460760900027,O,,NN,,,,true,1,,,,LD,MONPLAISIR,31380,VILLARIES,,,31579,,,,,,,,,,,,,,,,,,,,F,,,,,54.05,NAP,N,1.496447,43.738739,0.93,street,Impasse Monplaisir 31380 Villariès,31579_0022,G,IMPASSE MONPLAISIR,
305256356,00018,30525635600018,O,,NN,,,,true,1,,,,,,31380,VILLARIES,,,31579,,,,,,,,,,,,,,,,,,,,F,,,,,65.06,NAP,N,,,0,,,,,,
305305005,00012,30530500500012,O,1966-01-01,00,2020,,2022-08-29T09:12:13,false,6,,46,,RTE,DE BESSIERES,31380,VILLARIES,,,31579,,,,,,,,,,,,,,,,,,,2020-11-01,F,,,,,46.32A,NAFRev2,O,1.494803,43.757215,0.86,housenumber,46 Route de Bessières 31380 Villariès,31579_0010_00046,G,46 ROUTE DE BESSIERES,
305954505,00023,30595450500023,O,,NN,,,,true,1,,,,CHE,,31380,VILLARIES,,,31579,,,,,,,,,,,,,,,,,,,1990-09-30,F,,,,,55.72,NAP,N,1.49278,43.757301,0.65,street,Chemin de Vigne Barrade 31380 Villariès,31579_0029,G,CHEMIN DE VIGNE BARRADE,
307649962,00023,30764996200023,O,,NN,,,,true,1,,,,,,31380,VILLARIES,,,31579,,,,,,,,,,,,,,,,,,,1991-12-25,F,,,,,45.3C,NAF1993,N,,,0,,,,,,
308997485,00013,30899748500013,O,,NN,,,,true,1,,,,,,31380,VILLARIES,,,31579,,,,,,,,,,,,,,,,,,,1989-02-28,F,,,,,22.01,NAP,N,,,0,,,,,,
311342430,00023,31134243000023,O,,,,,,true,1,,,,LD,LAS COMBES,31380,VILLARIES,,,31579,,,,,,,,,,,,,,,,,,,1984-12-25,F,,,,,55.60,NAP,N,1.497315,43.756217,0.94,street,Las Combes 31380 Villariès,31579_fgasjw,G,LAS COMBES,
312007909,00012,31200790900012,O,1978-01-01,NN,,,2018-06-21T03:42:36,true,3,LE SEGALA,1143,,RTE,DE CASTELNAU,31380,VILLARIES,,,31579,,,,,,,,,,,,,,,,,,,2008-01-01,A,,,,,01.11Z,NAFRev2,N,1.481375,43.744743,0.87,housenumber,1143 Route de Castelnau 31380 Villariès,31579_0014_01143,G,1143 ROUTE DE CASTELNAU,
313753576,00054,31375357600054,O,,,,,,true,1,,,,RTE,DE CASTELNAU,31380,VILLARIES,,,31579,,,,,,,,,,,,,,,,,,,1997-07-02,F,,,,,45.2V,NAF1993,N,1.488936,43.741986,0.84,street,Route de Castelnau 31380 Villariès,31579_0014,G,ROUTE DE CASTELNAU,
316258664,00044,31625866400044,O,,NN,,,,true,1,,,,PL,DE LA BOULANGERIE,31380,VILLARIES,,,31579,,,,,,,,,,,,,,,,,,,1993-09-30,F,,,,,51.3J,NAF1993,N,1.493295,43.75262,0.86,street,Place de la Boulangerie 31380 Villariès,31579_0004,G,PLACE DE LA BOULANGERIE,
316366301,00018,31636630100018,O,,NN,,,,true,1,,,,LD,LA COMBES,31380,VILLARIES,,,31579,,,,,,,,,,,,,,,,,,,,F,,,,,00.10,NAP,N,1.497315,43.756217,0.75,street,Las Combes 31380 Villariès,31579_fgasjw,G,LAS COMBES,
316379551,00054,31637955100054,O,1997-09-22,,,,,true,1,,,,CHE,DU POUBIL,31380,VILLARIES,,,31579,,,,,,,,,,,,,,,,,,,2000-02-11,F,,,,,45.4J,NAF1993,N,1.49467,43.739979,0.81,street,Chemin du Poubil 31380 Villariès,31579_0025,G,CHEMIN DU POUBIL,
316392018,00016,31639201800016,O,,NN,,,,true,1,,,,LD,LAS COMBES,31380,VILLARIES,,,31579,,,,,,,,,,,,,,,,,,,,F,,,,,55.60,NAP,N,1.497315,43.756217,0.94,street,Las Combes 31380 Villariès,31579_fgasjw,G,LAS COMBES,
318992906,00020,31899290600020,O,,,,,,true,1,,,,,,31380,VILLARIES,,,31579,,,,,,,,,,,,,,,,,,,,F,,,,,55.70,NAP,N,,,0,,,,,,
324697382,00012,32469738200012,O,1981-10-28,NN,,,2011-05-12T10:40:23,false,4,,,,,LE SEGALA,31380,VILLARIES,,,31579,,,,,,,,,,,,,,,,,,,2010-11-22,F,,,,,68.20B,NAFRev2,N,1.479503,43.746556,0.94,street,Le Segala 31380 Villariès,31579_hc1iab,G,LE SEGALA,
324697382,00020,32469738200020,O,2010-11-22,,,,2016-10-23T03:53:32,true,2,,1260,,RTE,DE CASTELNAU,31380,VILLARIES,,,31579,,,,,,,,,,,,,,,,,,,2016-09-22,F,,,,,68.20B,NAFRev2,N,1.481105,43.74522,0.87,housenumber,1260 Route de Castelnau 31380 Villariès,31579_0014_01260,G,1260 ROUTE DE CASTELNAU,
325356723,00032,32535672300032,O,2013-10-15,,,,2016-01-21T08:22:47,false,2,,8,,PL,DU VILLAGE,31380,VILLARIES,,,31579,,,,,,,,,,,,,,,,,,,2015-11-18,F,,,,,68.32A,NAFRev2,N,1.49319,43.752698,0.51,street,Le Village 31380 Villariès,31579_18pff9,G,LE VILLAGE,
326747680,00014,32674768000014,O,1983-01-15,NN,,,2008-11-07T00:44:09,false,4,,,,LD,LE GAMAT,31380,VILLARIES,,,31579,,,,,,,,,,,,,,,,,,,1999-12-27,F,,,,,45.4C,NAF1993,N,1.490363,43.757524,0.62,street,Impasse du Gamat 31380 Villariès,31579_0017,G,IMPASSE DU GAMAT,
326747698,00016,32674769800016,O,1900-01-01,,,,2011-04-28T00:22:52,false,2,,,,LD,LE GAMAT,31380,VILLARIES,,,31579,,,,,,,,,,,,,,,,,,,1984-12-25,F,,,,,00.10,NAP,N,1.490363,43.757524,0.62,street,Impasse du Gamat 31380 Villariès,31579_0017,G,IMPASSE DU GAMAT,
326769445,00015,32676944500015,O,,NN,,,,true,1,,,,LD,LE GAMAT,31380,VILLARIES,,,31579,,,,,,,,,,,,,,,,,,,1991-01-31,F,,,,,55.71,NAP,N,1.490363,43.757524,0.62,street,Impasse du Gamat 31380 Villariès,31579_0017,G,IMPASSE DU GAMAT,
328376181,00017,32837618100017,O,1983-11-01,NN,,,2008-11-07T00:46:14,true,4,,4,,,VOIE COMMUNALE,31380,VILLARIES,,,31579,,,,,,,,,,,,,,,,,,,1999-04-07,F,,,,,45.2V,NAF1993,O,-0.1049271,46.7962633,0.9,poi.track,Voie Communale (Chemin) Assais-les-Jumeaux,https://osm.org/way/86934453,G,,
328417738,00015,32841773800015,O,1900-01-01,NN,,,2011-04-28T00:24:05,false,3,,,,LD,LE GAMAT,31380,VILLARIES,,,31579,,,,,,,,,,,,,,,,,,,1991-01-31,F,,,,,,,N,1.490363,43.757524,0.62,street,Impasse du Gamat 31380 Villariès,31579_0017,G,IMPASSE DU GAMAT,
329285860,00014,32928586000014,O,1984-02-01,,,,2006-11-25T10:10:27,false,4,,,,,TURRAS,31380,VILLARIES,,,31579,,,,,,,,,,,,,,,,,,,2001-07-31,F,,,,,92.3A,NAF1993,N,,,0,,,,,,
329751432,00025,32975143200025,P,2022-09-01,,,,2022-10-01T05:01:30,true,1,[ND],[ND],[ND],[ND],[ND],[ND],VILLARIES,,[ND],31579,[ND],[ND],,,[ND],[ND],[ND],[ND],[ND],[ND],,,[ND],,[ND],[ND],,,2022-09-01,A,[ND],[ND],[ND],[ND],81.21Z,NAFRev2,N,,,0,,,,,,
330225566,00026,33022556600026,P,2018-10-01,,,,2019-03-19T13:59:52,false,2,[ND],[ND],[ND],[ND],[ND],[ND],VILLARIES,,[ND],31579,[ND],[ND],,,[ND],[ND],[ND],[ND],[ND],[ND],,,[ND],,[ND],[ND],,,2019-03-10,F,[ND],[ND],[ND],[ND],70.22Z,NAFRev2,N,,,0,,,,,,
331069278,00017,33106927800017,O,,NN,,,,true,1,,,,RTE,DE VACQUIERS,31380,VILLARIES,,,31579,,,,,,,,,,,,,,,,,,,1989-12-30,F,,,,,67.04,NAP,N,1.489582,43.755115,0.84,street,Route de Vacquiers 31380 Villariès,31579_0028,G,ROUTE DE VACQUIERS,
331332700,00011,33133270000011,O,,NN,,,,true,1,,,,,,31380,VILLARIES,,,31579,,,,,,,,,,,,,,,,,,,,F,,,,,60.04,NAP,N,,,0,,,,,,
338095011,00015,33809501100015,O,,NN,,,,true,1,,,,,,31380,VILLARIES,,,31579,,,,,,,,,,,,,,,,,,,1991-01-24,F,,,,,57.08,NAP,N,,,0,,,,,,
338459225,00037,33845922500037,O,1988-09-01,NN,,,2008-05-07T11:50:50,true,4,,,,LD,ENCLOS D'ESQUERRE,31380,VILLARIES,,,31579,,,,,,,,,,,,,,,,,,,2001-12-21,F,,,,,51.6J,NAF1993,N,1.490693,43.753602,0.8,street,Enclos Desquerre 31380 Villariès,31579_B007,G,ENCLOS DESQUERRE,
339075582,00017,33907558200017,O,,,,,,true,1,,,,RTE,DE GARGAS,31380,VILLARIES,,,31579,,,,,,,,,,,,,,,,,,,1989-05-09,F,,,,,84.13,NAP,N,1.482166,43.759434,0.82,street,Route de Gargas 31380 Villariès,31579_0018,G,ROUTE DE GARGAS,
340409309,00036,34040930900036,O,2000-03-01,NN,,1813ZB,2016-04-24T03:36:24,true,7,LES QUATRE CHEMINS,19,,RTE,DE GARGAS,31380,VILLARIES,,,31579,,,,,,,,,,,,,,,,,,,2010-11-30,A,,,,,18.13Z,NAFRev2,N,1.483131,43.758996,0.84,housenumber,19 Route de Gargas 31380 Villariès,31579_0018_00019,G,19 ROUTE DE GARGAS,
342237005,00059,34223700500059,O,2017-02-20,,,,2021-02-23T10:57:48,true,1,,59,,IMP,DU GAMAT,31380,VILLARIES,,,31579,,,,,,,,,,,,,,,,,,,2017-02-20,A,,,,FLAVIEN SABINE,47.71Z,NAFRev2,N,1.490194,43.757634,0.83,housenumber,59 Impasse du Gamat 31380 Villariès,31579_0017_00059,G,59 IMPASSE DU GAMAT,
342468576,00018,34246857600018,O,1987-10-01,NN,,,2008-11-08T00:16:26,true,3,,,,PL,DE L'EGLISE,31380,VILLARIES,,,31579,,,,,,,,,,,,,,,,,,,2006-12-31,F,,,,,52.7H,NAFRev1,N,1.491611,43.751217,0.76,street,Rue de l'Eglise 31380 Villariès,31579_0016,G,RUE DE L EGLISE,
344434501,00021,34443450100021,O,2019-07-11,01,2020,,2023-10-19T18:02:14,true,2,481 C,481,C,CHE,VIGNE BARRADE,31380,VILLARIES,,,31579,,,,,,,,,,,,,,,,,,,2020-12-31,A,,,,,46.52Z,NAFRev2,N,1.493182,43.757537,0.91,housenumber,481c Chemin de Vigne Barrade 31380 Villariès,31579_0029_00481_c,G,481C CHEMIN DE VIGNE BARRADE,
344473350,00033,34447335000033,O,1999-03-20,NN,,,2011-04-28T00:37:07,false,3,,,,CHE,DU MALES,31380,VILLARIES,,,31579,,,,,,,,,,,,,,,,,,,2001-04-18,F,,,,,51.5F,NAF1993,N,1.49819,43.767014,0.8,street,Chemin du Males 31380 Villariès,31579_0021,G,CHEMIN DU MALES,
347417701,00013,34741770100013,O,1988-07-01,NN,,,2020-05-26T03:41:17,true,3,,32,,CHE,DU SEGALA,31380,VILLARIES,,,31579,,,,,,,,,,,,,,,,,,,2008-01-01,A,,,,,68.20A,NAFRev2,N,1.480776,43.745574,0.84,housenumber,32 Chemin du Ségala 31380 Villariès,31579_0026_00032,G,32 CHEMIN DU SEGALA,
349548180,00034,34954818000034,O,2000-04-01,NN,,4321AB,2019-11-19T11:17:53,false,7,LD PAYRAS,39,,CHE,DU POUBIL,31380,VILLARIES,,,31579,,,,,,,,,,,,,,,,,,,2014-06-17,F,,,,,43.21A,NAFRev2,N,1.499583,43.744103,0.84,housenumber,39 Chemin du Poubil 31380 Villariès,31579_0025_00039,G,39 CHEMIN DU POUBIL,
350245601,00017,35024560100017,O,1989-04-01,,,,,true,1,,,,RUE,DE L'EGLISE,31380,VILLARIES,,,31579,,,,,,,,,,,,,,,,,,,2000-05-31,F,,,,,45.4M,NAF1993,N,1.491611,43.751217,0.95,street,Rue de l'Eglise 31380 Villariès,31579_0016,G,RUE DE L EGLISE,
350245668,00016,35024566800016,O,1989-04-01,NN,,,2008-11-08T00:25:43,true,4,,,,RUE,DE L'EGLISE,31380,VILLARIES,,,31579,,,,,,,,,,,,,,,,,,,2006-08-31,F,,,,,45.4M,NAFRev1,O,1.491611,43.751217,0.95,street,Rue de l'Eglise 31380 Villariès,31579_0016,G,RUE DE L EGLISE,
350245759,00013,35024575900013,O,1989-04-01,NN,,,,true,1,,,,RUE,DE L'EGLISE,31380,VILLARIES,,,31579,,,,,,,,,,,,,,,,,,,2000-05-31,F,,,,,45.4M,NAF1993,N,1.491611,43.751217,0.95,street,Rue de l'Eglise 31380 Villariès,31579_0016,G,RUE DE L EGLISE,
350968509,00041,35096850900041,O,1999-01-01,NN,,,,false,5,,,,CHE,CAMPUNO,31380,VILLARIES,,,31579,,,,,,,,,,,,,,,,,,,2003-04-14,F,,,,,52.6D,NAFRev1,N,1.492469,43.759079,0.86,street,Chemin de Campuno 31380 Villariès,31579_0012,G,CHEMIN DE CAMPUNO,
351395090,00027,35139509000027,O,2005-01-24,,,,2008-11-08T00:27:43,true,2,,16,,RTE,DE TOULOUSE,31380,VILLARIES,,,31579,,,,,,,,,,,,,,,,,,,2005-12-19,F,,,,,93.0D,NAFRev1,N,1.491773,43.753718,0.85,housenumber,16 Route de Toulouse 31380 Villariès,31579_0027_00016,G,16 ROUTE DE TOULOUSE,
351878319,00026,35187831900026,O,2013-09-01,,,,2015-05-28T03:35:05,true,2,,111,,CHE,DES COMBES,31380,VILLARIES,,,31579,,,,,,,,,,,,,,,,,,,2015-05-30,F,,,,,96.04Z,NAFRev2,N,1.496584,43.756923,0.84,housenumber,111 Chemin des Combes 31380 Villariès,31579_0015_00111,G,111 CHEMIN DES COMBES,
378038178,00018,37803817800018,O,,NN,,,,true,1,,,,RTE,DE VACQUIERS,31380,VILLARIES,,,31579,,,,,,,,,,,,,,,,,,,1993-09-01,F,,,,,55.4B,NAF1993,N,1.489582,43.755115,0.84,street,Route de Vacquiers 31380 Villariès,31579_0028,G,ROUTE DE VACQUIERS,
378764625,00042,37876462500042,P,2010-05-03,,,,2021-12-01T10:40:44,false,2,[ND],[ND],[ND],[ND],[ND],[ND],VILLARIES,,[ND],31579,[ND],[ND],,,[ND],[ND],[ND],[ND],[ND],[ND],,,[ND],,[ND],[ND],,,2011-03-01,F,[ND],[ND],[ND],[ND],82.99Z,NAFRev2,N,,,0,,,,,,
380073494,00011,38007349400011,O,,NN,,,,true,1,,,,,CHEMIN DU SEGALA,31380,VILLARIES,,,31579,,,,,,,,,,,,,,,,,,,1993-02-28,F,,,,,28.3C,NAF1993,N,1.48733,43.752199,0.95,street,Chemin du Ségala 31380 Villariès,31579_0026,G,CHEMIN DU SEGALA,
380976910,00014,38097691000014,O,,,,,,true,1,,,,,,31380,VILLARIES,,,31579,,,,,,,,,,,,,,,,,,,1992-06-30,F,,,,,28.5D,NAF1993,N,,,0,,,,,,
380987412,00018,38098741200018,O,1900-01-01,NN,,,2011-04-28T00:47:07,false,4,,,,CHE,,31380,VILLARIES,,,31579,,,,,,,,,,,,,,,,,,,1995-12-31,F,,,,,51.4S,NAF1993,N,1.49278,43.757301,0.65,street,Chemin de Vigne Barrade 31380 Villariès,31579_0029,G,CHEMIN DE VIGNE BARRADE,
380987479,00017,38098747900017,O,,,,,,true,1,,,,CHE,DE VIGNEBARRADE,31380,VILLARIES,,,31579,,,,,,,,,,,,,,,,,,,1995-12-31,F,,,,,51.4S,NAF1993,N,1.49278,43.757301,0.76,street,Chemin de Vigne Barrade 31380 Villariès,31579_0029,G,CHEMIN DE VIGNE BARRADE,
383308384,00023,38330838400023,O,2005-10-17,NN,,,2008-11-08T00:43:04,true,1,,13,,RUE,GRD,31380,VILLARIES,,,31579,,,,,,,,,,,,,,,,,,,2005-10-17,F,,,,,93.0D,NAFRev1,N,1.490886,43.747752,0.6,housenumber,13 Rue des Pays d'Oc 31380 Villariès,31579_0455_00013,G,13 RUE DES PAYS D OC,
383786357,00020,38378635700020,O,2021-05-12,,,,2021-06-19T11:44:24,true,1,,1685,,RTE,DE TOULOUSE,31380,VILLARIES,,,31579,,,,,,,,,,,,,,,,,,,2021-05-12,A,,,,AMENVOL,96.09Z,NAFRev2,N,1.493332,43.739751,0.86,housenumber,1685 Route de Toulouse 31380 Villariès,31579_0027_01685,G,1685 ROUTE DE TOULOUSE,
385369822,00015,38536982200015,O,1992-05-18,,,,,false,3,,,,RTE,,31380,VILLARIES,,,31579,,,,,,,,,,,,,,,,,,,1993-10-01,F,,,,,85.1G,NAF1993,N,1.492139,43.755505,0.39,street,Route de Bessières 31380 Villariès,31579_0010,G,ROUTE DE BESSIERES,
388027567,00022,38802756700022,O,2001-05-30,NN,,,2006-01-08T04:35:24,false,4,,321,,CHE,DU SEGALA,31380,VILLARIES,,,31579,,,,,,,,,,,,,,,,,,,2002-01-01,F,,,,,74.2B,NAF1993,N,1.48733,43.752199,0.85,housenumber,321 Chemin du Ségala 31380 Villariès,31579_0026_00321,G,321 CHEMIN DU SEGALA,
389592817,00016,38959281700016,O,1993-01-04,NN,,,2009-06-27T06:56:37,false,4,,,,CHE,DU SEGALA,31380,VILLARIES,,,31579,,,,,,,,,,,,,,,,,,,2002-12-25,F,,,,,74.4A,NAF1993,O,1.48733,43.752199,0.82,street,Chemin du Ségala 31380 Villariès,31579_0026,G,CHEMIN DU SEGALA,
390042729,00017,39004272900017,O,,NN,,,,true,1,,,,,BALARD,31380,VILLARIES,,,31579,,,,,,,,,,,,,,,,,,,1995-12-31,F,,,,,01.3Z,NAF1993,N,1.484594,43.751264,0.94,street,Balard 31380 Villariès,31579_z97yhv,G,BALARD,
390098820,00017,39009882000017,O,1900-01-01,NN,,,2011-04-28T00:54:28,false,3,,3,,RTE,,31380,VILLARIES,,,31579,,,,,,,,,,,,,,,,,,,1993-12-31,F,,,,,50.2Z,NAF1993,N,1.492139,43.755505,0.39,street,Route de Bessières 31380 Villariès,31579_0010,G,ROUTE DE BESSIERES,
390630556,00012,39063055600012,O,1993-03-15,01,2021,2630ZZ,2023-11-27T13:32:42,true,5,,32,,CHE,DU SEGALA,31380,VILLARIES,,,31579,,,,,,,,,,,,,,,,,,,2008-01-01,A,,,,,26.51B,NAFRev2,O,1.480776,43.745574,0.84,housenumber,32 Chemin du Ségala 31380 Villariès,31579_0026_00032,G,32 CHEMIN DU SEGALA,
391261252,00012,39126125200012,O,,,,,2006-11-25T12:05:58,true,1,,,,RTE,DE BESSIERES,31380,VILLARIES,,,31579,,,,,,,,,,,,,,,,,,,1997-12-25,F,,,,,92.3B,NAF1993,N,1.492139,43.755505,0.84,street,Route de Bessières 31380 Villariès,31579_0010,G,ROUTE DE BESSIERES,
392306817,00017,39230681700017,O,1993-08-13,NN,,,2019-06-29T04:36:06,true,4,,,,RTE,DE VACQUIERS,31380,VILLARIES,,,31579,,,,,,,,,,,,,,,,,,,2019-06-28,F,,,,,41.10D,NAFRev2,N,1.489582,43.755115,0.84,street,Route de Vacquiers 31380 Villariès,31579_0028,G,ROUTE DE VACQUIERS,
393108568,00014,39310856800014,O,1993-12-01,NN,,,,true,1,,,,RTE,DE VACQUIERS,31380,VILLARIES,,,31579,,,,,,,,,,,,,,,,,,,1998-02-07,F,,,,,55.3A,NAF1993,O,1.489582,43.755115,0.84,street,Route de Vacquiers 31380 Villariès,31579_0028,G,ROUTE DE VACQUIERS,
394106835,00017,39410683500017,O,1994-01-01,NN,,,2012-09-14T04:46:38,true,4,,3,,RTE,DE VAQUIERS,31380,VILLARIES,,,31579,,,,,,,,,,,,,,,,,,,1996-12-25,F,,,,,50.2Z,NAF1993,O,1.489582,43.755115,0.64,street,Route de Vacquiers 31380 Villariès,31579_0028,G,ROUTE DE VACQUIERS,
394503551,00027,39450355100027,O,2007-07-01,,,,2018-02-12T13:25:17,false,3,LE COTEAU DU CAPITAINE,1,,IMP,DU LIMOUSIN,31380,VILLARIES,,,31579,,,,,,,,,,,,,,,,,,,2017-09-01,F,,,,,85.51Z,NAFRev2,N,1.49173,43.7496,0.84,housenumber,1 Impasse du Limousin 31380 Villariès,31579_0385_00001,G,1 IMPASSE DU LIMOUSIN,
395352479,00079,39535247900079,O,2021-03-12,,,,2023-08-21T14:58:33,true,2,N  896 D,,,RTE,DE BESSIERES,31380,VILLARIES,,,31579,,,,,,,,,,,,,,,,,,,2023-03-31,F,PIZZAS MARTINE,,,PIZZAS MARTINE,56.10C,NAFRev2,N,1.492139,43.755505,0.84,street,Route de Bessières 31380 Villariès,31579_0010,G,ROUTE DE BESSIERES,
401278908,00017,40127890800017,O,1995-04-03,NN,,,2016-09-15T10:09:45,false,7,,575,,RTE,DE BOULOC,31380,VILLARIES,,,31579,,,,,,,,,,,,,,,,,,,2016-05-04,F,UN NOUVEAU JOUR,,,,96.09Z,NAFRev2,N,1.496279,43.762516,0.84,housenumber,575 Route de Bouloc 31380 Villariès,31579_0011_00575,G,575 ROUTE DE BOULOC,
401828876,00011,40182887600011,O,,NN,,,,true,1,,,,RTE,GARGAS,31380,VILLARIES,,,31579,,,,,,,,,,,,,,,,,,,1997-12-31,F,,,,,45.2V,NAF1993,N,1.482166,43.759434,0.77,street,Route de Gargas 31380 Villariès,31579_0018,G,ROUTE DE GARGAS,
402633754,00013,40263375400013,O,1995-10-23,NN,,,,true,1,,,,RTE,DE BESSIERES,31380,VILLARIES,,,31579,,,,,,,,,,,,,,,,,,,1998-12-31,F,,,,,45.3E,NAF1993,N,1.492139,43.755505,0.84,street,Route de Bessières 31380 Villariès,31579_0010,G,ROUTE DE BESSIERES,
403526130,00014,40352613000014,O,1996-01-01,NN,,,2008-01-04T20:24:10,true,3,,,,CHE,DE BALARD,31380,VILLARIES,,,31579,,,,,,,,,,,,,,,,,,,2008-01-01,A,,,,,01.11Z,NAFRev2,N,1.483286,43.758949,0.81,street,Chemin de Balard 31380 Villariès,31579_0008,G,CHEMIN DE BALARD,
403898125,00048,40389812500048,O,2016-01-21,,,,2021-02-23T11:28:12,true,1,,1089,,RTE,DE TOULOUSE,31380,VILLARIES,,,31579,,,,,,,,,,,,,,,,,,,2016-01-21,A,,,,,68.20B,NAFRev2,N,1.490771,43.744724,0.86,housenumber,1089 Route de Toulouse 31380 Villariès,31579_0027_01089,G,1089 ROUTE DE TOULOUSE,
404035255,00029,40403525500029,O,1999-09-01,,,,,true,2,,,,RTE,DE BESSIERES,31380,VILLARIES,,,31579,,,,,,,,,,,,,,,,,,,1999-12-25,F,,,,,01.3Z,NAF1993,N,1.492139,43.755505,0.84,street,Route de Bessières 31380 Villariès,31579_0010,G,ROUTE DE BESSIERES,
404045577,00016,40404557700016,O,1967-01-01,NN,,,2006-12-15T01:00:46,false,4,,,,,LA CORNE,31380,VILLARIES,,,31579,,,,,,,,,,,,,,,,,,,2000-01-31,F,,,,,01.1C,NAF1993,N,1.493295,43.75262,0.32,street,Place de la Boulangerie 31380 Villariès,31579_0004,G,PLACE DE LA BOULANGERIE,
404045585,00019,40404558500019,O,1977-01-01,NN,,,,false,3,,,,RTE,DE VACQUIERS,31380,VILLARIES,,,31579,,,,,,,,,,,,,,,,,,,2001-01-01,F,,,,,01.3Z,NAF1993,N,1.489582,43.755115,0.84,street,Route de Vacquiers 31380 Villariès,31579_0028,G,ROUTE DE VACQUIERS,
404045593,00013,40404559300013,O,1977-01-01,NN,,,2019-12-17T03:39:27,true,4,LE SEGALA,,,CHE,DU SEGALA,31380,VILLARIES,,,31579,,,,,,,,,,,,,,,,,,,2018-10-01,F,,,,,01.30Z,NAFRev2,N,1.48733,43.752199,0.82,street,Chemin du Ségala 31380 Villariès,31579_0026,G,CHEMIN DU SEGALA,
404045601,00014,40404560100014,O,1993-05-01,NN,,,2006-10-28T03:18:42,false,3,,1825,,RTE,DE TOULOUSE,31380,VILLARIES,,,31579,,,,,,,,,,,,,,,,,,,2006-09-07,F,,,,,01.1C,NAFRev1,N,1.492772,43.738677,0.86,housenumber,1825 Route de Toulouse 31380 Villariès,31579_0027_01825,G,1825 ROUTE DE TOULOUSE,
404045601,00022,40404560100022,O,2006-09-07,NN,,,2008-04-26T13:27:43,true,2,,974,,CHE,BALARD,31380,VILLARIES,,,31579,,,,,,,,,,,,,,,,,,,2007-12-20,F,,,,,01.1A,NAFRev1,N,1.483286,43.758949,0.87,housenumber,974 Chemin de Balard 31380 Villariès,31579_0008_00974,G,974 CHEMIN DE BALARD,
405215039,00018,40521503900018,O,1996-05-13,NN,,,,true,1,,,,RTE,DE BESSIERES,31380,VILLARIES,,,31579,,,,,,,,,,,,,,,,,,,2002-06-03,F,,,,,33.1B,NAF1993,N,1.492139,43.755505,0.84,street,Route de Bessières 31380 Villariès,31579_0010,G,ROUTE DE BESSIERES,
405283508,00019,40528350800019,O,1974-01-01,NN,,,2008-01-04T20:53:02,true,3,,,,,,31380,VILLARIES,,,31579,,,,,,,,,,,,,,,,,,,2008-01-01,A,,,,,01.11Z,NAFRev2,N,,,0,,,,,,
407657071,00012,40765707100012,O,1996-01-01,NN,,,2006-11-25T15:13:37,false,5,,,,CHE,DE VIGNEBARRADE,31380,VILLARIES,,,31579,,,,,,,,,,,,,,,,,,,2006-03-01,F,,,,,51.4S,NAFRev1,N,1.49278,43.757301,0.76,street,Chemin de Vigne Barrade 31380 Villariès,31579_0029,G,CHEMIN DE VIGNE BARRADE,
407671692,00017,40767169200017,O,1996-06-03,NN,,,2008-11-08T01:19:00,true,3,,3,,RTE,DE VAQUIERS,31380,VILLARIES,,,31579,,,,,,,,,,,,,,,,,,,2003-09-26,F,,,,,50.2Z,NAFRev1,N,1.489582,43.755115,0.64,street,Route de Vacquiers 31380 Villariès,31579_0028,G,ROUTE DE VACQUIERS,
409167871,00014,40916787100014,O,1996-09-14,NN,,,2008-01-04T21:22:23,true,3,,,,CHE,DE CAMPUNO,31380,VILLARIES,,,31579,,,,,,,,,,,,,,,,,,,2008-01-01,A,,,,,90.01Z,NAFRev2,N,1.492469,43.759079,0.82,street,Chemin de Campuno 31380 Villariès,31579_0012,G,CHEMIN DE CAMPUNO,
410331672,00023,41033167200023,O,2004-10-01,,,8122ZZ,2015-03-17T00:49:03,true,3,,1143,,RTE,DE TOULOUSE,31380,VILLARIES,,,31579,,,,,,,,,,,,,,,,,,,2008-01-01,A,,,,,81.21Z,NAFRev2,N,1.491777,43.743418,0.86,housenumber,1143 Route de Toulouse 31380 Villariès,31579_0027_01143,G,1143 ROUTE DE TOULOUSE,
414500058,00014,41450005800014,O,1997-11-01,NN,,,,true,1,,,,RTE,DE BESSIERES,31380,VILLARIES,,,31579,,,,,,,,,,,,,,,,,,,1999-11-27,F,,,,,51.6G,NAF1993,O,1.492139,43.755505,0.84,street,Route de Bessières 31380 Villariès,31579_0010,G,ROUTE DE BESSIERES,
414954974,00013,41495497400013,O,1997-12-18,NN,,,2011-06-26T05:06:57,true,4,,,,RTE,DE VACQUIERS,31380,VILLARIES,,,31579,,,,,,,,,,,,,,,,,,,2005-06-30,F,,,,,55.3A,NAFRev1,N,1.489582,43.755115,0.84,street,Route de Vacquiers 31380 Villariès,31579_0028,G,ROUTE DE VACQUIERS,