siren,nic,siret,statutDiffusionEtablissement,dateCreationEtablissement,trancheEffectifsEtablissement,anneeEffectifsEtablissement,activitePrincipaleRegistreMetiersEtablissement,dateDernierTraitementEtablissement,etablissementSiege,nombrePeriodesEtablissement,complementAdresseEtablissement,numeroVoieEtablissement,indiceRepetitionEtablissement,typeVoieEtablissement,libelleVoieEtablissement,codePostalEtablissement,libelleCommuneEtablissement,libelleCommuneEtrangerEtablissement,distributionSpecialeEtablissement,codeCommuneEtablissement,codeCedexEtablissement,libelleCedexEtablissement,codePaysEtrangerEtablissement,libellePaysEtrangerEtablissement,complementAdresse2Etablissement,numeroVoie2Etablissement,indiceRepetition2Etablissement,typeVoie2Etablissement,libelleVoie2Etablissement,codePostal2Etablissement,libelleCommune2Etablissement,libelleCommuneEtranger2Etablissement,distributionSpeciale2Etablissement,codeCommune2Etablissement,codeCedex2Etablissement,libelleCedex2Etablissement,codePaysEtranger2Etablissement,libellePaysEtranger2Etablissement,dateDebut,etatAdministratifEtablissement,enseigne1Etablissement,enseigne2Etablissement,enseigne3Etablissement,denominationUsuelleEtablissement,activitePrincipaleEtablissement,nomenclatureActivitePrincipaleEtablissement,caractereEmployeurEtablissement,longitude,latitude,geo_score,geo_type,geo_adresse,geo_id,geo_ligne,geo_l4,geo_l5
042815100,00013,04281510000013,O,1994-12-25,01,2021,,2023-11-27T13:14:33,true,2,,19,,RUE,MAURICE SAND,36400,LA CHATRE,,,36046,,,,,,,,,,,,,,,,,,,2008-01-01,A,,,,,81.10Z,NAFRev2,O,1.987353,46.579845,0.83,street,Rue Maurice Sand 36400 La Châtre,36046_1260,G,RUE MAURICE SAND,
042834838,00015,04283483800015,O,1994-12-25,01,2021,,2023-11-27T13:14:33,true,2,,173,,RUE,NATIONALE,36400,LA CHATRE,,,36046,,,,,,,,,,,,,,,,,,,2008-01-01,A,,,,,81.10Z,NAFRev2,O,1.985981,46.580102,0.97,housenumber,173 Rue Nationale 36400 La Châtre,36046_1300_00173,G,173 RUE NATIONALE,
042843326,00010,04284332600010,O,1994-12-25,01,2021,,2023-11-27T13:14:33,true,2,,,,RUE,D OLMOR,36400,LA CHATRE,,,36046,,,,,,,,,,,,,,,,,,,2008-01-01,A,,,,,81.10Z,NAFRev2,O,1.98706,46.582496,0.95,street,Rue d'Olmor 36400 La Châtre,36046_1380,G,RUE D OLMOR,
060200417,01386,06020041701386,O,1980-12-01,NN,,,2008-01-04T18:08:01,false,3,,113,,RUE,NATIONALE,36400,LA CHATRE,,,36046,,,,,,,,,,,,,,,,,,,2007-01-01,F,ERAM SHOP 702,,,,52.4E,NAFRev1,N,1.987548,46.582443,0.97,housenumber,113 Rue Nationale 36400 La Châtre,36046_1300_00113,G,113 RUE NATIONALE,
085580488,01079,08558048801079,O,2006-04-14,NN,,,2017-08-31T08:53:05,false,3,,92,,RUE,NATIONALE,36400,LA CHATRE,,,36046,,,,,,,,,,,,,,,,,,,2008-01-01,F,,,,,65.12Z,NAFRev2,O,1.987599,46.582727,0.97,housenumber,92 Rue Nationale 36400 La Châtre,36046_1300_00092,G,92 RUE NATIONALE,
130007271,00039,13000727100039,O,2009-07-06,,,,2011-01-26T11:35:48,false,1,CENTRE DES FINANCES PUBLIQUES,,,PL,DU GENERAL DE GAULLE,36400,LA CHATRE,,,36046,,,,,,,,,,,,,,,,,,,2009-07-06,F,SIE DE LA CHATRE,,,,84.11Z,NAFRev2,N,1.986452,46.578289,0.91,street,Place du Général de Gaulle 36400 La Châtre,36046_0740,G,PLACE DU GENERAL DE GAULLE,
130007271,00096,13000727100096,O,2009-07-06,12,2021,,2023-11-27T13:15:39,false,2,BP 208,,,PL,DU GENERAL DE GAULLE,36400,LA CHATRE,,,36046,,,,,,,,,,,,,,,,,,,2023-01-01,A,SERVICE DE GESTION COMPTABLE LA CHATRE,,,,84.11Z,NAFRev2,N,1.986452,46.578289,0.91,street,Place du Général de Gaulle 36400 La Châtre,36046_0740,G,PLACE DU GENERAL DE GAULLE,
130007271,00179,13000727100179,O,2009-07-06,NN,,,2022-12-06T20:02:18,false,2,CENTRE DES FINANCES PUBLIQUES,,,PL,DU GENERAL DE GAULLE,36400,LA CHATRE,,,36046,,,,,,,,,,,,,,,,,,,2018-01-01,F,SIP ET ENTREPRISES DE LA CHATRE,,,,84.11Z,NAFRev2,N,1.986452,46.578289,0.91,street,Place du Général de Gaulle 36400 La Châtre,36046_0740,G,PLACE DU GENERAL DE GAULLE,
130009939,00054,13000993900054,O,2010-01-01,01,2021,,2023-11-27T13:15:43,false,1,,2,,RUE,JOSEPH AGEORGES,36400,LA CHATRE,,,36046,,,,,,,,,,,,,,,,,,,2010-01-01,A,POLE TERRITORIAL DE LA CHATRE,,,,84.13Z,NAFRev2,O,1.990159,46.586675,0.95,housenumber,2 Rue Joseph Ageorges 36400 La Châtre,36046_0960_00002,G,2 RUE JOSEPH AGEORGES,
171801111,00096,17180111100096,O,1984-01-01,NN,,,2011-04-23T04:07:53,false,4,,,,PL,GUY BONJOUR,36400,LA CHATRE,,,36046,,,,,,,,,,,,,,,,,,,2010-01-01,F,TRIBUNAL D'INSTANCE TI,,,,84.23Z,NAFRev2,N,,,0,,,,,,
171801111,00567,17180111100567,O,2007-12-25,,,,2021-01-14T10:26:59,false,2,,,,PL,GUY BONJOUR,36400,LA CHATRE,,,36046,,,,,,,,,,,,,,,,,,,2010-01-01,F,TRIBUNAL PARITAIRE DES BAUX RURAUX,,,,84.23Z,NAFRev2,N,,,0,,,,,,
173600016,00021,17360001600021,O,1983-11-01,02,2021,,2023-11-27T13:16:17,false,3,,,,AV,ARISTIDE BRIAND,36400,LA CHATRE,,,36046,,,,,,,,,,,,,,,,,,,2008-01-01,A,SOUS-PREFECTURE,,,,84.11Z,NAFRev2,N,1.985109,46.584928,0.86,street,Avenue Aristide Briand 36400 La Châtre,36046_0140,G,AVENUE ARISTIDE BRIAND,
173602111,00341,17360211100341,O,1985-01-01,NN,,,2009-10-24T03:17:11,false,4,,3,,PL,MAGET,36400,LA CHATRE,,,36046,,,,,,,,,,,,,,,,,,,2008-10-08,F,TRESORERIE DE LA CHATRE,,,,84.11Z,NAFRev2,N,1.987553,46.581327,0.78,housenumber,3 Place Maget 36400 La Châtre,36046_1120_00003,G,3 PLACE MAGET,
173602111,00440,17360211100440,O,2008-10-08,NN,,,2012-07-27T14:53:03,false,2,HOTEL DES FINANCES,,,PL,DU GENERAL DE GAULLE,36400,LA CHATRE,,,36046,,,,,,,,,,,,,,,,,,,2009-07-06,F,TRESORERIE LA CHATRE,,,,84.11Z,NAFRev2,N,1.986452,46.578289,0.91,street,Place du Général de Gaulle 36400 La Châtre,36046_0740,G,PLACE DU GENERAL DE GAULLE,
173602210,00192,17360221000192,O,1983-03-16,,,,2013-04-29T22:36:13,false,6,CENTRE DES FINANCES PUBLIQUES,,,PL,DU GENERAL DE GAULLE,36400,LA CHATRE,,BP 108,36046,,,,,,,,,,,,,,,,,,,2009-07-06,F,SCE IMPOTS PARTICULIERS LA CHATRE,,,,84.11Z,NAFRev2,N,1.986452,46.578289,0.91,street,Place du Général de Gaulle 36400 La Châtre,36046_0740,G,PLACE DU GENERAL DE GAULLE,
173602210,00226,17360221000226,O,1983-03-16,,,,2006-10-26T23:39:08,false,4,HOTEL DES IMPOTS,3,,AV,GUILLAUME DE MARCILLAT,36400,LA CHATRE,,BP 108,36046,,,,,,,,,,,,,,,,,,,2004-01-20,F,RECETTE PRINCIPALE LA CHATRE,,,,75.1A,NAFRev1,N,1.985157,46.577479,0.88,housenumber,3 Avenue Guillaume de Marcillat 36400 La Châtre,36046_0820_00003,G,3 AVENUE GUILLAUME DE MARCILLAT,
173602210,00358,17360221000358,O,2004-01-20,,,,2013-04-29T22:36:13,false,5,CENTRE DES FINANCES PUBLIQUES,,,PL,DU GENERAL DE GAULLE,36400,LA CHATRE,,BP 108,36046,,,,,,,,,,,,,,,,,,,2009-07-06,F,SCE IMPOTS ENTREPRISES LA CHATRE,,,,84.11Z,NAFRev2,N,1.986452,46.578289,0.91,street,Place du Général de Gaulle 36400 La Châtre,36046_0740,G,PLACE DU GENERAL DE GAULLE,
173604315,00031,17360431500031,O,1985-01-01,02,2021,,2023-11-27T13:16:17,false,4,,136,,RUE,NATIONALE,36400,LA CHATRE,,,36046,,,,,,,,,,,,,,,,,,,2009-09-01,A,CIRCONSCRIPTION 1ER DEGRE IEN LA CHATRE,,,,84.12Z,NAFRev2,N,1.984514,46.577911,0.97,housenumber,136 Rue Nationale 36400 La Châtre,36046_1300_00136,G,136 RUE NATIONALE,
173606617,00046,17360661700046,O,1983-03-16,NN,,,2012-05-05T00:18:43,false,5,,2,,PL,GUY BONJOUR,36400,LA CHATRE,,,36046,,,,,,,,,,,,,,,,,,,2009-12-31,F,DDE SUBDIVISION LA CHATRE,,,,84.13Z,NAFRev2,N,,,0,,,,,,
180092157,00338,18009215700338,O,2006-01-01,,,,2022-07-29T13:41:22,false,3,,,,,BELLE PLACE,36400,LA CHATRE,,,36046,,,,,,,,,,,,,,,,,,,2010-02-01,F,CENTRE TECHNIQUE DE LA CHATRE,,,,84.13Z,NAFRev2,N,1.979777,46.565295,0.95,street,Belle Place 36400 La Châtre,36046_7dxcjy,G,BELLE PLACE,
193600178,00076,19360017800076,O,1992-08-04,NN,,,2016-04-26T01:14:34,false,6,,16,,RUE,HENRI DE LATOUCHE,36400,LA CHATRE,,,36046,,,,,,,,,,,,,,,,,,,2010-12-25,F,LEGTA,,,,85.32Z,NAFRev2,N,1.98948,46.578626,0.95,housenumber,16 Rue Henri de Latouche 36400 La Châtre,36046_0860_00016,G,16 RUE HENRI DE LATOUCHE,
193600194,00016,19360019400016,O,1983-03-01,21,2021,,2023-11-27T13:17:11,true,4,,25,,AV,GEORGE SAND,36400,LA CHATRE,,,36046,,,,,,,,,,,,,,,,,,,2008-01-01,A,,,,,85.31Z,NAFRev2,O,1.980265,46.582663,0.85,housenumber,25 Avenue George Sand 36400 La Châtre,36046_0760_00025,G,25 AVENUE GEORGE SAND,
193600202,00017,19360020200017,O,,,,,,true,1,,,,AV,GEORGE SAND,36400,LA CHATRE,,,36046,,,,,,,,,,,,,,,,,,,1995-09-01,F,,,,,80.2C,NAF1993,N,1.982316,46.582209,0.83,street,Avenue George Sand 36400 La Châtre,36046_0760,G,AVENUE GEORGE SAND,
193606001,00025,19360600100025,O,,,,,,true,1,,16,,RUE,HENRI DE LATOUCHE,36400,LA CHATRE,,,36046,,,,,,,,,,,,,,,,,,,1992-08-04,F,,,,,80.2A,NAF1993,N,1.98948,46.578626,0.95,housenumber,16 Rue Henri de Latouche 36400 La Châtre,36046_0860_00016,G,16 RUE HENRI DE LATOUCHE,
193607207,00019,19360720700019,O,1983-03-01,NN,,,2013-05-18T02:09:37,false,5,,2,,IMP,GEORGE SAND,36400,LA CHATRE,,BP 244,36046,,,,,,,,,,,,,,,,,,,2011-11-02,F,,,,,85.31Z,NAFRev2,O,1.98557,46.582346,0.84,housenumber,2 Impasse George Sand 36400 La Châtre,36046_0780_00002,G,2 IMPASSE GEORGE SAND,
193607207,00027,19360720700027,O,2011-11-02,12,2021,,2023-11-27T13:17:12,true,1,,9,,RUE,DU 14 JUILLET,36400,LA CHATRE,,,36046,,,,,,,,,,,,,,,,,,,2011-11-02,A,,,,,85.31Z,NAFRev2,O,1.986444,46.583099,0.96,housenumber,9 Rue du 14 Juillet 36400 La Châtre,36046_1700_00009,G,9 RUE DU 14 JUILLET,
213600463,00011,21360046300011,O,1983-03-01,21,2021,,2023-11-27T13:21:48,true,4,,,,PL,DE L HOTEL DE VILLE,36400,LA CHATRE,,,36046,,,,,,,,,,,,,,,,,,,2008-01-01,A,MAIRIE,,,,84.11Z,NAFRev2,O,1.986639,46.581735,0.9,street,Place de l'Hotel de Ville 36400 La Châtre,36046_1140,G,PLACE DE L HOTEL DE VILLE,
213600463,00029,21360046300029,O,1983-03-16,NN,,,2016-08-18T14:16:22,false,4,,,,RUE,FREDERIC CHOPIN,36400,LA CHATRE,,,36046,,,,,,,,,,,,,,,,,,,2014-12-25,F,VILLE DE LA CHATRE PISCINE,,,,93.11Z,NAFRev2,N,1.981545,46.583577,0.96,street,Rue Frédéric Chopin 36400 La Châtre,36046_0640,G,RUE FREDERIC CHOPIN,
213600463,00037,21360046300037,O,1983-12-21,03,2021,,2023-11-27T13:21:48,false,3,,11,,RUE,DU PRE DE LA BARRE,36400,LA CHATRE,,,36046,,,,,,,,,,,,,,,,,,,2008-01-01,A,ECOLE MATERNELLE PUBLIQUE M-L LAGUERRE,,,,85.10Z,NAFRev2,N,1.985109,46.57536,0.96,housenumber,11 Rue du Pre de la Barre 36400 La Châtre,36046_1520_00011,G,11 RUE DU PRE DE LA BARRE,
213600463,00045,21360046300045,O,1983-12-21,03,2021,,2023-11-27T13:21:48,false,3,,6,,RUE,ROHART,36400,LA CHATRE,,,36046,,,,,,5,,AV,ARISTIDE BRIAND,36400,LA CHATRE,,,36046,,,,,2008-01-01,A,ECOLE PRIMAIRE PUBLIQUE MAURICE ROLLINAT,,,,85.20Z,NAFRev2,N,1.983084,46.582787,0.95,housenumber,6 Rue Rohart 36400 La Châtre,36046_1540_00006,G,6 RUE ROHART,
213600463,00052,21360046300052,O,1983-12-21,00,2021,,2023-11-27T13:21:48,false,4,,11,,RUE,ALPHONSE FLEURY,36400,LA CHATRE,,,36046,,,,,,,,,,,,,,,,,,,2021-08-31,F,ECOLE MATERNELLE PUBLIC GUSTAVE FLAUBERT,,,,85.10Z,NAFRev2,N,1.989076,46.582793,0.96,housenumber,11 Rue Alphonse Fleury 36400 La Châtre,36046_0120_00011,G,11 RUE ALPHONSE FLEURY,
213600463,00060,21360046300060,O,1983-12-21,11,2021,,2023-11-27T13:21:48,false,3,,12,,RUE,GALLIENI,36400,LA CHATRE,,,36046,,,,,,,,,,,,,,,,,,,2008-01-01,A,ECOL PRIM EUGENE DELACROIX,,,,85.20Z,NAFRev2,N,1.984157,46.580287,0.96,housenumber,12 Rue Galliéni 36400 La Châtre,36046_0680_00012,G,12 RUE GALLIENI,
213600463,00078,21360046300078,O,1985-08-20,NN,,,2016-08-18T14:29:57,false,4,,2,,RUE,SAINT ROCH,36400,LA CHATRE,,,36046,,,,,,,,,,,,,,,,,,,2009-01-01,F,FOYER DE JEUNES TRAVAILLEURS,,,,55.90Z,NAFRev2,N,1.989169,46.580293,0.95,housenumber,2 Rue Saint-roch 36400 La Châtre,36046_1620_00002,G,2 RUE SAINT ROCH,
213600463,00086,21360046300086,O,1997-01-01,00,2021,,2023-11-27T13:21:48,false,3,MAIRIE,,,PL,DE L HOTEL DE VILLE,36400,LA CHATRE,,,36046,,,,,,,,,,,,,,,,,,,2008-01-01,A,SERVICE DES EAUX,,,,36.00Z,NAFRev2,N,1.986639,46.581735,0.9,street,Place de l'Hotel de Ville 36400 La Châtre,36046_1140,G,PLACE DE L HOTEL DE VILLE,
213600463,00094,21360046300094,O,1997-01-01,NN,,,2011-03-15T09:53:31,false,4,MAIRIE,,,PL,DE L HOTEL DE VILLE,36400,LA CHATRE,,,36046,,,,,,,,,,,,,,,,,,,2008-01-01,F,SERVICE ASSAINISSEMENT,,,,37.00Z,NAFRev2,N,1.986639,46.581735,0.9,street,Place de l'Hotel de Ville 36400 La Châtre,36046_1140,G,PLACE DE L HOTEL DE VILLE,
213600463,00102,21360046300102,O,1999-01-01,NN,,,2007-11-06T10:03:45,false,3,MAIRIE,,,PL,DE L HOTEL DE VILLE,36400,LA CHATRE,,,36046,,,,,,,,,,,,,,,,,,,2007-11-05,F,CIMETIERE,,,,93.0H,NAFRev1,N,1.986639,46.581735,0.9,street,Place de l'Hotel de Ville 36400 La Châtre,36046_1140,G,PLACE DE L HOTEL DE VILLE,
213600463,00110,21360046300110,O,2003-05-01,NN,,,2016-08-18T14:27:30,false,3,,,,,VAVRE,36400,LA CHATRE,,,36046,,,,,,,,,,,,,,,,,,,2008-01-01,F,CAMPING VAL VERT,,,,55.30Z,NAFRev2,N,2.00216,46.570841,0.92,street,Vavres 36400 La Châtre,36046_4834o1,G,VAVRES,
213600463,00128,21360046300128,O,2020-01-01,,,,2023-05-04T16:04:30,false,1,MAIRIE,,,PL,DE L HOTEL DE VILLE,36400,LA CHATRE,,,36046,,,,,,,,,,,,,,,,,,,2020-01-01,A,LOTISSEMENT LES AJONCS,,,,42.99Z,NAFRev2,N,1.986639,46.581735,0.9,street,Place de l'Hotel de Ville 36400 La Châtre,36046_1140,G,PLACE DE L HOTEL DE VILLE,
223600016,00164,22360001600164,O,1985-08-20,NN,,,,false,4,,8,,RUE,D OLMOR,36400,LA CHATRE,,,36046,,,,,,,,,,,,,,,,,,,1997-12-25,F,CONSULTATION DE PMI,,,,85.1C,NAF1993,N,1.986821,46.582282,0.95,housenumber,8 Rue d'Olmor 36400 La Châtre,36046_1380_00008,G,8 RUE D OLMOR,
223600016,00388,22360001600388,O,1997-12-25,NN,,,2021-10-27T08:11:36,false,3,HALTE GARDERIE,,,PL,DES CARMES,36400,LA CHATRE,,,36046,,,,,,,,,,,,,,,,,,,2020-12-25,A,CONSULTATION DE PMI,,,,86.22C,NAFRev2,N,1.986363,46.581876,0.8,street,Place des Carmes 36400 La Châtre,36046_0363,G,PLACE DES CARMES,
243600046,00037,24360004600037,O,1998-09-23,NN,,,,true,1,,6,,RUE,DU CHAMP GALANT,36400,LA CHATRE,,,36046,,,,,,,,,,,,,,,,,,,2001-12-27,F,,,,,75.1A,NAF1993,O,1.980021,46.572272,0.96,housenumber,6 Rue du Champ Galant 36400 La Châtre,36046_0390_00006,G,6 RUE DU CHAMP GALANT,
243600137,00018,24360013700018,O,1983-03-01,NN,,,,true,1,,,,PL,DE L HOTEL DE VILLE,36400,LA CHATRE,,,36046,,,,,,,,,,,,,,,,,,,2001-12-27,F,,,,,75.1A,NAF1993,N,1.986639,46.581735,0.9,street,Place de l'Hotel de Ville 36400 La Châtre,36046_1140,G,PLACE DE L HOTEL DE VILLE,
243600350,00017,24360035000017,O,2002-01-01,NN,,,2012-05-05T00:34:06,false,4,,6,,RUE,DU CHAMP GALANT,36400,LA CHATRE,,,36046,,,,,,,,,,,,,,,,,,,2010-09-07,F,,,,,84.11Z,NAFRev2,O,1.980021,46.572272,0.96,housenumber,6 Rue du Champ Galant 36400 La Châtre,36046_0390_00006,G,6 RUE DU CHAMP GALANT,
243600350,00025,24360035000025,O,2002-01-01,NN,,,2021-02-23T10:34:21,false,3,,,,PL,DU GENERAL DE GAULLE,36400,LA CHATRE,,,36046,,,,,,,,,,,,,,,,,,,2008-01-01,A,ATELIERS INDUSTRIELS,,,,68.20B,NAFRev2,N,1.986452,46.578289,0.91,street,Place du Général de Gaulle 36400 La Châtre,36046_0740,G,PLACE DU GENERAL DE GAULLE,
243600350,00033,24360035000033,O,2002-01-01,11,2021,,2023-11-27T13:26:38,false,4,,,,PL,DU GENERAL DE GAULLE,36400,LA CHATRE,,,36046,,,,,,,,,,,,,,,,,,,2008-01-01,A,SERVICE DES ORDURES MENAGERES,,,,38.11Z,NAFRev2,O,1.986452,46.578289,0.91,street,Place du Général de Gaulle 36400 La Châtre,36046_0740,G,PLACE DU GENERAL DE GAULLE,
243600350,00066,24360035000066,O,2010-09-07,12,2021,,2023-11-27T13:26:38,true,1,,,,PL,DU GENERAL DE GAULLE,36400,LA CHATRE,,,36046,,,,,,,,,,,,,,,,,,,2010-09-07,A,,,,,84.11Z,NAFRev2,O,1.986452,46.578289,0.91,street,Place du Général de Gaulle 36400 La Châtre,36046_0740,G,PLACE DU GENERAL DE GAULLE,
243600350,00074,24360035000074,O,2014-12-25,,,,2016-08-18T14:19:56,false,1,,,,RUE,FREDERIC CHOPIN,36400,LA CHATRE,,,36046,,,,,,,,,,,,,,,,,,,2014-12-25,A,PISCINE DU PAYS DE LA CHATRE,,,,93.11Z,NAFRev2,N,1.981545,46.583577,0.96,street,Rue Frédéric Chopin 36400 La Châtre,36046_0640,G,RUE FREDERIC CHOPIN,
243600350,00082,24360035000082,O,2002-01-01,,,,2016-08-18T14:24:17,false,1,,,,,VAVRE,36400,LA CHATRE,,,36046,,,,,,,,,,,,,,,,,,,2002-01-01,A,CAMPING VAL VERT,,,,55.30Z,NAFRev2,N,2.00216,46.570841,0.92,street,Vavres 36400 La Châtre,36046_4834o1,G,VAVRES,
253600274,00018,25360027400018,O,,,,,2006-11-25T09:09:07,true,1,,,,PL,DE L HOTEL DE VILLE,36400,LA CHATRE,,,36046,,,,,,,,,,,,,,,,,,,,F,,,,,90.11,NAP,N,1.986639,46.581735,0.9,street,Place de l'Hotel de Ville 36400 La Châtre,36046_1140,G,PLACE DE L HOTEL DE VILLE,
253600308,00014,25360030800014,O,1983-03-01,NN,,,2014-06-13T23:43:01,true,4,MAIRIE,2,,RUE,JOSEPH AGEORGES,36400,LA CHATRE,,,36046,,,,,,,,,,,,,,,,,,,2012-05-01,F,,,,,84.13Z,NAFRev2,N,1.990159,46.586675,0.95,housenumber,2 Rue Joseph Ageorges 36400 La Châtre,36046_0960_00002,G,2 RUE JOSEPH AGEORGES,
253601884,00013,25360188400013,O,1991-06-12,NN,,,2008-10-09T16:28:17,true,3,MAIRIE,,,PL,DE L HOTEL DE VILLE,36400,LA CHATRE,,,36046,,,,,,,,,,,,,,,,,,,1993-02-10,F,,,,,75.1E,NAF1993,,1.986639,46.581735,0.9,street,Place de l'Hotel de Ville 36400 La Châtre,36046_1140,G,PLACE DE L HOTEL DE VILLE,
253602650,00017,25360265000017,O,1996-06-17,02,2021,,2023-11-27T13:27:03,true,3,MAIRIE,,,PL,DE L HOTEL DE VILLE,36400,LA CHATRE,,,36046,,,,,,,,,,,,,,,,,,,2008-01-01,A,,,,,84.13Z,NAFRev2,O,1.986639,46.581735,0.9,street,Place de l'Hotel de Ville 36400 La Châtre,36046_1140,G,PLACE DE L HOTEL DE VILLE,
253602650,00025,25360265000025,O,2017-01-01,01,2020,,2022-08-29T09:10:00,false,2,,15,,RUE,D OLMOR,36400,LA CHATRE,,,36046,,,,,,,,,,,,,,,,,,,2020-12-31,F,SCOT,,,,84.13Z,NAFRev2,N,1.987011,46.58213,0.95,housenumber,15 Rue d'Olmor 36400 La Châtre,36046_1380_00015,G,15 RUE D OLMOR,
253609713,00016,25360971300016,O,1990-06-21,NN,,,,true,1,,,,PL,DE L HOTEL DE VILLE,36400,LA CHATRE,,,36046,,,,,,,,,,,,,,,,,,,2001-12-27,F,,,,,75.1E,NAF1993,O,1.986639,46.581735,0.9,street,Place de l'Hotel de Ville 36400 La Châtre,36046_1140,G,PLACE DE L HOTEL DE VILLE,
253609788,00018,25360978800018,O,1999-06-07,NN,,,2013-11-29T19:23:14,true,4,MAIRIE,,,PL,DE L HOTEL DE VILLE,36400,LA CHATRE,,,36046,,,,,,,,,,,,,,,,,,,2013-11-15,F,,,,,84.13Z,NAFRev2,N,1.986639,46.581735,0.9,street,Place de l'Hotel de Ville 36400 La Châtre,36046_1140,G,PLACE DE L HOTEL DE VILLE,
253609796,00011,25360979600011,O,1999-07-22,NN,,,2021-10-27T08:12:09,true,3,HOTEL DE VILLE,,,PL,DE L HOTEL DE VILLE,36400,LA CHATRE,,,36046,,,,,,,,,,,,,,,,,,,2008-01-01,A,,,,,49.39A,NAFRev2,N,1.986639,46.581735,0.9,street,Place de l'Hotel de Ville 36400 La Châtre,36046_1140,G,PLACE DE L HOTEL DE VILLE,
263600033,00264,26360003300264,O,2019-01-01,,,,2019-03-12T15:25:54,false,1,,40,,RUE,DES OISEAUX,36400,LA CHATRE,,,36046,,,,,,,,,,,,,,,,,,,2019-01-01,A,CH CHATEAUROUX SITE DE LA CHATRE,,,,86.10Z,NAFRev2,N,1.985011,46.568667,0.96,housenumber,40 Rue des Oiseaux 36400 La Châtre,36046_1370_00040,G,40 RUE DES OISEAUX,
263600066,00017,26360006600017,O,1983-03-01,31,2021,,2023-11-27T13:27:57,true,4,,40,,RUE,DES OISEAUX,36400,LA CHATRE,,BP 126,36046,,,,,,,,,,,,,,,,,,,2008-01-01,A,,,,,86.10Z,NAFRev2,O,1.985011,46.568667,0.96,housenumber,40 Rue des Oiseaux 36400 La Châtre,36046_1370_00040,G,40 RUE DES OISEAUX,
263600066,00025,26360006600025,O,1984-01-01,,,,,false,4,,75,,RUE,JEAN PACTON,36400,LA CHATRE,,,36046,,,,,,,,,,,,,,,,,,,1992-07-22,F,MAISON DE RETRAITE,,,,85.3J,NAF1993,N,1.987905,46.587238,0.95,housenumber,75 Rue Jean Pacton 36400 La Châtre,36046_0940_00075,G,75 RUE JEAN PACTON,
263600066,00033,26360006600033,O,1984-12-01,NN,,,,false,3,,,,,LAULIERE,36400,LA CHATRE,,,36046,,,,,,,,,,,,,,,,,,,1992-07-22,F,INTER SECTEUR DE PSYCHIATRIE,,,,85.1A,NAF1993,N,1.984554,46.573854,0.94,street,Rue de Laulière 36400 La Châtre,36046_1060,G,RUE DE LAULIERE,
263600066,00041,26360006600041,O,1984-12-01,NN,,,,false,3,,,,RUE,JEAN PACTON,36400,LA CHATRE,,,36046,,,,,,,,,,,,,,,,,,,1992-07-22,F,ANNEXE DE L'HOPITAL,,,,85.1A,NAF1993,N,1.987729,46.587363,0.95,street,Rue Jean Pacton 36400 La Châtre,36046_0940,G,RUE JEAN PACTON,
263600066,00058,26360006600058,O,1984-12-01,NN,,,,false,3,,95,,RUE,NATIONALE,36400,LA CHATRE,,,36046,,,,,,,,,,,,,,,,,,,1992-07-22,F,ANNEXE DE L'HOPITAL,,,,85.1A,NAF1993,N,1.9879,46.582993,0.97,housenumber,95 Rue Nationale 36400 La Châtre,36046_1300_00095,G,95 RUE NATIONALE,
263600066,00066,26360006600066,O,1984-12-01,NN,,,,false,3,,75,,RUE,JEAN PACTON,36400,LA CHATRE,,,36046,,,,,,,,,,,,,,,,,,,1992-07-22,F,UNITE DE LONG SEJOUR,,,,85.1A,NAF1993,N,1.987905,46.587238,0.95,housenumber,75 Rue Jean Pacton 36400 La Châtre,36046_0940_00075,G,75 RUE JEAN PACTON,
263600066,00074,26360006600074,O,1985-01-01,,,,,false,4,QUARTIER LAULIERE,40,,RUE,DES OISEAUX,36400,LA CHATRE,,,36046,,,,,,,,,,,,,,,,,,,1992-07-22,F,MAISON RETRAITE,,,,85.3J,NAF1993,N,1.985011,46.568667,0.96,housenumber,40 Rue des Oiseaux 36400 La Châtre,36046_1370_00040,G,40 RUE DES OISEAUX,
263600066,00082,26360006600082,O,1985-01-01,NN,,,2011-04-23T04:21:22,false,3,,40,,RUE,DES OISEAUX,36400,LA CHATRE,,,36046,,,,,,,,,,,,,,,,,,,2008-01-01,A,CENTRE DE PLANIFICATION,,,,86.21Z,NAFRev2,N,1.985011,46.568667,0.96,housenumber,40 Rue des Oiseaux 36400 La Châtre,36046_1370_00040,G,40 RUE DES OISEAUX,
263600066,00090,26360006600090,O,1992-07-22,NN,,,2011-12-12T15:42:19,false,3,QUARTIER LAULIERE,40,,RUE,DES OISEAUX,36400,LA CHATRE,,,36046,,,,,,,,,,,,,,,,,,,2008-01-01,F,MAISON DE RETRAITE PETITE FADETTE HEBERG,,,,87.10A,NAFRev2,N,1.985011,46.568667,0.96,housenumber,40 Rue des Oiseaux 36400 La Châtre,36046_1370_00040,G,40 RUE DES OISEAUX,
263600066,00108,26360006600108,O,1992-07-22,NN,,,2009-06-27T03:31:10,false,4,QUARTIER LAULIERE,40,,RUE,DES OISEAUX,36400,LA CHATRE,,,36046,,,,,,,,,,,,,,,,,,,2008-01-01,F,INTERSECTEUR DE PSYCHIATRIE,,,,88.99B,NAFRev2,N,1.985011,46.568667,0.96,housenumber,40 Rue des Oiseaux 36400 La Châtre,36046_1370_00040,G,40 RUE DES OISEAUX,
263600066,00116,26360006600116,O,1992-07-22,NN,,,2011-12-12T15:44:57,false,4,,40,,RUE,DES OISEAUX,36400,LA CHATRE,,,36046,,,,,,,,,,,,,,,,,,,2010-12-25,F,MOYEN SEJOUR GEORGES RAVEAU,,,,86.10Z,NAFRev2,N,1.985011,46.568667,0.96,housenumber,40 Rue des Oiseaux 36400 La Châtre,36046_1370_00040,G,40 RUE DES OISEAUX,
263600066,00124,26360006600124,O,1992-07-22,11,2021,,2023-11-27T13:27:57,false,5,,40,,RUE,DES OISEAUX,36400,LA CHATRE,,BP 126,36046,,,,,,,,,,,,,,,,,,,2010-07-27,A,SSIAD,,,,86.90D,NAFRev2,N,1.985011,46.568667,0.96,housenumber,40 Rue des Oiseaux 36400 La Châtre,36046_1370_00040,G,40 RUE DES OISEAUX,
263600066,00132,26360006600132,O,1992-07-22,22,2021,,2023-11-27T13:27:57,false,5,QUARTIER LAULIERE,40,,RUE,DES OISEAUX,36400,LA CHATRE,,,36046,,,,,,,,,,,,,,,,,,,2014-03-10,A,EHPAD,,,,87.10A,NAFRev2,O,1.985011,46.568667,0.96,housenumber,40 Rue des Oiseaux 36400 La Châtre,36046_1370_00040,G,40 RUE DES OISEAUX,
263600066,00165,26360006600165,O,1994-03-01,,,,2008-04-17T14:53:32,false,4,,40,,RUE,DES OISEAUX,36400,LA CHATRE,,,36046,,,,,,,,,,,,,,,,,,,2008-03-18,F,SSDPA SECTEUR NEUVY ST SEPULCRE,,,,86.90D,NAFRev2,N,1.985011,46.568667,0.96,housenumber,40 Rue des Oiseaux 36400 La Châtre,36046_1370_00040,G,40 RUE DES OISEAUX,
263600066,00173,26360006600173,O,2002-12-25,,,,2008-01-04T18:58:42,false,2,,40,,RUE,DES OISEAUX,36400,LA CHATRE,,BP 126,36046,,,,,,,,,,,,,,,,,,,2008-01-01,A,DOTATION NON AFFECTEE,,,,66.19A,NAFRev2,N,1.985011,46.568667,0.96,housenumber,40 Rue des Oiseaux 36400 La Châtre,36046_1370_00040,G,40 RUE DES OISEAUX,
263600066,00199,26360006600199,O,2004-02-13,NN,,,2018-03-14T10:00:36,false,7,,40,,RUE,DES OISEAUX,36400,LA CHATRE,,,36046,,,,,,,,,,,,,,,,,,,2009-07-02,F,CTRE ACCUEIL JOUR PERSONNES AGEES ALZHEIMER,,,,88.10B,NAFRev2,N,1.985011,46.568667,0.96,housenumber,40 Rue des Oiseaux 36400 La Châtre,36046_1370_00040,G,40 RUE DES OISEAUX,
263600066,00207,26360006600207,O,1998-03-23,NN,,,2018-03-14T10:00:23,false,2,,,,RUE,DES OISEAUX,36400,LA CHATRE,,,36046,,,,,,,,,,,,,,,,,,,2008-01-01,F,SSIAD,,,,86.90D,NAFRev2,N,1.985011,46.568667,0.96,street,Rue des Oiseaux 36400 La Châtre,36046_1370,G,RUE DES OISEAUX,
263600280,00014,26360028000014,O,1983-03-01,NN,,,2010-06-26T03:08:57,true,3,MAIRIE,,,PL,DE L HOTEL DE VILLE,36400,LA CHATRE,,,36046,,,,,,,,,,,,,,,,,,,2008-01-01,A,CCAS,,,,88.99B,NAFRev2,N,1.986639,46.581735,0.9,street,Place de l'Hotel de Ville 36400 La Châtre,36046_1140,G,PLACE DE L HOTEL DE VILLE,