siren,nic,siret,statutDiffusionEtablissement,dateCreationEtablissement,trancheEffectifsEtablissement,anneeEffectifsEtablissement,activitePrincipaleRegistreMetiersEtablissement,dateDernierTraitementEtablissement,etablissementSiege,nombrePeriodesEtablissement,complementAdresseEtablissement,numeroVoieEtablissement,indiceRepetitionEtablissement,typeVoieEtablissement,libelleVoieEtablissement,codePostalEtablissement,libelleCommuneEtablissement,libelleCommuneEtrangerEtablissement,distributionSpecialeEtablissement,codeCommuneEtablissement,codeCedexEtablissement,libelleCedexEtablissement,codePaysEtrangerEtablissement,libellePaysEtrangerEtablissement,complementAdresse2Etablissement,numeroVoie2Etablissement,indiceRepetition2Etablissement,typeVoie2Etablissement,libelleVoie2Etablissement,codePostal2Etablissement,libelleCommune2Etablissement,libelleCommuneEtranger2Etablissement,distributionSpeciale2Etablissement,codeCommune2Etablissement,codeCedex2Etablissement,libelleCedex2Etablissement,codePaysEtranger2Etablissement,libellePaysEtranger2Etablissement,dateDebut,etatAdministratifEtablissement,enseigne1Etablissement,enseigne2Etablissement,enseigne3Etablissement,denominationUsuelleEtablissement,activitePrincipaleEtablissement,nomenclatureActivitePrincipaleEtablissement,caractereEmployeurEtablissement,longitude,latitude,geo_score,geo_type,geo_adresse,geo_id,geo_ligne,geo_l4,geo_l5
213701113,00010,21370111300010,O,1983-03-01,11,2021,,2023-11-27T13:21:51,true,5,,1,,PL,AGNES SOREL,37460,GENILLE,,,37111,,,,,,,,,,,,,,,,,,,2023-05-01,A,MAIRIE,,,,84.11Z,NAFRev2,O,1.093579,47.184943,0.84,housenumber,1 Place Agnès Sorel 37460 Genillé,37111_0010_00001,G,1 PLACE AGNES SOREL,
213701113,00028,21370111300028,O,1983-12-21,03,2021,,2023-11-27T13:21:51,false,3,,1,,RUE,IMBERT,37460,GENILLE,,,37111,,,,,,,,,,,,,,,,,,,2008-01-01,A,ECOLE PRIMAIRE PUBLIQUE,,,,85.20Z,NAFRev2,N,1.097068,47.18543,0.95,housenumber,1 Rue Imbert 37460 Genillé,37111_0035_00001,G,1 RUE IMBERT,
213701113,00036,21370111300036,O,1983-12-21,01,2021,,2023-11-27T13:21:51,false,3,,,,RUE,IMBERT,37460,GENILLE,,,37111,,,,,,,,,,,,,,,,,,,2008-01-01,A,ECOLE MATERNELLE PUBLIQUE,,,,85.10Z,NAFRev2,N,1.099765,47.187614,0.95,street,Rue Imbert 37460 Genillé,37111_0035,G,RUE IMBERT,
213701113,00044,21370111300044,O,1995-11-10,NN,,,2019-01-29T14:02:11,false,4,MAIRIE,1,,PL,AGNES SOREL,37460,GENILLE,,,37111,,,,,,,,,,,,,,,,,,,2017-12-15,F,SERVICE TRANSPORT SCOLAIRE,,,,49.39A,NAFRev2,N,1.093579,47.184943,0.84,housenumber,1 Place Agnès Sorel 37460 Genillé,37111_0010_00001,G,1 PLACE AGNES SOREL,
213701113,00051,21370111300051,O,2003-05-01,NN,,,2008-01-04T18:32:27,false,3,,,,RUE,DU STADE,37460,GENILLE,,,37111,,,,,,,,,,,,,,,,,,,2008-01-01,A,CAMPING MUNICIPAL,,,,55.30Z,NAFRev2,N,1.099094,47.183252,0.95,street,Rue du Stade 37460 Genillé,37111_0065,G,RUE DU STADE,
213701113,00069,21370111300069,O,2005-08-05,,,,2010-11-19T15:39:32,false,3,MAIRIE,1,,PL,AGNES SOREL,37460,GENILLE,,,37111,,,,,,,,,,,,,,,,,,,2010-08-27,F,LOTISSEMENT DE LA VARENNE,,,,42.99Z,NAFRev2,N,1.093579,47.184943,0.84,housenumber,1 Place Agnès Sorel 37460 Genillé,37111_0010_00001,G,1 PLACE AGNES SOREL,
213701113,00077,21370111300077,O,2019-04-01,,,,2019-02-20T11:55:39,false,1,,4,,RUE,DU 8 MAI,37460,GENILLE,,,37111,,,,,,,,,,,,,,,,,,,2019-04-01,A,STATION SERVICE,,,,47.30Z,NAFRev2,N,1.097754,47.182916,0.76,housenumber,4 Avenue du 8 Mai 37460 Genillé,37111_0030_00004,G,4 AVENUE DU 8 MAI,
253700876,00043,25370087600043,O,2003-04-24,NN,,,2011-04-23T04:19:37,false,4,,21,,RUE,JEANNE D'ARC,37460,GENILLE,,,37111,,,,,,,,,,,,,,,,,,,2009-05-25,F,,,,,38.11Z,NAFRev2,O,1.0918,47.185995,0.96,housenumber,21 Rue Jeanne d’Arc 37460 Genillé,37111_0040_00021,G,21 RUE JEANNE D ARC,
263701237,00012,26370123700012,O,1983-03-01,NN,,,2022-05-03T10:31:17,true,4,MAIRIE,1,,PL,AGNES SOREL,37460,GENILLE,,,37111,,,,,,,,,,,,,,,,,,,2021-05-04,F,CCAS,,,,88.99B,NAFRev2,N,1.093579,47.184943,0.84,housenumber,1 Place Agnès Sorel 37460 Genillé,37111_0010_00001,G,1 PLACE AGNES SOREL,
263703290,00019,26370329000019,O,1985-11-19,NN,,,2010-06-26T03:09:11,true,3,MAIRIE,,,,,37460,GENILLE,,,37111,,,,,,,,,,,,,,,,,,,2008-01-01,A,CDE,,,,88.99B,NAFRev2,N,1.170374,47.207173,0.52,street,La Marcaderie 37460 Genillé,37111_29gzs6,D,LA MARCADERIE,
300057189,00049,30005718900049,O,1998-05-02,NN,,,2006-11-25T09:11:18,false,3,,2,,RUE,JEANNE D'ARC,37460,GENILLE,,,37111,,,,,,,,,,,,,,,,,,,2005-11-17,F,,,,,52.5Z,NAFRev1,N,1.092911,47.185399,0.96,housenumber,2 Rue Jeanne d’Arc 37460 Genillé,37111_0040_00002,G,2 RUE JEANNE D ARC,
300057189,00064,30005718900064,O,2010-09-01,,,,2012-11-23T13:24:51,false,2,,17,,IMP,DES CHENES,37460,GENILLE,,,37111,,,,,,,,,,,,,,,,,,,2012-10-15,F,,,,,47.89Z,NAFRev2,N,1.093642,47.182964,0.84,housenumber,17 Impasse des Chenes 37460 Genillé,37111_0037_00017,G,17 IMPASSE DES CHENES,
300057189,00072,30005718900072,O,2012-10-15,,,,2021-02-23T10:35:36,true,1,,9,T,RUE,JEANNE D'ARC,37460,GENILLE,,,37111,,,,,,,,,,,,,,,,,,,2012-10-15,A,,,,,47.89Z,NAFRev2,N,1.092735,47.185576,0.87,housenumber,9ter Rue Jeanne d’Arc 37460 Genillé,37111_0040_00009_ter,G,9TER RUE JEANNE D ARC,
300222783,00015,30022278300015,O,,NN,,,,true,1,,9,,RUE,JEANNE D'ARC,37460,GENILLE,,,37111,,,,,,,,,,,,,,,,,,,1988-08-31,F,,,,,62.11,NAP,N,1.092546,47.185638,0.96,housenumber,9 Rue Jeanne d’Arc 37460 Genillé,37111_0040_00009,G,9 RUE JEANNE D ARC,
300230927,00018,30023092700018,O,,,,,,true,1,,,,LD,LA MIGEONNERIE,37460,GENILLE,,,37111,,,,,,,,,,,,,,,,,,,1985-12-25,F,,,,,82.03,NAP,N,1.09592,47.146034,0.94,street,La Migeonnerie 37460 Genillé,37111_jjqwst,G,LA MIGEONNERIE,
300427473,00016,30042747300016,O,,,,,,true,1,,,,,LA MIGEONNERIE,37460,GENILLE,,,37111,,,,,,,,,,,,,,,,,,,1984-12-25,F,,,,,,,N,1.09592,47.146034,0.94,street,La Migeonnerie 37460 Genillé,37111_jjqwst,G,LA MIGEONNERIE,
300740065,00010,30074006500010,O,,NN,,,,true,1,,,,,,37460,GENILLE,,,37111,,,,,,,,,,,,,,,,,,,1989-11-26,F,,,,,01.00,NAP,N,,,0,,,,,,
302531710,00051,30253171000051,O,,,,,,true,1,,,,,LE PETIT COURCHAMP,37460,GENILLE,,,37111,,,,,,,,,,,,,,,,,,,1987-12-15,F,,,,,55.40,NAP,N,1.096821,47.168978,0.61,street,Le Grand Courchamp 37460 Genillé,37111_B129,G,LE GRAND COURCHAMP,
303372445,00047,30337244500047,O,2001-07-03,NN,,,2008-11-07T00:18:59,true,3,,,,,LE MOULIN DE CHAUME,37460,GENILLE,,,37111,,,,,,,,,,,,,,,,,,,2006-10-31,F,,,,,45.3A,NAFRev1,N,1.057313,47.201519,0.94,street,Le Moulin de Chaume 37460 Genillé,37111_B177,G,LE MOULIN DE CHAUME,
303651996,00017,30365199600017,O,1975-01-01,NN,,,2008-01-04T19:26:24,true,5,,,,,LES BRUYERES,37460,GENILLE,,,37111,,,,,,,,,,,,,,,,,,,2008-01-01,A,,,,,68.20B,NAFRev2,N,1.153169,47.18638,0.94,street,Les Bruyeres 37460 Genillé,37111_r3f292,G,LES BRUYERES,
304527807,00024,30452780700024,O,,NN,,,,true,1,,,,LD,LE LONG DU BOIS,37460,GENILLE,,,37111,,,,,,,,,,,,,,,,,,,1996-12-31,F,,,,,45.2V,NAF1993,O,1.093115,47.162405,0.95,street,le Long du Bois 37460 Genillé,37111_mzm4dn,G,LE LONG DU BOIS,
305531147,00026,30553114700026,O,1900-01-01,NN,,,2016-04-26T01:48:55,true,5,,33,,RUE,JEANNE D'ARC,37460,GENILLE,,,37111,,,,,,,,,,,,,,,,,,,2014-06-30,F,,,,,86.23Z,NAFRev2,O,1.091482,47.186587,0.96,housenumber,33 Rue Jeanne d’Arc 37460 Genillé,37111_0040_00033,G,33 RUE JEANNE D ARC,
306780172,00012,30678017200012,O,1900-01-01,NN,,,2010-12-16T14:56:04,true,4,,,,LD,LA CLEMENCERIE,37460,GENILLE,,,37111,,,,,,,,,,,,,,,,,,,1991-12-25,F,,,,,60.01,NAP,N,1.137042,47.175965,0.95,street,La Clémencerie 37460 Genillé,37111_qvpt71,G,LA CLEMENCERIE,
309039550,00012,30903955000012,O,1900-01-01,NN,,,2013-05-18T02:37:50,false,5,,24,,RUE,JEANNE D'ARC,37460,GENILLE,,,37111,,,,,,,,,,,,,,,,,,,2011-12-01,F,,,,,86.21Z,NAFRev2,O,1.091339,47.186322,0.96,housenumber,24 Rue Jeanne d’Arc 37460 Genillé,37111_0040_00024,G,24 RUE JEANNE D ARC,
309039550,00020,30903955000020,O,2011-12-01,01,2021,,2023-11-27T13:32:25,true,1,,35,,RUE,DES CYPRES,37460,GENILLE,,,37111,,,,,,,,,,,,,,,,,,,2011-12-01,A,,,,,86.21Z,NAFRev2,O,1.096601,47.181587,0.95,housenumber,35 Rue des Cypres 37460 Genillé,37111_0017_00035,G,35 RUE DES CYPRES,
309309151,00053,30930915100053,O,1990-10-26,NN,,,2006-11-25T09:24:28,true,3,SNC MAGE,5,,RUE,DE L INDROIS,37460,GENILLE,,,37111,,,,,,,,,,,,,,,,,,,2003-03-31,F,,,,,74.1J,NAFRev1,N,1.090828,47.181967,0.95,housenumber,5 Rue de l'Indrois 37460 Genillé,37111_0036_00005,G,5 RUE DE L INDROIS,
309539278,00023,30953927800023,O,1985-05-01,NN,,,,true,1,,,,LD,BROUILLARD,37460,GENILLE,,,37111,,,,,,,,,,,,,,,,,,,2000-09-25,F,,,,,52.6E,NAF1993,N,1.112128,47.19616,0.95,street,Brouillard 37460 Genillé,37111_nlohnf,G,BROUILLARD,
310188529,00013,31018852900013,O,1900-01-01,NN,,,2008-01-05T19:19:13,true,3,,,,,LE POTEAU,37460,GENILLE,,,37111,,,,,,,,,,,,,,,,,,,2008-01-01,A,,,,,68.20B,NAFRev2,N,1.099353,47.178477,0.56,street,Les Coteaux de Nervaux 37460 Genillé,37111_B081,G,LES COTEAUX DE NERVAUX,
311141907,00023,31114190700023,O,1982-06-01,NN,,,2010-09-14T15:39:37,true,5,,7,,RUE,JEANNE D'ARC,37460,GENILLE,,,37111,,,,,,,,,,,,,,,,,,,2010-08-15,F,,,,,47.62Z,NAFRev2,O,1.092651,47.185597,0.96,housenumber,7 Rue Jeanne d’Arc 37460 Genillé,37111_0040_00007,G,7 RUE JEANNE D ARC,
311193106,00011,31119310600011,O,1977-01-01,NN,,,2008-11-07T00:26:06,false,4,,,,,LA ROULONNIERE,37460,GENILLE,,,37111,,,,,,,,,,,,,,,,,,,1999-11-26,F,,,,,45.4D,NAF1993,N,1.109462,47.157644,0.94,street,La Roulonniere 37460 Genillé,37111_fi22ff,G,LA ROULONNIERE,
311193106,00029,31119310600029,O,1999-11-26,NN,,,2008-11-07T00:26:06,true,3,,,,,LA BAUGE LOGNY,37460,GENILLE,,,37111,,,,,,,,,,,,,,,,,,,2007-12-31,F,,,,,45.4D,NAFRev1,N,1.121909,47.153823,0.46,street,Logny 37460 Genillé,37111_o0u063,G,LOGNY,
311997118,00030,31199711800030,O,,NN,,,,true,1,,,,,Z A DE LA VARENNE,37460,GENILLE,,,37111,,,,,,,,,,,,,,,,,,,1987-04-10,F,,,,,51.11,NAP,N,1.094381,47.183212,0.74,street,Rue de la Varenne 37460 Genillé,37111_0070,G,RUE DE LA VARENNE,
312276058,00012,31227605800012,O,,NN,,,,true,1,,6,,RUE,ADAM FUMEE,37460,GENILLE,,,37111,,,,,,,,,,,,,,,,,,,1994-10-11,F,,,,,36.1K,NAF1993,N,1.094416,47.184921,0.95,housenumber,6 Rue Adam Fumée 37460 Genillé,37111_0005_00006,G,6 RUE ADAM FUMEE,
312499288,00016,31249928800016,O,,NN,,,,true,1,,,,RUE,IMBERT,37460,GENILLE,,,37111,,,,,,,,,,,,,,,,,,,1991-08-20,F,,,,,50.2Z,NAF1993,N,1.099765,47.187614,0.95,street,Rue Imbert 37460 Genillé,37111_0035,G,RUE IMBERT,
313090177,00012,31309017700012,O,,,,,,true,1,,,,,MERTIER,37460,GENILLE,,,37111,,,,,,,,,,,,,,,,,,,1989-06-30,F,,,,,01.00,NAP,N,1.11357,47.170366,0.95,street,Mertier 37460 Genillé,37111_wezz5z,G,MERTIER,
313149817,00022,31314981700022,O,1995-04-01,NN,,,2007-07-12T18:23:23,false,3,,,,LD,LE PETIT MARSIN,37460,GENILLE,,,37111,,,,,,,,,,,,,,,,,,,2007-06-18,F,,,,,63.1E,NAFRev1,N,1.157,47.211189,0.94,street,Le Petit Marsin 37460 Genillé,37111_B208,G,LE PETIT MARSIN,
313301830,00011,31330183000011,O,,,,,,true,1,,6,,PL,AGNES SOREL,37460,GENILLE,,,37111,,,,,,,,,,,,,,,,,,,1987-08-31,F,,,,,67.08,NAP,N,1.093095,47.185102,0.84,housenumber,6 Place Agnès Sorel 37460 Genillé,37111_0010_00006,G,6 PLACE AGNES SOREL,
313564270,00012,31356427000012,O,,NN,,,,true,1,,17,,RUE,JEANNE D ARC,37460,GENILLE,,,37111,,,,,,,,,,,,,,,,,,,1989-01-17,F,,,,,00.98,NAP,N,1.092196,47.185799,0.96,housenumber,17 Rue Jeanne d’Arc 37460 Genillé,37111_0040_00017,G,17 RUE JEANNE D ARC,
313712788,00014,31371278800014,O,1900-01-01,NN,,,,true,4,,,,LD,LE PONT,37460,GENILLE,,,37111,,,,,,,,,,,,,,,,,,,1996-12-25,F,,,,,45.4J,NAF1993,O,1.097983,47.178602,0.94,street,Le Pont 37460 Genillé,37111_rceiue,G,LE PONT,
313826943,00018,31382694300018,O,1900-01-01,,,,2006-12-15T00:18:09,false,3,,,,LD,CHATEAU DE PONT,37460,GENILLE,,,37111,,,,,,,,,,,,,,,,,,,1993-09-01,F,,,,,01.1G,NAF1993,N,1.136214,47.168057,0.94,street,Le Chateau de Pont 37460 Genillé,37111_B066,G,LE CHATEAU DE PONT,
313826943,00026,31382694300026,O,2002-01-01,NN,,,2023-05-05T20:25:23,true,4,,,,,LE MOULIN DE PONT,37460,GENILLE,,,37111,,,,,,,,,,,,,,,,,,,2014-12-25,F,,,,,02.10Z,NAFRev2,N,1.132872,47.164623,0.79,street,Le Moulin du Pont 37460 Genillé,37111_B181,G,LE MOULIN DU PONT,
314101528,00011,31410152800011,O,,,,,,true,1,,,,DOM,DE MAROLLES,37460,GENILLE,,,37111,,,,,,,,,,,,,,,,,,,1978-12-31,F,,,,,01.1A,NAF1993,N,1.102473,47.185864,0.72,street,Rue Michel de Marolles 37460 Genillé,37111_0045,G,RUE MICHEL DE MAROLLES,
314220252,00014,31422025200014,O,1900-01-01,NN,,,2007-01-18T09:13:41,true,4,,5,,PL,AGNES SOREL,37460,GENILLE,,,37111,,,,,,,,,,,,,,,,,,,1994-12-25,F,,,,,01.2G,NAF1993,N,1.093799,47.184923,0.84,housenumber,5 Place Agnès Sorel 37460 Genillé,37111_0010_00005,G,5 PLACE AGNES SOREL,
314735655,00016,31473565500016,O,1979-01-01,NN,,,,true,3,,,,RUE,MICHEL DE MAROLLES,37460,GENILLE,,,37111,,,,,,,,,,,,,,,,,,,1996-12-25,F,,,,,70.2C,NAF1993,N,1.102473,47.185864,0.95,street,Rue Michel de Marolles 37460 Genillé,37111_0045,G,RUE MICHEL DE MAROLLES,
314832528,00017,31483252800017,O,1979-01-01,NN,,,2014-07-08T00:18:48,true,4,,,,,LES BEAUGERIES,37460,GENILLE,,,37111,,,,,,,,,,,,,,,,,,,2013-09-30,F,,,,,43.33Z,NAFRev2,N,1.118078,47.187907,0.95,street,les Beaugeries 37460 Genillé,37111_lbprou,G,LES BEAUGERIES,
315019406,00026,31501940600026,O,,,,,,true,1,,21,,PL,AGNES SOREL,37460,GENILLE,,,37111,,,,,,,,,,,,,,,,,,,1987-08-28,F,,,,,87.03,NAP,N,1.093998,47.185399,0.85,housenumber,21 Place Agnès Sorel 37460 Genillé,37111_0010_00021,G,21 PLACE AGNES SOREL,
315639252,00024,31563925200024,O,1984-03-01,,,4331ZB,2017-05-04T02:37:58,false,5,,23,,RUE,IMBERT,37460,GENILLE,,,37111,,,,,,,,,,,,,,,,,,,2015-11-01,F,,,,,43.31Z,NAFRev2,O,1.101573,47.191046,0.95,housenumber,23 Rue Imbert 37460 Genillé,37111_0035_00023,G,23 RUE IMBERT,
315639252,00032,31563925200032,O,2015-11-01,NN,,4331ZB,2018-09-29T12:15:33,true,2,,4,,RUE,DE L'INDROIS,37460,GENILLE,,,37111,,,,,,,,,,,,,,,,,,,2016-04-30,F,,,,,43.31Z,NAFRev2,O,1.090992,47.182718,0.86,street,Rue de l'Indrois 37460 Genillé,37111_0036,G,RUE DE L INDROIS,
315754556,00019,31575455600019,O,,NN,,,,true,1,,,,RUE,SAINT-PIERRE,37460,GENILLE,,,37111,,,,,,,,,,,,,,,,,,,1996-03-31,F,,,,,70.2C,NAF1993,N,1.094797,47.187757,0.95,street,Rue Saint Pierre 37460 Genillé,37111_0060,G,RUE SAINT PIERRE,
316706811,00015,31670681100015,O,1979-01-01,NN,,,2010-04-18T03:47:12,true,5,,,,,MARSIN,37460,GENILLE,,,37111,,,,,,,,,,,,,,,,,,,2008-02-29,F,,,,,46.23Z,NAFRev2,O,1.149209,47.194359,0.95,street,Marsin 37460 Genillé,37111_09zaqt,G,MARSIN,
316921238,00028,31692123800028,O,1998-08-05,NN,,,2023-07-03T20:42:42,true,4,,,,,CHATEAU DE MAROLLES,37460,GENILLE,,,37111,,,,,,,,,,,,,,,,,,,2017-12-25,F,,,,,68.20B,NAFRev2,N,1.124128,47.196631,0.95,street,Chateau de Marolles 37460 Genillé,37111_B065,G,CHATEAU DE MAROLLES,
317126944,00014,31712694400014,O,,,,,,true,1,,,,,HYS,37460,GENILLE,,,37111,,,,,,,,,,,,,,,,,,,1985-12-25,F,,,,,01.80,NAP,N,1.075497,47.21691,0.95,street,Hys 37460 Genillé,37111_hunfd9,G,HYS,
318361524,00016,31836152400016,O,,,,,,true,1,,,,,LE MOULIN DE LA ROCHE,37460,GENILLE,,,37111,,,,,,,,,,,,,,,,,,,1984-12-25,F,,,,,77.14,NAP,N,1.090861,47.191783,0.94,street,le Moulin de la Roche 37460 Genillé,37111_B178,G,LE MOULIN DE LA ROCHE,
318931193,00029,31893119300029,O,,,,,,true,1,,,,,LA HUTTIERE,37460,GENILLE,,,37111,,,,,,,,,,,,,,,,,,,1989-12-31,F,,,,,66.02,NAP,N,1.076101,47.184938,0.95,street,La Huttiere 37460 Genillé,37111_fiyxad,G,LA HUTTIERE,
319536041,00027,31953604100027,O,1997-08-06,,,,,false,3,,,,CHE,DU PETIT PRE,37460,GENILLE,,,37111,,,,,,,,,,,,,,,,,,,1999-01-01,F,,,,,60.2P,NAF1993,N,1.157,47.211189,0.34,street,Le Petit Marsin 37460 Genillé,37111_B208,G,LE PETIT MARSIN,
319536041,00035,31953604100035,O,1999-01-01,NN,,,2008-04-26T09:18:19,true,4,,,,RUE,DES BONS CHAMPS,37460,GENILLE,,,37111,,,,,,,,,,,,,,,,,,,2007-05-31,F,,,,,60.2P,NAFRev1,N,1.096617,47.188608,0.95,street,Rue des Bons Champs 37460 Genillé,37111_0012,G,RUE DES BONS CHAMPS,
320314982,00028,32031498200028,O,,NN,,,,true,1,,,,LD,LA VARENNE,37460,GENILLE,,,37111,,,,,,,,,,,,,,,,,,,,F,,,,,55.60,NAP,N,1.091119,47.183866,0.94,street,La Varenne 37460 Genillé,37111_70ufor,G,LA VARENNE,
320376510,00014,32037651000014,O,,,,,,true,1,,,,LD,LE PRESSOIR,37460,GENILLE,,,37111,,,,,,,,,,,,,,,,,,,1993-03-23,F,,,,,01.1A,NAF1993,N,1.095983,47.189101,0.95,street,Le Pressoir 37460 Genillé,37111_08iigt,G,LE PRESSOIR,
320440829,00010,32044082900010,O,1976-04-01,NN,,,2008-01-04T18:14:07,true,3,,,,LD,LE PETIT COURCHAMP,37460,GENILLE,,,37111,,,,,,,,,,,,,,,,,,,2008-01-01,A,,,,,01.61Z,NAFRev2,N,1.096821,47.168978,0.61,street,Le Grand Courchamp 37460 Genillé,37111_B129,G,LE GRAND COURCHAMP,
320831787,00025,32083178700025,O,1999-07-01,NN,,,,true,4,,,,RUE,DES RENARDS,37460,GENILLE,,,37111,,,,,,,,,,,,,,,,,,,2003-04-16,F,,,,,70.2C,NAFRev1,N,1.096377,47.177699,0.95,street,Rue des Renards 37460 Genillé,37111_0059,G,RUE DES RENARDS,
320914351,00012,32091435100012,O,1980-12-15,NN,,,2014-07-08T00:24:51,true,5,,12,,RUE,ADAM FUME,37460,GENILLE,,,37111,,,,,,,,,,,,,,,,,,,2010-06-30,F,,,,,10.71C,NAFRev2,O,1.094776,47.184884,0.9,housenumber,12 Rue Adam Fumée 37460 Genillé,37111_0005_00012,G,12 RUE ADAM FUMEE,
320952799,00023,32095279900023,O,1997-01-02,NN,,4321AB,2018-04-06T03:58:15,true,4,LA HUTTIERE,,,,CARROIR A PIOU,37460,GENILLE,,,37111,,,,,,,,,,,,,,,,,,,2018-03-31,F,,,,,43.21A,NAFRev2,N,1.07461,47.182527,0.77,street,Carroir Piou 37460 Genillé,37111_B060,G,CARROIR PIOU,
321573669,00017,32157366900017,O,,NN,,,,true,1,,,,LD,LE POTEAU,37460,GENILLE,,,37111,,,,,,,,,,,,,,,,,,,2002-07-31,F,,,,,70.2C,NAF1993,N,1.099353,47.178477,0.56,street,Les Coteaux de Nervaux 37460 Genillé,37111_B081,G,LES COTEAUX DE NERVAUX,
321840316,00012,32184031600012,O,,NN,,,,true,1,,,,LD,LA VARENNE,37460,GENILLE,,,37111,,,,,,,,,,,,,,,,,,,1989-04-01,F,,,,,55.60,NAP,N,1.091119,47.183866,0.94,street,La Varenne 37460 Genillé,37111_70ufor,G,LA VARENNE,
321845000,00017,32184500000017,O,1981-04-01,NN,,,2014-07-08T00:26:07,true,5,,27,,PL,AGNES SOREL,37460,GENILLE,,,37111,,,,,,,,,,,,,,,,,,,2013-01-31,F,,,,,10.71C,NAFRev2,O,1.093337,47.185543,0.85,housenumber,27 Place Agnès Sorel 37460 Genillé,37111_0010_00027,G,27 PLACE AGNES SOREL,
321976011,00015,32197601100015,O,1980-01-01,NN,,,2016-01-12T00:11:22,true,5,,,,,FERME DE RASSAY,37460,GENILLE,,,37111,,,,,,,,,,,,,,,,,,,2008-01-01,A,,,,,02.20Z,NAFRev2,N,1.086548,47.19663,0.59,street,Chateau de Rassay 37460 Genillé,37111_B067,G,CHATEAU DE RASSAY,
322276635,00016,32227663500016,O,1981-07-06,NN,,,2008-11-07T00:38:35,false,3,,23,,AV,DU GENERAL DE GAULLE,37460,GENILLE,,,37111,,,,,,,,,,,,,,,,,,,2006-11-23,F,,,,,60.2E,NAFRev1,O,1.096056,47.186594,0.88,housenumber,23 Avenue du Général de Gaulle 37460 Genillé,37111_0020_00023,G,23 AVENUE DU GENERAL DE GAULLE,
322276635,00024,32227663500024,O,2006-11-23,NN,,,2014-07-08T00:26:48,true,4,,2,,RUE,MAQUIS EPERNON,37460,GENILLE,,,37111,,,,,,,,,,,,,,,,,,,2012-07-31,F,TAXI BALLU,,,,49.32Z,NAFRev2,N,1.096791,47.187405,0.86,housenumber,2 Rue du Maquis d’Epernon 37460 Genillé,37111_0042_00002,G,2 RUE DU MAQUIS D EPERNON,
322962432,00025,32296243200025,O,2021-11-07,,,,2021-11-16T08:29:57,true,1,LOGNY - LA BEAUGE,,,,,37460,GENILLE,,,37111,,,,,,,,,,,,,,,,,,,2021-11-07,A,,,,,68.31Z,NAFRev2,N,1.115318,47.152817,0.63,street,La Beauge 37460 Genillé,37111_0rq1k1,D,LA BEAUGE,
323144428,00048,32314442800048,O,2021-09-30,,,,2022-02-07T15:41:52,true,1,,5,,AV,8 MAI,37460,GENILLE,,,37111,,,,,,,,,,,,,,,,,,,2021-09-30,A,,,,JR ETUDES-CONSULTANT,71.12B,NAFRev2,N,1.095984,47.183901,0.77,housenumber,5 Avenue du 8 Mai 37460 Genillé,37111_0030_00005,G,5 AVENUE DU 8 MAI,
323694703,00014,32369470300014,O,,NN,,,,true,1,,,,,MARSIN,37460,GENILLE,,,37111,,,,,,,,,,,,,,,,,,,,F,,,,,62.45,NAP,N,1.149209,47.194359,0.95,street,Marsin 37460 Genillé,37111_09zaqt,G,MARSIN,
324516681,00016,32451668100016,O,,NN,,,,true,1,,1,,RUE,JEANNE D'ARC,37460,GENILLE,,,37111,,,,,,,,,,,,,,,,,,,,F,,,,,67.01,NAP,N,1.093121,47.185474,0.96,housenumber,1 Rue Jeanne d’Arc 37460 Genillé,37111_0040_00001,G,1 RUE JEANNE D ARC,
324749258,00012,32474925800012,O,1982-06-01,NN,,,,true,1,,,,,LE PAVILLON,37460,GENILLE,,,37111,,,,,,,,,,,,,,,,,,,2001-12-31,F,,,,,01.1A,NAF1993,N,1.071315,47.21606,0.94,street,Le Pavillon 37460 Genillé,37111_kgesqg,G,LE PAVILLON,
324778851,00018,32477885100018,O,1981-01-01,NN,,,2008-01-04T19:00:18,true,5,,,,,CHATEAU DE LA GITONNIERE,37460,GENILLE,,,37111,,,,,,,,,,,,,,,,,,,2008-01-01,A,,,,,68.20B,NAFRev2,N,1.178674,47.201787,0.59,street,La Gitonniere 37460 Genillé,37111_dvkr51,G,LA GITONNIERE,
325277259,00017,32527725900017,O,,NN,,,,true,1,,,,LD,LE PETIT MARSIN,37460,GENILLE,,,37111,,,,,,,,,,,,,,,,,,,1991-07-31,F,,,,,01.00,NAP,N,1.157,47.211189,0.94,street,Le Petit Marsin 37460 Genillé,37111_B208,G,LE PETIT MARSIN,
325333037,00019,32533303700019,O,,,,,,true,1,,,,LD,LA PICHONNIERE,37460,GENILLE,,,37111,,,,,,,,,,,,,,,,,,,1984-12-25,F,,,,,62.46,NAP,N,1.077245,47.209359,0.94,street,La Pichonniere 37460 Genillé,37111_cr1qb2,G,LA PICHONNIERE,
325337376,00017,32533737600017,O,1982-08-09,NN,,,2010-04-18T04:08:54,true,4,,,,LD,BOURDAIN,37460,GENILLE,,,37111,,,,,,,,,,,,,,,,,,,2008-10-31,F,,,,,01.11Z,NAFRev2,N,1.124817,47.185074,0.94,street,Bourdain 37460 Genillé,37111_2v5i86,G,BOURDAIN,
325649010,00023,32564901000023,O,1985-10-01,NN,,,2008-11-07T00:42:55,false,3,,,,LD,LA CHARRIERE LOGNY,37460,GENILLE,,,37111,,,,,,,,,,,,,,,,,,,2008-01-01,F,,,,,31.09B,NAFRev2,N,1.121909,47.153823,0.4,street,Logny 37460 Genillé,37111_o0u063,G,LOGNY,
325649010,00031,32564901000031,O,2008-01-01,00,2021,4332AA,2023-11-27T13:41:59,true,4,RTE DE MONTRESOR,,,,ZA DE LA VENERIE,37460,GENILLE,,,37111,,,,,,,,,,,,,,,,,,,2021-07-31,F,HERVET MENUISERIES ENT,,,,43.32A,NAFRev2,O,1.117138,47.18169,0.66,street,La Venerie 37460 Genillé,37111_f48llb,G,LA VENERIE,
326330420,00026,32633042000026,O,,,,,,true,1,,,,,LE MOTTAGE,37460,GENILLE,,,37111,,,,,,,,,,,,,,,,,,,1987-04-07,F,,,,,77.14,NAP,N,1.112334,47.167242,0.95,street,Le Mottage 37460 Genillé,37111_1zsf73,G,LE MOTTAGE,
326519501,00026,32651950100026,O,2011-04-13,02,2021,,2023-11-27T13:42:37,true,1,,2,,RUE,DES NOISETIERS,37460,GENILLE,,,37111,,,,,,,,,,,,,,,,,,,2011-04-13,A,8 A HUIT (CARREFOUR),,,,47.11C,NAFRev2,O,1.095526,47.181787,0.95,housenumber,2 Rue des Noisetiers 37460 Genillé,37111_0047_00002,G,2 RUE DES NOISETIERS,
326837861,00011,32683786100011,O,,,,,,true,1,,28,,RUE,ADAM FUME,37460,GENILLE,,,37111,,,,,,,,,,,,,,,,,,,1988-07-26,F,,,,,67.04,NAP,N,1.096346,47.184644,0.9,housenumber,28 Rue Adam Fumée 37460 Genillé,37111_0005_00028,G,28 RUE ADAM FUMEE,
327158549,00029,32715854900029,O,,NN,,,,true,1,,1,,RUE,JEANNE D ARC,37460,GENILLE,,,37111,,,,,,,,,,,,,,,,,,,1990-06-30,F,,,,,67.01,NAP,N,1.093121,47.185474,0.96,housenumber,1 Rue Jeanne d’Arc 37460 Genillé,37111_0040_00001,G,1 RUE JEANNE D ARC,
327302675,00027,32730267500027,O,1990-01-01,NN,,,,true,1,,,,,LA FRILLIERE,37460,GENILLE,,,37111,,,,,,,,,,,,,,,,,,,1999-12-31,F,,,,,01.1A,NAF1993,N,1.099398,47.145803,0.94,street,La Frilliere 37460 Genillé,37111_oxr54o,G,LA FRILLIERE,
328241039,00010,32824103900010,O,1983-09-05,NN,,,2010-04-18T04:16:58,false,5,,33,B,RUE,JEANNE D'ARC,37460,GENILLE,,,37111,,,,,,,,,,,,,,,,,,,2008-07-31,F,,,,,86.23Z,NAFRev2,O,1.09149,47.186648,0.96,housenumber,33b Rue Jeanne d’Arc 37460 Genillé,37111_0040_00033_b,G,33B RUE JEANNE D ARC,
328303839,00026,32830383900026,O,1999-11-18,NN,,,2008-01-04T19:37:14,true,3,,,,,LA THIBAUDIERE,37460,GENILLE,,,37111,,,,,,,,,,,,,,,,,,,2008-01-01,A,,,,,01.11Z,NAFRev2,N,1.119527,47.192742,0.94,street,La Thibaudiere 37460 Genillé,37111_v372lo,G,LA THIBAUDIERE,
328417910,00010,32841791000010,O,1990-01-01,NN,,,2018-04-25T03:52:26,true,4,,,,LD,LA PEAUDIERE,37460,GENILLE,,,37111,,,,,,,,,,,,,,,,,,,2009-11-16,F,,,,,01.11Z,NAFRev2,N,1.103984,47.214673,0.73,street,La Reaudiere 37460 Genillé,37111_nxhevi,G,LA REAUDIERE,
328493663,00020,32849366300020,O,1984-01-01,NN,,,2014-01-11T13:08:10,true,4,,,,,LA PICHONNIERE,37460,GENILLE,,,37111,,,,,,,,,,,,,,,,,,,2013-12-25,F,,,,,01.42Z,NAFRev2,N,1.077245,47.209359,0.94,street,La Pichonniere 37460 Genillé,37111_cr1qb2,G,LA PICHONNIERE,