siren,nic,siret,statutDiffusionEtablissement,dateCreationEtablissement,trancheEffectifsEtablissement,anneeEffectifsEtablissement,activitePrincipaleRegistreMetiersEtablissement,dateDernierTraitementEtablissement,etablissementSiege,nombrePeriodesEtablissement,complementAdresseEtablissement,numeroVoieEtablissement,indiceRepetitionEtablissement,typeVoieEtablissement,libelleVoieEtablissement,codePostalEtablissement,libelleCommuneEtablissement,libelleCommuneEtrangerEtablissement,distributionSpecialeEtablissement,codeCommuneEtablissement,codeCedexEtablissement,libelleCedexEtablissement,codePaysEtrangerEtablissement,libellePaysEtrangerEtablissement,complementAdresse2Etablissement,numeroVoie2Etablissement,indiceRepetition2Etablissement,typeVoie2Etablissement,libelleVoie2Etablissement,codePostal2Etablissement,libelleCommune2Etablissement,libelleCommuneEtranger2Etablissement,distributionSpeciale2Etablissement,codeCommune2Etablissement,codeCedex2Etablissement,libelleCedex2Etablissement,codePaysEtranger2Etablissement,libellePaysEtranger2Etablissement,dateDebut,etatAdministratifEtablissement,enseigne1Etablissement,enseigne2Etablissement,enseigne3Etablissement,denominationUsuelleEtablissement,activitePrincipaleEtablissement,nomenclatureActivitePrincipaleEtablissement,caractereEmployeurEtablissement,longitude,latitude,geo_score,geo_type,geo_adresse,geo_id,geo_ligne,geo_l4,geo_l5
214302085,00011,21430208500011,O,1983-03-01,01,2021,,2023-11-27T13:22:17,true,3,,,,,,43230,SAINTE-MARGUERITE,,,43208,,,,,,,,,,,,,,,,,,,2008-01-01,A,MAIRIE,,,,84.11Z,NAFRev2,N,,,0,,,,,,
214302085,00029,21430208500029,O,2023-02-01,,,,2023-03-04T12:53:42,false,1,MAIRIE,,,,LE BOURG,43230,SAINTE-MARGUERITE,,,43208,,,,,,,,,,,,,,,,,,,2023-02-01,A,PHOTOVOLTAIQUE,,,,35.11Z,NAFRev2,N,2.212915,47.9910304,0.9,poi.bar,Le Bourg (Bar) Ingrannes,https://osm.org/node/1718543174,G,,
264302019,00015,26430201900015,O,1983-03-01,NN,,,2019-11-14T14:00:38,true,3,,,,,,43230,SAINTE-MARGUERITE,,,43208,,,,,,,,,,,,,,,,,,,2008-01-01,A,CCAS,,,,88.99B,NAFRev2,N,,,0,,,,,,
305945024,00027,30594502400027,O,2011-08-16,,,,2019-11-14T14:00:38,false,1,,8,,CHE,DE LACHAUD,43230,SAINTE-MARGUERITE,,,43208,,,,,,,,,,,,,,,,,,,2011-08-16,A,,,,,35.11Z,NAFRev2,N,3.587542,45.212492,0.39,locality,Champ de la Pointe 43230 Sainte-Marguerite,43208_B031,G,CHAMP DE LA POINTE,
318542370,00016,31854237000016,O,1980-01-01,NN,,,2019-12-18T04:08:56,true,4,,,,,LA GRAVIERE,43230,SAINTE-MARGUERITE,,,43208,,,,,,,,,,,,,,,,,,,2019-11-01,F,,,,,02.20Z,NAFRev2,N,4.9011282,46.4600547,0.9,poi.water,La Gravière (Eau) Montbellet,https://osm.org/way/144885873,G,,
326121787,00013,32612178700013,O,,NN,,,2019-11-14T14:00:38,true,1,,,,,CHARBONNIERE,43230,SAINTE-MARGUERITE,,,43208,,,,,,,,,,,,,,,,,,,1989-04-24,F,,,,,02.20,NAP,N,6.0178229,45.263817,0.9,poi.track,Charbonnière (Chemin) Theys,https://osm.org/way/244704875,G,,
327569992,00016,32756999200016,O,1983-06-25,NN,,2711ZB,2019-11-14T14:00:38,true,3,,,,,,43230,SAINTE-MARGUERITE,,,43208,,,,,,,,,,,,,,,,,,,2008-01-01,A,,,,,56.30Z,NAFRev2,N,,,0,,,,,,
327678942,00019,32767894200019,O,,,,,2019-11-14T14:00:38,true,1,,,,,,43230,SAINTE-MARGUERITE,,,43208,,,,,,,,,,,,,,,,,,,1984-12-25,F,,,,,64.49,NAP,N,,,0,,,,,,
381759372,00075,38175937200075,P,2021-02-15,,,,2021-04-24T12:43:25,true,1,[ND],[ND],[ND],[ND],[ND],[ND],SAINTE-MARGUERITE,,[ND],43208,[ND],[ND],,,[ND],[ND],[ND],[ND],[ND],[ND],,,[ND],,[ND],[ND],,,2021-02-15,A,[ND],[ND],[ND],[ND],70.21Z,NAFRev2,N,,,0,,,,,,
390002426,00018,39000242600018,O,1993-01-01,NN,,,2022-01-05T04:00:37,true,4,,,,,LA VIGNE,43230,SAINTE-MARGUERITE,,,43208,,,,,,,,,,,,,,,,,,,2021-12-31,F,,,,,01.42Z,NAFRev2,N,3.581322,45.205445,0.5,street,La Vizade 43230 Sainte-Marguerite,43208_fkv1qx,G,LA VIZADE,
411209653,00020,41120965300020,O,1990-03-01,NN,,,2019-11-14T14:00:38,false,3,,,,,BOITOUX,43230,SAINTE-MARGUERITE,,,43208,,,,,,,,,,,,,,,,,,,2008-01-01,A,,,,,01.19Z,NAFRev2,N,5.3142107,46.4300037,0.88,poi.track,Impasse des Boitoux (Chemin) Domsure,https://osm.org/way/318755981,G,,
425323706,00019,42532370600019,O,1980-09-01,NN,,,2019-11-14T14:00:38,true,3,,,,,,43230,SAINTE-MARGUERITE,,,43208,,,,,,,,,,,,,,,,,,,2008-01-01,A,,,,,90.01Z,NAFRev2,N,,,0,,,,,,
430902387,00017,43090238700017,O,1985-01-01,NN,,,2019-11-14T14:00:38,true,3,,,,,,43230,SAINTE-MARGUERITE,,,43208,,,,,,,,,,,,,,,,,,,2003-12-31,F,,,,,01.3Z,NAFRev1,N,,,0,,,,,,
513735548,00044,51373554800044,O,2017-09-26,,,2042ZZ,2022-09-19T19:37:46,false,4,,,,,LE RIF,43230,SAINTE-MARGUERITE,,,43208,,,,,,,,,,,,,,,,,,,2022-09-19,F,,,,LES TRESORS D'YGGDRASIL,20.42Z,NAFRev2,N,5.3006066,45.3360334,0.89,poi.culvert,Le Rif (Buse) Brézins,https://osm.org/way/511839046,G,,
528164973,00018,52816497300018,O,2010-04-01,,,,2019-11-14T14:00:38,false,2,BOITOUX,,,,,43230,SAINTE-MARGUERITE,,,43208,,,,,,,,,,,,,,,,,,,2011-07-01,F,,,,,01.13Z,NAFRev2,N,,,0,,,,,,
665912408,00010,66591240800010,O,1900-01-01,NN,,,2023-05-05T21:03:30,true,4,,,,,,43230,SAINTE-MARGUERITE,,,43208,,,,,,,,,,,,,,,,,,,2018-12-25,F,,,,,01.41Z,NAFRev2,N,,,0,,,,,,
666120027,00071,66612002700071,O,2001-10-27,NN,,,2019-11-14T14:00:38,false,3,,,,,,43230,SAINTE-MARGUERITE,,,43208,,,,,,,,,,,,,,,,,,,2008-01-01,A,,,,,08.12Z,NAFRev2,N,,,0,,,,,,
666810452,00027,66681045200027,O,2013-04-04,,,,2021-02-23T16:03:39,true,1,,,,,LA VIZADE,43230,SAINTE-MARGUERITE,,,43208,,,,,,,,,,,,,,,,,,,2013-04-04,A,,,,,01.41Z,NAFRev2,N,3.581322,45.205445,0.92,street,La Vizade 43230 Sainte-Marguerite,43208_fkv1qx,G,LA VIZADE,
667310098,00013,66731009800013,O,,NN,,,2019-11-14T14:00:38,true,1,,,,,LA VIGNE,43230,SAINTE-MARGUERITE,,,43208,,,,,,,,,,,,,,,,,,,1988-12-08,F,,,,,02.20,NAP,N,3.581322,45.205445,0.5,street,La Vizade 43230 Sainte-Marguerite,43208_fkv1qx,G,LA VIZADE,
779153477,00012,77915347700012,O,1968-01-01,NN,,,2023-07-03T21:26:35,true,5,,,,,LA CHAUX,43230,SAINTE-MARGUERITE,,,43208,,,,,,,,,,,,,,,,,,,2017-12-25,F,,,,,01.41Z,NAFRev2,N,3.587542,45.212492,0.49,locality,Champ de la Pointe 43230 Sainte-Marguerite,43208_B031,G,CHAMP DE LA POINTE,
779153501,00019,77915350100019,O,,,,,2019-11-14T14:00:38,true,1,,,,,LE RIF,43230,SAINTE-MARGUERITE,,,43208,,,,,,,,,,,,,,,,,,,1985-12-25,F,,,,,55.60,NAP,N,5.3006066,45.3360334,0.89,poi.culvert,Le Rif (Buse) Brézins,https://osm.org/way/511839046,G,,
790040976,00017,79004097600017,O,2012-12-01,,,,2019-11-14T14:00:38,true,1,,,,,,43230,SAINTE-MARGUERITE,,,43208,,,,,,,,,,,,,,,,,,,2012-12-01,A,,,,,02.10Z,NAFRev2,N,,,0,,,,,,
817843774,00016,81784377400016,O,2016-02-01,,,4321AB,2020-05-28T04:15:05,true,2,,,,,LE RIF,43230,SAINTE-MARGUERITE,,,43208,,,,,,,,,,,,,,,,,,,2019-11-01,F,,,,RIF ELECTRICITE SERVICES,43.21A,NAFRev2,N,5.3006066,45.3360334,0.89,poi.culvert,Le Rif (Buse) Brézins,https://osm.org/way/511839046,G,,
818406308,00010,81840630800010,O,2016-01-01,,,,2019-11-14T14:00:38,true,1,,,,,LA BARAQUE,43230,SAINTE-MARGUERITE,,,43208,,,,,,,,,,,,,,,,,,,2016-01-01,A,,,,,02.10Z,NAFRev2,N,4.3697725,49.0167185,0.9,poi.forest,La Baraque (Forêt) Recy,https://osm.org/way/42126767,G,,
827908088,00012,82790808800012,O,2017-03-01,,,2042ZZ,2019-11-14T14:00:38,true,2,,,,,LE RIF,43230,SAINTE-MARGUERITE,,,43208,,,,,,,,,,,,,,,,,,,2018-12-31,F,,,,,20.42Z,NAFRev2,N,5.3006066,45.3360334,0.89,poi.culvert,Le Rif (Buse) Brézins,https://osm.org/way/511839046,G,,
911423168,00010,91142316800010,O,2021-11-17,,,,2022-03-16T19:33:00,true,1,,,,,BOITOUX,43230,SAINTE-MARGUERITE,,,43208,,,,,,,,,,,,,,,,,,,2021-11-17,A,,,,,01.50Z,NAFRev2,N,5.3142107,46.4300037,0.88,poi.track,Impasse des Boitoux (Chemin) Domsure,https://osm.org/way/318755981,G,,
