siren,nic,siret,statutDiffusionEtablissement,dateCreationEtablissement,trancheEffectifsEtablissement,anneeEffectifsEtablissement,activitePrincipaleRegistreMetiersEtablissement,dateDernierTraitementEtablissement,etablissementSiege,nombrePeriodesEtablissement,complementAdresseEtablissement,numeroVoieEtablissement,indiceRepetitionEtablissement,typeVoieEtablissement,libelleVoieEtablissement,codePostalEtablissement,libelleCommuneEtablissement,libelleCommuneEtrangerEtablissement,distributionSpecialeEtablissement,codeCommuneEtablissement,codeCedexEtablissement,libelleCedexEtablissement,codePaysEtrangerEtablissement,libellePaysEtrangerEtablissement,complementAdresse2Etablissement,numeroVoie2Etablissement,indiceRepetition2Etablissement,typeVoie2Etablissement,libelleVoie2Etablissement,codePostal2Etablissement,libelleCommune2Etablissement,libelleCommuneEtranger2Etablissement,distributionSpeciale2Etablissement,codeCommune2Etablissement,codeCedex2Etablissement,libelleCedex2Etablissement,codePaysEtranger2Etablissement,libellePaysEtranger2Etablissement,dateDebut,etatAdministratifEtablissement,enseigne1Etablissement,enseigne2Etablissement,enseigne3Etablissement,denominationUsuelleEtablissement,activitePrincipaleEtablissement,nomenclatureActivitePrincipaleEtablissement,caractereEmployeurEtablissement,longitude,latitude,geo_score,geo_type,geo_adresse,geo_id,geo_ligne,geo_l4,geo_l5
214600850,00017,21460085000017,O,1983-03-01,02,2021,,2023-11-27T13:22:24,true,3,,,,,,46270,CUZAC,,,46085,,,,,,,,,,,,,,,,,,,2008-01-01,A,MAIRIE,,,,84.11Z,NAFRev2,N,,,0,,,,,,
214600850,00025,21460085000025,O,1983-12-21,01,2021,,2023-11-27T13:22:24,false,3,,,,,,46270,CUZAC,,,46085,,,,,,,,,,,,,,,,,,,2008-01-01,A,ECOLE PRIMAIRE PUBLIQUE,,,,85.20Z,NAFRev2,N,,,0,,,,,,
214600850,00033,21460085000033,O,1996-06-03,NN,,,2018-05-31T17:08:40,false,4,MAIRIE,,,,,46270,CUZAC,,,46085,,,,,,,,,,,,,,,,,,,2018-01-01,F,SERVICE DES EAUX,,,,36.00Z,NAFRev2,N,2.150363,44.580251,0.37,street,Route de LABORIE 46270 Cuzac,46085_0034,D,ROUTE DE LABORIE,
214600850,00041,21460085000041,O,1996-06-03,NN,,,2008-01-04T18:34:27,false,3,MAIRIE,,,,,46270,CUZAC,,,46085,,,,,,,,,,,,,,,,,,,2008-01-01,A,SERVICE ASSAINISSEMENT,,,,37.00Z,NAFRev2,N,2.150363,44.580251,0.37,street,Route de LABORIE 46270 Cuzac,46085_0034,D,ROUTE DE LABORIE,
264601998,00018,26460199800018,O,1984-10-15,NN,,,2016-07-23T12:07:12,true,4,,,,,MAIRIE,46270,CUZAC,,,46085,,,,,,,,,,,,,,,,,,,2016-01-01,F,CCAS,,,,88.99B,NAFRev2,N,2.150363,44.580251,0.37,street,Route de LABORIE 46270 Cuzac,46085_0034,G,ROUTE DE LABORIE,
302700794,00019,30270079400019,O,1900-01-01,NN,,,2015-01-15T13:20:53,true,5,,,,LD,GOURS,46270,CUZAC,,,46085,,,,,,,,,,,,,,,,,,,2014-11-15,F,,,,,46.76Z,NAFRev2,O,2.13378,44.572701,0.43,street,Chemin des CHASSEURS 46270 Cuzac,46085_0019,G,CHEMIN DES CHASSEURS,
307162842,00040,30716284200040,O,1987-01-01,NN,,,,true,1,,,,LD,GOURS,46270,CUZAC,,,46085,,,,,,,,,,,,,,,,,,,2002-02-28,F,,,,,45.4J,NAF1993,N,2.13378,44.572701,0.43,street,Chemin des CHASSEURS 46270 Cuzac,46085_0019,G,CHEMIN DES CHASSEURS,
317610657,00015,31761065700015,O,,NN,,,,true,1,,,,LD,GOURS,46270,CUZAC,,,46085,,,,,,,,,,,,,,,,,,,1994-06-30,F,,,,,45.4C,NAF1993,N,2.13378,44.572701,0.43,street,Chemin des CHASSEURS 46270 Cuzac,46085_0019,G,CHEMIN DES CHASSEURS,
317615045,00018,31761504500018,O,,NN,,,,true,1,,,,LD,GOURS,46270,CUZAC,,,46085,,,,,,,,,,,,,,,,,,,1994-06-30,F,,,,,45.4C,NAF1993,O,2.13378,44.572701,0.43,street,Chemin des CHASSEURS 46270 Cuzac,46085_0019,G,CHEMIN DES CHASSEURS,
318245495,00029,31824549500029,O,2009-05-06,,,,2012-11-09T00:18:32,true,2,,,,,GOURS,46270,CUZAC,,,46085,,,,,,,,,,,,,,,,,,,2010-12-15,F,,,,,16.29Z,NAFRev2,N,2.13378,44.572701,0.43,street,Chemin des CHASSEURS 46270 Cuzac,46085_0019,G,CHEMIN DES CHASSEURS,
320441587,00054,32044158700054,O,1988-01-01,NN,,,2008-01-04T18:14:08,false,4,,,,,,46270,CUZAC,,,46085,,,,,,,,,,,,,,,,,,,2008-01-01,A,,,,,35.11Z,NAFRev2,N,,,0,,,,,,
327102398,00010,32710239800010,O,1966-01-01,NN,,,2008-11-07T00:44:38,true,3,,,,,,46270,CUZAC,,,46085,,,,,,,,,,,,,,,,,,,2005-06-30,F,,,,,15.9A,NAFRev1,N,,,0,,,,,,
327831582,00058,32783158200058,O,2007-02-08,01,2020,,2023-04-01T13:31:33,true,3,,142,,RUE,DE FLOIRAC,46270,CUZAC,,,46085,,,,,,,,,,,,,,,,,,,2008-05-01,A,,,,,47.89Z,NAFRev2,O,2.12994,44.578701,0.94,housenumber,142 Rue de FLOIRAC 46270 Cuzac,46085_0036_00142,G,142 RUE DE FLOIRAC,
329171029,00013,32917102900013,O,,,,,,true,1,,,,,,46270,CUZAC,,,46085,,,,,,,,,,,,,,,,,,,1985-12-25,F,,,,,65.06,NAP,N,,,0,,,,,,
334305570,00056,33430557000056,O,1999-04-15,NN,,,2006-11-25T10:25:34,true,3,,,,,DOMAINE DE LAPOULOU,46270,CUZAC,,,46085,,,,,,,,,,,,,,,,,,,2004-09-06,F,,,,,52.5Z,NAFRev1,N,2.142935,44.5733,0.43,street,Route de La MOULINE 46270 Cuzac,46085_0032,G,ROUTE DE LA MOULINE,
338022478,00014,33802247800014,O,1986-06-01,NN,,,2011-09-29T05:09:03,true,6,,,,,LE BOURG,46270,CUZAC,,,46085,,,,,,,,,,,,,,,,,,,2011-09-30,F,,,,DUSSAILLANT JOSETTE,56.30Z,NAFRev2,N,2.212915,47.9910304,0.9,poi.bar,Le Bourg (Bar) Ingrannes,https://osm.org/node/1718543174,G,,
340321090,00011,34032109000011,O,,NN,,,2006-11-25T10:38:05,true,1,,,,,MAIRIE,46270,CUZAC,,,46085,,,,,,,,,,,,,,,,,,,1989-06-06,F,,,,,85.04,NAP,N,2.150363,44.580251,0.37,street,Route de LABORIE 46270 Cuzac,46085_0034,G,ROUTE DE LABORIE,
341651339,00010,34165133900010,O,,NN,,,,true,1,,,,,,46270,CUZAC,,,46085,,,,,,,,,,,,,,,,,,,1994-12-19,F,,,,,45.3A,NAF1993,N,,,0,,,,,,
341865392,00011,34186539200011,O,,NN,,,,true,1,,,,LD,GOURS,46270,CUZAC,,,46085,,,,,,,,,,,,,,,,,,,1997-01-20,F,,,,,51.3N,NAF1993,O,2.13378,44.572701,0.43,street,Chemin des CHASSEURS 46270 Cuzac,46085_0019,G,CHEMIN DES CHASSEURS,
347747032,00022,34774703200022,O,1998-11-01,NN,,,2008-11-08T00:21:43,true,3,,,,,LE BOURG,46270,CUZAC,,,46085,,,,,,,,,,,,,,,,,,,2005-06-30,F,,,,,92.7C,NAFRev1,N,2.212915,47.9910304,0.9,poi.bar,Le Bourg (Bar) Ingrannes,https://osm.org/node/1718543174,G,,
350707733,00043,35070773300043,O,2006-09-01,,,,2007-10-23T06:19:41,true,2,,,,LD,COURS,46270,CUZAC,,,46085,,,,,,,,,,,,,,,,,,,2007-01-29,F,,,,,51.1R,NAFRev1,N,2.13378,44.572701,0.43,street,Chemin des CHASSEURS 46270 Cuzac,46085_0019,G,CHEMIN DES CHASSEURS,
352278907,00055,35227890700055,P,2003-09-20,NN,,,2018-05-23T13:42:03,false,4,[ND],[ND],[ND],[ND],[ND],[ND],CUZAC,,[ND],46085,[ND],[ND],,,[ND],[ND],[ND],[ND],[ND],[ND],,,[ND],,[ND],[ND],,,2017-12-31,F,[ND],[ND],[ND],[ND],73.11Z,NAFRev2,N,,,0,,,,,,
352278907,00071,35227890700071,P,2013-09-01,,,,2016-05-27T14:06:14,false,1,[ND],[ND],[ND],[ND],[ND],[ND],CUZAC,,[ND],46085,[ND],[ND],,,[ND],[ND],[ND],[ND],[ND],[ND],,,[ND],,[ND],[ND],,,2013-09-01,F,[ND],[ND],[ND],[ND],47.78C,NAFRev2,N,,,0,,,,,,
352633184,00010,35263318400010,O,,NN,,,,true,1,,,,,LES CROZES,46270,CUZAC,,,46085,,,,,,,,,,,,,,,,,,,1991-10-31,F,,,,,67.01,NAP,N,2.13717,44.5786,0.37,street,Chemin de ROZIERES 46270 Cuzac,46085_0018,G,CHEMIN DE ROZIERES,
352864342,00014,35286434200014,O,,NN,,,2006-11-25T11:13:54,true,1,,,,,LES CROZES,46270,CUZAC,,,46085,,,,,,,,,,,,,,,,,,,1991-03-31,F,,,,,67.01,NAP,N,2.13717,44.5786,0.37,street,Chemin de ROZIERES 46270 Cuzac,46085_0018,G,CHEMIN DE ROZIERES,
378579536,00020,37857953600020,O,1998-03-01,NN,,,2022-01-26T15:43:06,true,4,,,,,,46270,CUZAC,,,46085,,,,,,,,,,,,,,,,,,,2022-01-30,F,,,,,01.24Z,NAFRev2,N,,,0,,,,,,
383695947,00010,38369594700010,O,1991-10-01,02,2021,1012ZZ,2023-11-27T13:25:15,true,4,,,,,LE BOURG,46270,CUZAC,,,46085,,,,,,,,,,,,,,,,,,,2008-01-01,A,,,,,10.12Z,NAFRev2,O,2.212915,47.9910304,0.9,poi.bar,Le Bourg (Bar) Ingrannes,https://osm.org/node/1718543174,G,,
385052709,00016,38505270900016,O,,NN,,,,true,1,,,,,,46270,CUZAC,,,46085,,,,,,,,,,,,,,,,,,,1994-12-31,F,,,,,50.5Z,NAF1993,N,,,0,,,,,,
385218490,00014,38521849000014,O,1992-04-06,NN,,,,false,3,,,,LD,GOURS,46270,CUZAC,,,46085,,,,,,,,,,,,,,,,,,,1996-09-30,F,,,,,52.4L,NAF1993,,2.13378,44.572701,0.43,street,Chemin des CHASSEURS 46270 Cuzac,46085_0019,G,CHEMIN DES CHASSEURS,
388127052,00016,38812705200016,O,1980-09-01,NN,,,2008-01-04T23:04:36,true,3,,,,,,46270,CUZAC,,,46085,,,,,,,,,,,,,,,,,,,2008-01-01,A,,,,,49.39B,NAFRev2,N,,,0,,,,,,
394745483,00013,39474548300013,O,1994-04-01,NN,,,2013-04-26T16:31:50,false,4,,,,,MAIRIE,46270,CUZAC,,,46085,,,,,,,,,,,,,,,,,,,2013-04-26,F,,,,,94.99Z,NAFRev2,N,2.150363,44.580251,0.37,street,Route de LABORIE 46270 Cuzac,46085_0034,G,ROUTE DE LABORIE,
394745483,00021,39474548300021,O,1979-03-12,01,2020,,2022-08-29T09:18:24,true,1,MADAME CLAUDINE RASPIENGEAS,,,,LE BOURG,46270,CUZAC,,,46085,,,,,,,,,,,,,,,,,,,1979-03-12,A,,,,,93.29Z,NAFRev2,O,2.212915,47.9910304,0.9,poi.bar,Le Bourg (Bar) Ingrannes,https://osm.org/node/1718543174,G,,
395238918,00043,39523891800043,O,2021-07-27,,,,2022-01-05T03:58:21,true,1,,132,,CHE,DE MONTEILS,46270,CUZAC,,,46085,,,,,,,,,,,,,,,,,,,2021-07-27,A,,,,,68.20B,NAFRev2,N,2.14671,44.577202,0.85,housenumber,132 Chemin de MONTEILS 46270 Cuzac,46085_0208_00132,G,132 CHEMIN DE MONTEILS,
397820986,00024,39782098600024,P,2022-11-01,,,8121ZZ,2023-02-06T14:01:22,true,2,[ND],[ND],[ND],[ND],[ND],[ND],CUZAC,,[ND],46085,[ND],[ND],,,[ND],[ND],[ND],[ND],[ND],[ND],,,[ND],,[ND],[ND],,,2022-11-01,A,[ND],[ND],[ND],[ND],81.21Z,NAFRev2,N,,,0,,,,,,
398494625,00013,39849462500013,O,1994-10-01,NN,,,2014-07-08T01:26:47,true,4,,,,LD,LA PLANTADE,46270,CUZAC,,,46085,,,,,,,,,,,,,,,,,,,2008-10-31,F,,,,,43.22A,NAFRev2,N,2.14776,44.5742,0.91,street,Chemin de La PLANTADE 46270 Cuzac,46085_0015,G,CHEMIN DE LA PLANTADE,
399170927,00012,39917092700012,O,1994-10-01,NN,,,2008-11-08T01:06:25,true,4,,,,LD,GOURS,46270,CUZAC,,,46085,,,,,,,,,,,,,,,,,,,1998-05-13,F,,,,,45.4C,NAF1993,O,2.13378,44.572701,0.43,street,Chemin des CHASSEURS 46270 Cuzac,46085_0019,G,CHEMIN DES CHASSEURS,
399170927,00020,39917092700020,O,1995-03-01,NN,,,,false,3,,,,LD,LAUMEDE,46270,CUZAC,,,46085,,,,,,,,,,,,,,,,,,,1997-11-27,F,,,,,20.1A,NAF1993,N,2.12677,44.5797,0.34,street,Route de La VALLEE 46270 Cuzac,46085_0033,G,ROUTE DE LA VALLEE,
404547960,00017,40454796000017,O,1970-01-01,NN,,,,true,1,,,,,,46270,CUZAC,,,46085,,,,,,,,,,,,,,,,,,,1999-12-31,F,,,,,01.2A,NAF1993,N,,,0,,,,,,
404547978,00019,40454797800019,O,1982-08-01,NN,,,2008-01-04T20:42:19,true,3,,,,,,46270,CUZAC,,,46085,,,,,,,,,,,,,,,,,,,2008-01-01,A,,,,,01.42Z,NAFRev2,N,,,0,,,,,,
404547986,00012,40454798600012,O,,NN,,,,true,1,,,,,,46270,CUZAC,,,46085,,,,,,,,,,,,,,,,,,,1996-09-30,F,,,,,01.3Z,NAF1993,N,,,0,,,,,,
405299595,00026,40529959500026,O,2003-07-07,NN,,,2010-03-15T09:47:19,false,4,LD LES CROZES,,,RTE,DE DECAZEVILLE,46270,CUZAC,,,46085,,,,,,,,,,,,,,,,,,,2008-03-31,F,,,,,81.21Z,NAFRev2,N,2.12677,44.5797,0.35,street,Route de La VALLEE 46270 Cuzac,46085_0033,G,ROUTE DE LA VALLEE,
408109825,00013,40810982500013,O,1986-05-17,NN,,,,true,1,,,,,,46270,CUZAC,,,46085,,,,,,,,,,,,,,,,,,,2001-12-31,F,,,,,01.3Z,NAF1993,N,,,0,,,,,,
408109833,00017,40810983300017,O,1970-01-01,NN,,,,true,1,,,,,,46270,CUZAC,,,46085,,,,,,,,,,,,,,,,,,,1998-02-28,F,,,,,01.1F,NAF1993,N,,,0,,,,,,
408761542,00039,40876154200039,O,2007-02-01,,,,2021-02-23T11:30:55,false,2,,,,,LABORIE,46270,CUZAC,,,46085,,,,,,,,,,,,,,,,,,,2008-01-01,A,,,,,01.49Z,NAFRev2,N,2.150363,44.580251,0.91,street,Route de LABORIE 46270 Cuzac,46085_0034,G,ROUTE DE LABORIE,
412227985,00022,41222798500022,O,2000-01-01,NN,,,2019-06-24T13:30:08,true,3,LE BOURG,,,,,46270,CUZAC,,,46085,,,,,,,,,,,,,,,,,,,2018-04-30,F,,,,,01.42Z,NAFRev2,O,,,0,,,,,,
412233421,00012,41223342100012,O,1996-01-01,NN,,,2012-11-09T01:07:01,true,3,,,,,LE BOURG,46270,CUZAC,,,46085,,,,,,,,,,,,,,,,,,,2008-01-01,A,,,,,49.39A,NAFRev2,N,2.212915,47.9910304,0.9,poi.bar,Le Bourg (Bar) Ingrannes,https://osm.org/node/1718543174,G,,
425003274,00015,42500327400015,O,2000-01-01,NN,,,2008-01-05T01:08:17,true,3,,,,,LE REY,46270,CUZAC,,,46085,,,,,,,,,,,,,,,,,,,2008-01-01,A,,,,,01.42Z,NAFRev2,N,2.13764,44.577499,0.51,street,Route du REY 46270 Cuzac,46085_0035,G,ROUTE DU REY,
429466782,00019,42946678200019,O,2000-01-01,NN,,,2018-06-05T04:02:46,true,4,,,,,,46270,CUZAC,,,46085,,,,,,,,,,,,,,,,,,,2018-06-01,F,,,,,01.41Z,NAFRev2,N,,,0,,,,,,
429605017,00012,42960501700012,O,2000-02-21,NN,,4334ZC,2022-08-06T11:59:40,true,3,,429,,RUE,DES BLEUETS,46270,CUZAC,,,46085,,,,,,,,,,,,,,,,,,,2008-01-01,A,,,,,43.34Z,NAFRev2,N,2.14609,44.575802,0.94,housenumber,429 Rue des BLEUETS 46270 Cuzac,46085_0040_00429,G,429 RUE DES BLEUETS,
430522599,00017,43052259900017,O,1994-01-01,NN,,,2008-01-05T01:54:07,true,3,,,,,MONTREDON,46270,CUZAC,,,46085,,,,,,,,,,,,,,,,,,,2008-01-01,A,,,,,01.42Z,NAFRev2,N,2.146575,44.576901,0.37,street,Chemin de MONTEILS 46270 Cuzac,46085_0208,G,CHEMIN DE MONTEILS,
447830514,00017,44783051400017,O,1975-10-19,NN,,,2008-01-04T23:02:33,true,3,,,,,MAIRIE,46270,CUZAC,,,46085,,,,,,,,,,,,,,,,,,,2008-01-01,A,,,,,94.99Z,NAFRev2,N,2.150363,44.580251,0.37,street,Route de LABORIE 46270 Cuzac,46085_0034,G,ROUTE DE LABORIE,
449338938,00011,44933893800011,O,2003-07-04,,,,2009-12-03T11:10:54,false,3,,,,LD,GOURS,46270,CUZAC,,,46085,,,,,,,,,,,,,,,,,,,2003-12-31,F,,,,,52.5Z,NAFRev1,N,2.13378,44.572701,0.43,street,Chemin des CHASSEURS 46270 Cuzac,46085_0019,G,CHEMIN DES CHASSEURS,
449407022,00010,44940702200010,O,2003-07-01,NN,,,2021-09-28T10:04:47,true,3,,,,,FLOIRAC,46270,CUZAC,,,46085,,,,,,,,,,,,,,,,,,,2008-01-01,A,,,,,68.20B,NAFRev2,N,2.130225,44.578501,0.92,street,Rue de FLOIRAC 46270 Cuzac,46085_0036,G,RUE DE FLOIRAC,
449960889,00011,44996088900011,O,2003-09-01,01,2021,4332AA,2023-11-27T13:16:19,true,3,,1965,,RTE,DE LA VALLEE,46270,CUZAC,,,46085,,,,,,,,,,,,,,,,,,,2008-01-01,A,,,,,43.32A,NAFRev2,O,2.13247,44.5742,0.86,housenumber,1965 Route de La VALLEE 46270 Cuzac,46085_0033_01965,G,1965 ROUTE DE LA VALLEE,
481628659,00031,48162865900031,O,2023-10-01,,,,2023-10-07T12:41:58,true,1,,9,,RUE,DE LEGLISE,46270,CUZAC,,,46085,,,,,,,,,,,,,,,,,,,2023-10-01,A,,,,,70.22Z,NAFRev2,N,2.14272,44.580002,0.83,housenumber,9 Rue de l'EGLISE 46270 Cuzac,46085_0001_00009,G,9 RUE DE L EGLISE,
483974333,00021,48397433300021,O,2022-05-02,,,,2022-05-21T03:55:45,true,1,HAMEAU DE MONTEIL,132,,CHE,DE MONTEIL,46270,CUZAC,,,46085,,,,,,,,,,,,,,,,,,,2022-05-02,A,,,,,68.20A,NAFRev2,N,2.14671,44.577202,0.8,housenumber,132 Chemin de MONTEILS 46270 Cuzac,46085_0208_00132,G,132 CHEMIN DE MONTEILS,
489353250,00058,48935325000058,O,2017-04-18,,,,2021-07-15T15:34:23,false,1,APPARTEMENT N 2,,,,RUE DE LA PASSEE,46270,CUZAC,,,46085,,,,,,,,,,,,,,,,,,,2017-04-18,A,,,,,47.99A,NAFRev2,N,2.14378,44.579601,0.93,street,Rue de LA PASSEE 46270 Cuzac,46085_0005,G,RUE DE LA PASSEE,
491173340,00010,49117334000010,O,1999-10-29,,,,2008-03-18T14:08:30,true,2,MONTEILS,,,,,46270,CUZAC,,,46085,,,,,,,,,,,,,,,,,,,2008-01-01,A,,,,,01.45Z,NAFRev2,N,2.146575,44.576901,0.91,street,Chemin de MONTEILS 46270 Cuzac,46085_0208,D,CHEMIN DE MONTEILS,
491536264,00022,49153626400022,O,2006-10-01,,,,2008-01-05T03:58:29,true,2,QUARTIER LES CROZES,,,LD,MAS LE TILLEUL,46270,CUZAC,,,46085,,,,,,,,,,,,,,,,,,,2008-01-01,A,,,,,90.03B,NAFRev2,N,,,0,,,,,,
499653731,00012,49965373100012,O,2007-09-01,NN,,,2015-05-14T08:58:37,false,4,,,,,DOMAINE DE LAPOULOU,46270,CUZAC,,,46085,,,,,,,,,,,,,,,,,,,2013-09-30,F,OPSI MANAGEMENT - OPSI BATIMENT -,OPSI IMMOBILIER - OPSI FORMATION,,,78.10Z,NAFRev2,O,2.142935,44.5733,0.43,street,Route de La MOULINE 46270 Cuzac,46085_0032,G,ROUTE DE LA MOULINE,
511834038,00016,51183403800016,P,2009-04-24,,,,2021-03-12T13:29:45,false,4,[ND],[ND],[ND],[ND],[ND],[ND],CUZAC,,[ND],46085,[ND],[ND],,,[ND],[ND],[ND],[ND],[ND],[ND],,,[ND],,[ND],[ND],,,2010-11-02,F,[ND],[ND],[ND],[ND],47.89Z,NAFRev2,N,,,0,,,,,,
519594915,00018,51959491500018,O,2010-01-20,,,,2014-07-29T08:34:36,true,2,,,,,DOMAINE DE LAPOULOU,46270,CUZAC,,,46085,,,,,,,,,,,,,,,,,,,2014-07-21,F,,,,,46.47Z,NAFRev2,N,2.142935,44.5733,0.43,street,Route de La MOULINE 46270 Cuzac,46085_0032,G,ROUTE DE LA MOULINE,
519997522,00015,51999752200015,O,2010-03-01,,,,2012-11-10T01:45:09,true,1,,,,,LE REY,46270,CUZAC,,,46085,,,,,,,,,,,,,,,,,,,2010-03-01,A,,,,,47.99A,NAFRev2,N,2.13764,44.577499,0.51,street,Route du REY 46270 Cuzac,46085_0035,G,ROUTE DU REY,
520199944,00015,52019994400015,O,2010-01-01,,,,2010-08-27T09:46:39,true,2,,,,,LAUMEDE,46270,CUZAC,,,46085,,,,,,,,,,,,,,,,,,,2010-05-31,F,,,,,86.90D,NAFRev2,N,2.12677,44.5797,0.34,street,Route de La VALLEE 46270 Cuzac,46085_0033,G,ROUTE DE LA VALLEE,
520206384,00023,52020638400023,O,2020-09-09,,,,2021-03-24T20:00:32,true,1,,,,RUE,DU VITRAIL,46270,CUZAC,,,46085,,,,,,,,,,,,,,,,,,,2020-09-09,A,,,,,58.11Z,NAFRev2,N,2.14311,44.580002,0.93,street,Rue du VITRAIL 46270 Cuzac,46085_0002,G,RUE DU VITRAIL,
523350007,00374,52335000700374,O,2011-06-22,,,,2012-07-26T05:29:18,false,2,,,,,RIGNERGUES,46270,CUZAC,,,46085,,,,,,,,,,,,,,,,,,,2012-07-17,F,,,,,35.11Z,NAFRev2,N,,,0,,,,,,
524849908,00016,52484990800016,O,2010-01-01,,,,2016-01-12T00:29:20,true,1,,,,LD,LABORIE,46270,CUZAC,,,46085,,,,,,,,,,,,,,,,,,,2010-01-01,A,,,,,01.21Z,NAFRev2,N,2.150363,44.580251,0.91,street,Route de LABORIE 46270 Cuzac,46085_0034,G,ROUTE DE LABORIE,
527541130,00045,52754113000045,P,2021-09-15,,,8121ZZ,2023-02-09T13:49:05,true,1,[ND],[ND],[ND],[ND],[ND],[ND],CUZAC,,[ND],46085,[ND],[ND],,,[ND],[ND],[ND],[ND],[ND],[ND],,,[ND],,[ND],[ND],,,2021-09-15,A,[ND],[ND],[ND],[ND],81.30Z,NAFRev2,N,,,0,,,,,,
528468234,00018,52846823400018,O,2010-12-01,,,,2023-02-07T15:17:22,false,2,,,,,LIEU-DIT ROZIERES,46270,CUZAC,,,46085,,,,,,,,,,,,,,,,,,,2015-02-01,F,,,,,43.91A,NAFRev2,N,2.13717,44.5786,0.91,street,Chemin de ROZIERES 46270 Cuzac,46085_0018,G,CHEMIN DE ROZIERES,
530428051,00037,53042805100037,O,2014-03-01,,,,2014-09-22T08:53:20,false,2,,,,,LE BOURG,46270,CUZAC,,,46085,,,,,,,,,,,,,,,,,,,2014-07-21,F,,,,,86.90F,NAFRev2,N,2.212915,47.9910304,0.9,poi.bar,Le Bourg (Bar) Ingrannes,https://osm.org/node/1718543174,G,,
531077667,00016,53107766700016,O,2011-04-15,,,5610CQ,2015-03-18T00:35:27,true,2,,,,,LE BOURG,46270,CUZAC,,,46085,,,,,,,,,,,,,,,,,,,2012-08-31,F,,,,PIZZA DU COIN,56.10C,NAFRev2,N,2.212915,47.9910304,0.9,poi.bar,Le Bourg (Bar) Ingrannes,https://osm.org/node/1718543174,G,,
537708067,00013,53770806700013,O,2011-10-07,,,,2011-11-07T16:14:28,true,1,,,,,GOURS,46270,CUZAC,,,46085,,,,,,,,,,,,,,,,,,,2011-10-07,A,,,,,94.99Z,NAFRev2,N,2.13378,44.572701,0.43,street,Chemin des CHASSEURS 46270 Cuzac,46085_0019,G,CHEMIN DES CHASSEURS,
539850560,00019,53985056000019,O,2012-02-10,01,2021,,2023-11-27T14:05:59,true,3,,,,,LD ROZIERES,46270,CUZAC,,,46085,,,,,,,,,,,,,,,,,,,2016-10-10,A,,,,,46.61Z,NAFRev2,O,2.13717,44.5786,0.91,street,Chemin de ROZIERES 46270 Cuzac,46085_0018,G,CHEMIN DE ROZIERES,
571642396,00014,57164239600014,O,1957-01-01,NN,,,2012-07-28T16:08:15,true,4,,,,,,46270,CUZAC,,,46085,,,,,,,,,,,,,,,,,,,2008-01-01,F,,,,,68.20B,NAFRev2,N,,,0,,,,,,
631650231,00071,63165023100071,O,1989-01-01,03,2021,,2023-11-27T14:07:58,true,7,,561,,RTE,DE LA VALLEE,46270,CUZAC,,,46085,,,,,,,,,,,,,,,,,,,2015-05-07,A,,,,,08.11Z,NAFRev2,O,2.12023,44.577801,0.86,housenumber,561 Route de La VALLEE 46270 Cuzac,46085_0033_00561,G,561 ROUTE DE LA VALLEE,
671640795,00017,67164079500017,O,,,,,,true,1,,,,,,46270,CUZAC,,,46085,,,,,,,,,,,,,,,,,,,,F,,,,,67.05,NAP,N,,,0,,,,,,
671641611,00015,67164161100015,O,1967-01-01,NN,,,2008-01-05T02:43:16,true,3,,,,LD,GOURS,46270,CUZAC,,,46085,,,,,,,,,,,,,,,,,,,2008-01-01,A,,,,,68.20B,NAFRev2,N,2.13378,44.572701,0.43,street,Chemin des CHASSEURS 46270 Cuzac,46085_0019,G,CHEMIN DES CHASSEURS,
681650263,00046,68165026300046,O,1995-01-01,01,2021,,2023-11-27T14:08:41,true,5,,1978,,RTE,DE LA VALLEE,46270,CUZAC,,,46085,,,,,,,,,,,,,,,,,,,2015-05-07,A,,,,,42.11Z,NAFRev2,O,2.13232,44.573898,0.86,housenumber,1978 Route de La VALLEE 46270 Cuzac,46085_0033_01978,G,1978 ROUTE DE LA VALLEE,
750313918,00054,75031391800054,O,2012-03-19,,,,2013-01-08T16:40:02,false,2,PARCELLE N 265,,,,RIGNERGUES,46270,CUZAC,,,46085,,,,,,,,,,,,,,,,,,,2012-12-20,F,,,,,35.11Z,NAFRev2,N,,,0,,,,,,
750313918,00096,75031391800096,O,2012-03-19,,,,2013-01-08T16:40:31,false,2,PARCELLE N 284,,,,RIGNERGUES,46270,CUZAC,,,46085,,,,,,,,,,,,,,,,,,,2012-12-20,F,,,,,35.11Z,NAFRev2,N,,,0,,,,,,
750313918,00104,75031391800104,O,2012-03-19,,,,2013-01-08T16:40:59,false,2,,,,,RIGNERGUES,46270,CUZAC,,,46085,,,,,,,,,,,,,,,,,,,2012-12-20,F,,,,,35.11Z,NAFRev2,N,,,0,,,,,,
750612764,00027,75061276400027,O,2014-07-01,,,,2019-10-29T07:41:00,false,2,,,,LD,LA BORIE,46270,CUZAC,,,46085,,,,,,,,,,,,,,,,,,,2017-08-24,F,,,,GRAINES DE TROLL,01.50Z,NAFRev2,N,2.150363,44.580251,0.61,street,Route de LABORIE 46270 Cuzac,46085_0034,G,ROUTE DE LABORIE,
751118043,00015,75111804300015,P,2012-02-10,,,,2020-05-13T03:41:30,false,4,[ND],[ND],[ND],[ND],[ND],[ND],CUZAC,,[ND],46085,[ND],[ND],,,[ND],[ND],[ND],[ND],[ND],[ND],,,[ND],,[ND],[ND],,,2020-03-15,F,[ND],[ND],[ND],[ND],70.22Z,NAFRev2,N,,,0,,,,,,
752452268,00028,75245226800028,O,2021-07-09,,,,2021-08-06T03:43:11,true,1,,,,HAM,DE LABORIE,46270,CUZAC,,,46085,,,,,,,,,,,,,,,,,,,2021-07-09,A,,,,,68.20B,NAFRev2,N,2.150363,44.580251,0.92,street,Route de LABORIE 46270 Cuzac,46085_0034,G,ROUTE DE LABORIE,
777059304,00017,77705930400017,O,,NN,,,,true,1,,,,LD,GOURS,46270,CUZAC,,,46085,,,,,,,,,,,,,,,,,,,1988-12-31,F,,,,,55.60,NAP,N,2.13378,44.572701,0.43,street,Chemin des CHASSEURS 46270 Cuzac,46085_0019,G,CHEMIN DES CHASSEURS,
777059312,00010,77705931200010,O,,,,,,true,1,,,,,,46270,CUZAC,,,46085,,,,,,,,,,,,,,,,,,,1985-12-25,F,,,,,55.71,NAP,N,,,0,,,,,,
777059353,00014,77705935300014,O,,,,,,true,1,,,,,,46270,CUZAC,,,46085,,,,,,,,,,,,,,,,,,,1988-02-15,F,,,,,48.01,NAP,N,,,0,,,,,,
780107611,00011,78010761100011,O,,NN,,,,true,1,,,,,,46270,CUZAC,,,46085,,,,,,,,,,,,,,,,,,,1992-03-31,F,,,,,50.5Z,NAF1993,N,,,0,,,,,,
781623178,00022,78162317800022,O,,NN,,,,true,1,,,,,,46270,CUZAC,,,46085,,,,,,,,,,,,,,,,,,,,F,,,,,55.73,NAP,N,,,0,,,,,,
794154625,00014,79415462500014,O,2013-07-01,,,,2017-07-21T19:24:06,true,2,,,,,LE BOURG,46270,CUZAC,,,46085,,,,,,,,,,,,,,,,,,,2017-07-01,F,,,,,81.21Z,NAFRev2,N,2.212915,47.9910304,0.9,poi.bar,Le Bourg (Bar) Ingrannes,https://osm.org/node/1718543174,G,,
797971249,00017,79797124900017,O,2013-11-02,,,9529ZF,2015-03-18T00:58:36,true,1,,,,,LD FLOIRAC,46270,CUZAC,,,46085,,,,,,,,,,,,,,,,,,,2013-11-02,A,,,,,95.29Z,NAFRev2,N,2.130225,44.578501,0.92,street,Rue de FLOIRAC 46270 Cuzac,46085_0036,G,RUE DE FLOIRAC,
802281451,00012,80228145100012,O,2014-04-01,,,,2014-05-15T09:09:02,true,1,,,,,"LA SALAMANDRE, LES CROZES",46270,CUZAC,,,46085,,,,,,,,,,,,,,,,,,,2014-04-01,A,,,,,62.02A,NAFRev2,N,,,0,,,,,,
807601034,00018,80760103400018,O,2014-11-01,,,,2014-11-05T10:11:03,true,1,,,,,LE BOURG,46270,CUZAC,,,46085,,,,,,,,,,,,,,,,,,,2014-11-01,A,,,,,93.29Z,NAFRev2,N,2.212915,47.9910304,0.9,poi.bar,Le Bourg (Bar) Ingrannes,https://osm.org/node/1718543174,G,,
808698260,00011,80869826000011,O,2015-01-05,,,4399CZ,2023-04-07T03:38:01,true,2,,,,,LE BOURG,46270,CUZAC,,,46085,,,,,,,,,,,,,,,,,,,2019-12-31,F,,,,HDCM,43.99C,NAFRev2,N,2.212915,47.9910304,0.9,poi.bar,Le Bourg (Bar) Ingrannes,https://osm.org/node/1718543174,G,,
810103291,00011,81010329100011,O,2015-03-09,,,,2015-03-10T15:11:31,true,1,,,,,,46270,CUZAC,,,46085,,,,,,,,,,,,,,,,,,,2015-03-09,A,,,,,94.99Z,NAFRev2,N,,,0,,,,,,
810393256,00021,81039325600021,O,2015-06-01,,,,2015-12-08T14:45:32,false,1,,,,,FLOIRAC,46270,CUZAC,,,46085,,,,,,,,,,,,,,,,,,,2015-06-01,A,,,,,35.11Z,NAFRev2,N,2.130225,44.578501,0.92,street,Rue de FLOIRAC 46270 Cuzac,46085_0036,G,RUE DE FLOIRAC,
810534495,00017,81053449500017,O,2014-12-19,NN,,,2023-04-12T21:20:02,true,2,,,,,LE BOURG,46270,CUZAC,,,46085,,,,,,,,,,,,,,,,,,,2019-10-31,F,,,,,78.30Z,NAFRev2,N,2.212915,47.9910304,0.9,poi.bar,Le Bourg (Bar) Ingrannes,https://osm.org/node/1718543174,G,,
810701607,00014,81070160700014,O,2015-04-01,,,,2015-04-09T08:51:37,true,1,,,,,LABORIE,46270,CUZAC,,,46085,,,,,,,,,,,,,,,,,,,2015-04-01,A,LE PANIER CUZACOIS,,,,01.50Z,NAFRev2,N,2.150363,44.580251,0.91,street,Route de LABORIE 46270 Cuzac,46085_0034,G,ROUTE DE LABORIE,