siren,nic,siret,statutDiffusionEtablissement,dateCreationEtablissement,trancheEffectifsEtablissement,anneeEffectifsEtablissement,activitePrincipaleRegistreMetiersEtablissement,dateDernierTraitementEtablissement,etablissementSiege,nombrePeriodesEtablissement,complementAdresseEtablissement,numeroVoieEtablissement,indiceRepetitionEtablissement,typeVoieEtablissement,libelleVoieEtablissement,codePostalEtablissement,libelleCommuneEtablissement,libelleCommuneEtrangerEtablissement,distributionSpecialeEtablissement,codeCommuneEtablissement,codeCedexEtablissement,libelleCedexEtablissement,codePaysEtrangerEtablissement,libellePaysEtrangerEtablissement,complementAdresse2Etablissement,numeroVoie2Etablissement,indiceRepetition2Etablissement,typeVoie2Etablissement,libelleVoie2Etablissement,codePostal2Etablissement,libelleCommune2Etablissement,libelleCommuneEtranger2Etablissement,distributionSpeciale2Etablissement,codeCommune2Etablissement,codeCedex2Etablissement,libelleCedex2Etablissement,codePaysEtranger2Etablissement,libellePaysEtranger2Etablissement,dateDebut,etatAdministratifEtablissement,enseigne1Etablissement,enseigne2Etablissement,enseigne3Etablissement,denominationUsuelleEtablissement,activitePrincipaleEtablissement,nomenclatureActivitePrincipaleEtablissement,caractereEmployeurEtablissement,longitude,latitude,geo_score,geo_type,geo_adresse,geo_id,geo_ligne,geo_l4,geo_l5
215203225,00010,21520322500010,O,1983-03-01,02,2021,,2023-11-27T13:22:49,true,4,,,,,,52200,SAINT-CIERGUES,,,52447,,,,,,,,,,,,,,,,,,,2008-01-01,A,MAIRIE,,,,84.11Z,NAFRev2,N,,,0,,,,,,
215203225,00028,21520322500028,O,1983-12-21,01,2021,,2023-11-27T13:22:49,false,3,,6,,RUE,DE LA MAIRIE,52200,SAINT-CIERGUES,,,52447,,,,,,,,,,,,,,,,,,,2008-01-01,A,ECOLE PRIMAIRE PUBLIQUE,,,,85.20Z,NAFRev2,N,5.254949,47.884103,0.94,housenumber,6 Rue de la Mairie 52200 Saint-Ciergues,52447_0065_00006,G,6 RUE DE LA MAIRIE,
215203225,00036,21520322500036,O,1997-01-01,NN,,,2023-03-24T14:40:29,false,4,MAIRIE,,,,,52200,SAINT-CIERGUES,,,52447,,,,,,,,,,,,,,,,,,,2023-01-01,F,SERVICE EAUX ET ASSAINISSEMENT,,,,36.00Z,NAFRev2,N,5.255057,47.883835,0.91,street,Rue de la Mairie 52200 Saint-Ciergues,52447_0065,D,RUE DE LA MAIRIE,
215203225,00044,21520322500044,O,2000-05-11,NN,,,2019-11-14T14:00:43,false,4,MAIRIE,,,,,52200,SAINT-CIERGUES,,,52447,,,,,,,,,,,,,,,,,,,2012-12-25,F,LOTISSEMENT COMMUNAL,,,,42.99Z,NAFRev2,N,5.255057,47.883835,0.91,street,Rue de la Mairie 52200 Saint-Ciergues,52447_0065,D,RUE DE LA MAIRIE,
255200339,00018,25520033900018,O,1983-03-01,NN,,,2019-11-14T14:00:43,false,4,,,,,,52200,SAINT-CIERGUES,,,52447,,,,,,,,,,,,,,,,,,,2010-01-06,F,,,,,36.00Z,NAFRev2,N,,,0,,,,,,
265203810,00014,26520381000014,O,1983-03-01,NN,,,2019-11-14T14:00:43,true,4,,,,,,52200,SAINT-CIERGUES,,,52447,,,,,,,,,,,,,,,,,,,2016-01-01,F,CCAS,,,,88.99B,NAFRev2,N,,,0,,,,,,
295200604,00011,29520060400011,O,1983-08-10,00,2021,,2023-11-27T13:28:56,true,4,MAIRIE,,,,,52200,SAINT-CIERGUES,,,52447,,,,,,,,,,,,,,,,,,,2008-01-01,A,,,,,42.99Z,NAFRev2,N,5.255057,47.883835,0.91,street,Rue de la Mairie 52200 Saint-Ciergues,52447_0065,D,RUE DE LA MAIRIE,
303498885,00019,30349888500019,O,,NN,,,2019-11-14T14:00:43,true,1,,,,,,52200,SAINT-CIERGUES,,,52447,,,,,,,,,,,,,,,,,,,1990-09-05,F,,,,,81.21,NAP,N,,,0,,,,,,
309582013,00053,30958201300053,O,,NN,,,2019-11-14T14:00:43,true,1,,,,,MOULIN DE ST MARTIN,52200,SAINT-CIERGUES,,,52447,,,,,,,,,,,,,,,,,,,1991-09-30,F,,,,,77.10,NAP,N,5.266534,47.886619,0.84,street,Moulin de Saint Martin 52200 Saint-Ciergues,52447_0080,G,MOULIN DE SAINT MARTIN,
319743316,00014,31974331600014,O,1980-10-15,NN,,,2019-11-14T14:00:43,true,1,,,,,,52200,SAINT-CIERGUES,,,52447,,,,,,,,,,,,,,,,,,,2002-06-30,F,,,,,51.1A,NAF1993,N,,,0,,,,,,
320813991,00017,32081399100017,O,1981-01-01,NN,,,2019-11-14T14:00:43,true,4,,,,,,52200,SAINT-CIERGUES,,,52447,,,,,,,,,,,,,,,,,,,2008-02-13,F,,,,,01.11Z,NAFRev2,N,,,0,,,,,,
323995969,00017,32399596900017,O,,NN,,,2019-11-14T14:00:43,true,1,,,,,,52200,SAINT-CIERGUES,,,52447,,,,,,,,,,,,,,,,,,,,F,,,,,67.08,NAP,N,,,0,,,,,,
324466739,00012,32446673900012,O,1982-04-01,01,2021,,2023-11-27T13:41:08,true,3,,,,,,52200,SAINT-CIERGUES,,,52447,,,,,,,,,,,,,,,,,,,2008-01-01,A,,,,,01.50Z,NAFRev2,N,,,0,,,,,,
324542380,00013,32454238000013,O,,,,,2019-11-14T14:00:43,true,1,,,,,,52200,SAINT-CIERGUES,,,52447,,,,,,,,,,,,,,,,,,,1984-12-25,F,,,,,00.10,NAP,N,,,0,,,,,,
324542398,00015,32454239800015,O,,,,,2019-11-14T14:00:43,true,1,,,,,,52200,SAINT-CIERGUES,,,52447,,,,,,,,,,,,,,,,,,,1984-12-25,F,,,,,00.10,NAP,N,,,0,,,,,,
324542406,00016,32454240600016,O,,,,,2019-11-14T14:00:43,true,1,,,,,,52200,SAINT-CIERGUES,,,52447,,,,,,,,,,,,,,,,,,,1984-12-25,F,,,,,00.10,NAP,N,,,0,,,,,,
326089315,00013,32608931500013,O,,NN,,,2019-11-14T14:00:43,true,1,,,,CHE,DE MORGON,52200,SAINT-CIERGUES,,,52447,,,,,,,,,,,,,,,,,,,1990-05-07,F,,,,,67.13,NAP,N,5.245992,47.877699,0.74,street,Route de Morgon 52200 Saint-Ciergues,52447_0070,G,ROUTE DE MORGON,
327681524,00010,32768152400010,O,1900-01-01,NN,,,2019-11-14T14:00:43,false,4,,,,,,52200,SAINT-CIERGUES,,,52447,,,,,,,,,,,,,,,,,,,1992-12-31,F,,,,,52.5Z,NAF1993,N,,,0,,,,,,
328056536,00019,32805653600019,O,,,,,2019-11-14T14:00:43,true,1,,,,,AUBERGE DU LAC,52200,SAINT-CIERGUES,,,52447,,,,,,,,,,,,,,,,,,,1985-12-25,F,,,,,67.01,NAP,N,5.255392,47.88323,0.55,street,Rue du Lac 52200 Saint-Ciergues,52447_0055,G,RUE DU LAC,
329283840,00042,32928384000042,O,1987-07-15,NN,,,2021-12-24T09:49:35,true,3,,,,,,52200,SAINT-CIERGUES,,,52447,,,,,,,,,,,,,,,,,,,2008-01-01,A,,,,,68.20B,NAFRev2,N,,,0,,,,,,
332610781,00012,33261078100012,O,1985-05-13,NN,,,2019-11-14T14:00:43,true,2,,,,,,52200,SAINT-CIERGUES,,,52447,,,,,,,,,,,,,,,,,,,2002-12-31,F,,,,,,,,,,0,,,,,,
342085073,00019,34208507300019,O,1987-07-13,NN,,,2019-11-14T14:00:43,true,3,,,,,,52200,SAINT-CIERGUES,,,52447,,,,,,,,,,,,,,,,,,,1993-12-30,F,,,,,55.3A,NAF1993,N,,,0,,,,,,
343340550,00015,34334055000015,O,,NN,,,2019-11-14T14:00:43,true,1,,,,,,52200,SAINT-CIERGUES,,,52447,,,,,,,,,,,,,,,,,,,1991-05-31,F,,,,,67.01,NAP,N,,,0,,,,,,
343340626,00013,34334062600013,O,,NN,,,2019-11-14T14:00:43,true,1,,,,,,52200,SAINT-CIERGUES,,,52447,,,,,,,,,,,,,,,,,,,1991-05-31,F,,,,,67.01,NAP,N,,,0,,,,,,
343340659,00014,34334065900014,O,,NN,,,2019-11-14T14:00:43,true,1,,,,,,52200,SAINT-CIERGUES,,,52447,,,,,,,,,,,,,,,,,,,1991-05-31,F,,,,,67.01,NAP,N,,,0,,,,,,
343340683,00014,34334068300014,O,1987-11-16,NN,,,2019-11-14T14:00:43,true,3,,,,,,52200,SAINT-CIERGUES,,,52447,,,,,,,,,,,,,,,,,,,2008-01-01,A,,,,,56.10A,NAFRev2,N,,,0,,,,,,
382382919,00019,38238291900019,O,,NN,,,2019-11-14T14:00:43,true,1,,,,,,52200,SAINT-CIERGUES,,,52447,,,,,,,,,,,,,,,,,,,1993-12-31,F,,,,,55.3A,NAF1993,N,,,0,,,,,,
387864176,00012,38786417600012,O,,NN,,,2019-11-14T14:00:43,true,1,,,,,,52200,SAINT-CIERGUES,,,52447,,,,,,,,,,,,,,,,,,,1993-12-31,F,,,,,55.3A,NAF1993,N,,,0,,,,,,
394410997,00016,39441099700016,O,1994-02-16,NN,,,2019-11-14T14:00:43,true,1,,,,,,52200,SAINT-CIERGUES,,,52447,,,,,,,,,,,,,,,,,,,2000-12-31,F,,,,,55.3A,NAF1993,N,,,0,,,,,,
398886655,00016,39888665500016,O,1994-11-02,NN,,,2019-11-14T14:00:43,true,7,,,,,,52200,SAINT-CIERGUES,,,52447,,,,,,,,,,,,,,,,,,,2014-12-31,F,,,,,46.90Z,NAFRev2,N,,,0,,,,,,
408046142,00019,40804614200019,O,1989-10-01,NN,,,2019-11-14T14:00:43,false,3,,,,,LES CABANDES,52200,SAINT-CIERGUES,,,52447,,,,,,,,,,,,,,,,,,,2005-04-01,F,,,,,01.2J,NAFRev1,N,5.261834,47.881098,0.76,street,Impasse des Cabandes 52200 Saint-Ciergues,52447_0015,G,IMPASSE DES CABANDES,
408046159,00013,40804615900013,O,1988-11-01,01,2021,,2023-11-27T13:49:51,true,4,,,,,,52200,SAINT-CIERGUES,,,52447,,,,,,,,,,,,,,,,,,,2022-04-25,F,,,,,01.11Z,NAFRev2,N,,,0,,,,,,
408046167,00016,40804616700016,O,1992-01-01,NN,,,2019-11-14T14:00:43,true,3,,,,,,52200,SAINT-CIERGUES,,,52447,,,,,,,,,,,,,,,,,,,2008-01-01,A,,,,,01.11Z,NAFRev2,N,,,0,,,,,,
409727146,00014,40972714600014,O,1977-12-13,02,2021,,2023-11-27T13:51:35,true,4,,1,,IMP,DES COMELLES,52200,SAINT-CIERGUES,,,52447,,,,,,,,,,,,,,,,,,,2009-12-31,A,,,,,01.50Z,NAFRev2,O,5.253383,47.883121,0.83,housenumber,1 Impasse des Comelles 52200 Saint-Ciergues,52447_0030_00001,G,1 IMPASSE DES COMELLES,
409727153,00010,40972715300010,O,1980-01-01,NN,,,2019-11-14T14:00:43,true,3,,,,,,52200,SAINT-CIERGUES,,,52447,,,,,,,,,,,,,,,,,,,2003-12-31,F,,,,,01.1F,NAFRev1,N,,,0,,,,,,
420724874,00037,42072487400037,O,2018-01-29,,,,2021-02-23T11:41:52,true,1,,15,,RUE,DU LAC,52200,SAINT-CIERGUES,,,52447,,,,,,,,,,,,,,,,,,,2018-01-29,A,,,,,68.20A,NAFRev2,N,5.255049,47.882601,0.94,housenumber,15 Rue du Lac 52200 Saint-Ciergues,52447_0055_00015,G,15 RUE DU LAC,
422809624,00014,42280962400014,O,1999-04-01,,,,2019-11-14T14:00:43,false,3,,,,RTE,DE LA DIGUE,52200,SAINT-CIERGUES,,,52447,,,,,,,,,,,,,,,,,,,2000-04-10,F,,,,,85.1G,NAF1993,N,5.255057,47.883835,0.54,street,Rue de la Mairie 52200 Saint-Ciergues,52447_0065,G,RUE DE LA MAIRIE,
424521565,00012,42452156500012,O,1999-04-07,NN,,,2019-11-14T14:00:43,true,4,MOULIN DE SAINT MARTIN,,,,,52200,SAINT-CIERGUES,,,52447,,,,,,,,,,,,,,,,,,,2002-10-30,F,,,,,51.6K,NAF1993,N,5.266534,47.886619,0.94,street,Moulin de Saint Martin 52200 Saint-Ciergues,52447_0080,D,MOULIN DE SAINT MARTIN,
427983234,00019,42798323400019,O,1992-01-01,NN,,,2019-11-14T14:00:43,true,3,,,,,,52200,SAINT-CIERGUES,,,52447,,,,,,,,,,,,,,,,,,,2006-12-31,F,,,,,70.2B,NAFRev1,N,,,0,,,,,,
427983242,00012,42798324200012,O,1992-01-01,NN,,,2019-11-14T14:00:43,true,3,,,,,,52200,SAINT-CIERGUES,,,52447,,,,,,,,,,,,,,,,,,,2006-12-31,F,,,,,70.2B,NAFRev1,N,,,0,,,,,,
431161504,00011,43116150400011,O,1981-02-01,NN,,,2019-11-14T14:00:43,true,3,,,,,,52200,SAINT-CIERGUES,,,52447,,,,,,,,,,,,,,,,,,,2008-01-01,A,,,,,01.11Z,NAFRev2,N,,,0,,,,,,
433903291,00014,43390329100014,O,2001-01-01,NN,,,2019-11-14T14:00:43,true,3,,,,RTE,DE LA DIGUE,52200,SAINT-CIERGUES,,,52447,,,,,,,,,,,,,,,,,,,2003-12-22,F,,,,,55.3A,NAFRev1,O,5.255057,47.883835,0.54,street,Rue de la Mairie 52200 Saint-Ciergues,52447_0065,G,RUE DE LA MAIRIE,
441318425,00010,44131842500010,O,2002-04-01,NN,,,2019-11-14T14:00:43,true,3,,,,CHE,,52200,SAINT-CIERGUES,,,52447,,,,,,,,,,,,,,,,,,,2005-09-30,F,,,,,52.4L,NAFRev1,N,5.257476,47.885262,0.64,street,Chemin de Buet 52200 Saint-Ciergues,52447_0010,G,CHEMIN DE BUET,
448280081,00010,44828008100010,O,2003-04-18,02,2021,,2023-11-27T13:13:23,false,4,,,,RTE,DE LA DIGUE,52200,SAINT-CIERGUES,,,52447,,,,,,,,,,,,,,,,,,,2022-03-19,F,,,,,56.10A,NAFRev2,O,5.255057,47.883835,0.54,street,Rue de la Mairie 52200 Saint-Ciergues,52447_0065,G,RUE DE LA MAIRIE,
448280081,00028,44828008100028,O,2022-03-19,,,,2023-03-25T03:38:33,true,1,,10,,RUE,DU LAC,52200,SAINT-CIERGUES,,,52447,,,,,,,,,,,,,,,,,,,2022-03-19,A,,,,,56.10A,NAFRev2,N,5.255355,47.883189,0.94,housenumber,10 Rue du Lac 52200 Saint-Ciergues,52447_0055_00010,G,10 RUE DU LAC,
448470625,00014,44847062500014,O,2003-04-22,NN,,,2021-07-03T04:00:09,true,3,,,,,,52200,SAINT-CIERGUES,,,52447,,,,,,,,,,,,,,,,,,,2008-01-01,A,,,,,68.20B,NAFRev2,N,,,0,,,,,,
448972604,00020,44897260400020,O,2005-06-01,,,,2019-11-14T14:00:43,true,2,,,,RTE,DE LA DIGUE,52200,SAINT-CIERGUES,,,52447,,,,,,,,,,,,,,,,,,,2008-01-01,A,,,,,68.20B,NAFRev2,N,5.255057,47.883835,0.54,street,Rue de la Mairie 52200 Saint-Ciergues,52447_0065,G,RUE DE LA MAIRIE,
450157557,00023,45015755700023,O,2019-07-24,,,,2020-02-06T03:50:03,true,1,,15,,RUE,DU LAC,52200,SAINT-CIERGUES,,,52447,,,,,,,,,,,,,,,,,,,2019-07-24,A,,,,,68.20B,NAFRev2,N,5.255049,47.882601,0.94,housenumber,15 Rue du Lac 52200 Saint-Ciergues,52447_0055_00015,G,15 RUE DU LAC,
485090716,00013,48509071600013,O,2006-09-01,,,,2023-03-29T13:22:09,false,3,,5,,RUE,DU CLOS,52200,SAINT-CIERGUES,,,52447,,,,,,,,,,,,,,,,,,,2016-12-10,F,,,,,01.11Z,NAFRev2,N,5.253374,47.883987,0.94,housenumber,5 Rue du Clos 52200 Saint-Ciergues,52447_0025_00005,G,5 RUE DU CLOS,
489742718,00013,48974271800013,O,2006-03-25,,,,2019-11-14T14:00:43,true,3,,7,,RUE,DE LA MAIRIE,52200,SAINT-CIERGUES,,,52447,,,,,,,,,,,,,,,,,,,2016-03-26,F,,,,,68.20B,NAFRev2,N,5.25491,47.883584,0.94,housenumber,7 Rue de la Mairie 52200 Saint-Ciergues,52447_0065_00007,G,7 RUE DE LA MAIRIE,
490848645,00019,49084864500019,O,2006-06-12,,,,2019-11-14T14:00:43,true,2,,,,LOT,BEAU REGARD,52200,SAINT-CIERGUES,,,52447,,,,,,,,,,,,,,,,,,,2008-01-01,A,,,,,68.20B,NAFRev2,N,,,0,,,,,,
494048135,00011,49404813500011,O,2007-01-15,,,,2019-11-14T14:00:43,false,3,,,,CHE,DU BUET,52200,SAINT-CIERGUES,,,52447,,,,,,,,,,,,,,,,,,,2008-04-01,F,,,,,68.20B,NAFRev2,N,5.257476,47.885262,0.55,street,Chemin de Buet 52200 Saint-Ciergues,52447_0010,G,CHEMIN DE BUET,
495068025,00024,49506802500024,O,2022-12-31,,,,2023-09-02T13:20:46,true,1,,,,,COMBE AU BERGER,52200,SAINT-CIERGUES,,,52447,,,,,,,,,,,,,,,,,,,2022-12-31,A,,,,,01.50Z,NAFRev2,N,5.281561,47.881911,0.93,locality,Combe au Berger 52200 Saint-Ciergues,52447_B009,G,COMBE AU BERGER,
498990597,00011,49899059700011,O,2007-07-02,02,2021,4391BZ,2023-11-27T13:56:04,true,2,,2,,CHE,DE VIRLOUP,52200,SAINT-CIERGUES,,,52447,,,,,,,,,,,,,,,,,,,2008-01-01,A,,,,,43.91B,NAFRev2,O,5.262517,47.882542,0.72,housenumber,2 Chemin de Vireloup 52200 Saint-Ciergues,52447_0135_00002,G,2 CHEMIN DE VIRELOUP,
528005648,00019,52800564800019,O,2010-10-21,,,,2019-11-14T14:00:43,true,1,,6,,LOT,EN BUET,52200,SAINT-CIERGUES,,,52447,,,,,,,,,,,,,,,,,,,2010-10-21,A,,,,,68.20B,NAFRev2,N,5.257424,47.885281,0.41,housenumber,6 Chemin de Buet 52200 Saint-Ciergues,52447_0010_00006,G,6 CHEMIN DE BUET,
533844833,00012,53384483300012,O,2011-07-13,,,,2019-11-14T14:00:43,true,1,,,,CHE,DE LA COMBE AU BERGER,52200,SAINT-CIERGUES,,,52447,,,,,,,,,,,,,,,,,,,2011-07-13,A,,,,,68.20B,NAFRev2,N,5.281561,47.881911,0.62,locality,Combe au Berger 52200 Saint-Ciergues,52447_B009,G,COMBE AU BERGER,
534033246,00016,53403324600016,O,2011-09-01,NN,,,2019-11-14T14:00:43,true,5,,5,,RUE,CLOS,52200,SAINT-CIERGUES,,,52447,,,,,,,,,,,,,,,,,,,2016-07-02,F,,,,SEVEN TECHNOLOGIE,62.09Z,NAFRev2,O,5.253374,47.883987,0.85,housenumber,5 Rue du Clos 52200 Saint-Ciergues,52447_0025_00005,G,5 RUE DU CLOS,
537897241,00015,53789724100015,O,2011-09-02,,,,2019-11-14T14:00:43,true,1,,,,,FORT DE LA POINTE DE DIAMANT,52200,SAINT-CIERGUES,,,52447,,,,,,,,,,,,,,,,,,,2011-09-02,A,,,,,94.99Z,NAFRev2,N,5.2986273,47.8795944,0.9,poi.castle,Fort de la Pointe de Diamant (Château) Saint-Ciergues,https://osm.org/node/2371960907,G,,
539165829,00018,53916582900018,P,2012-02-01,,,,2019-11-14T14:00:43,false,2,[ND],[ND],[ND],[ND],[ND],[ND],SAINT-CIERGUES,,[ND],52447,[ND],[ND],,,[ND],[ND],[ND],[ND],[ND],[ND],,,[ND],,[ND],[ND],,,2014-03-01,F,[ND],[ND],[ND],[ND],47.91B,NAFRev2,N,,,0,,,,,,
733840565,00036,73384056500036,O,2001-08-01,,,,2019-11-14T14:00:43,true,1,,,,CHE,,52200,SAINT-CIERGUES,,,52447,,,,,,,,,,,,,,,,,,,2002-03-31,F,,,,,52.4L,NAF1993,N,5.257476,47.885262,0.64,street,Chemin de Buet 52200 Saint-Ciergues,52447_0010,G,CHEMIN DE BUET,
750592388,00011,75059238800011,O,2012-04-02,,,4399CZ,2019-11-14T14:00:43,true,1,,3,,CHE,DU CLOS,52200,SAINT-CIERGUES,,,52447,,,,,,,,,,,,,,,,,,,2012-04-02,A,,,,ERIC PAYSAGES,43.99C,NAFRev2,N,5.253332,47.884144,0.67,housenumber,3 Rue du Clos 52200 Saint-Ciergues,52447_0025_00003,G,3 RUE DU CLOS,
780462461,00036,78046246100036,O,1998-01-01,NN,,,2019-11-14T14:00:43,true,4,,3,,PL,DE LA MAIRIE,52200,SAINT-CIERGUES,,,52447,,,,,,,,,,,,,,,,,,,2012-10-03,F,,,,,90.01Z,NAFRev2,N,5.254945,47.883295,0.73,housenumber,3 Rue de la Mairie 52200 Saint-Ciergues,52447_0065_00003,G,3 RUE DE LA MAIRIE,
780487146,00018,78048714600018,O,,,,,2019-11-14T14:00:43,true,1,,,,,,52200,SAINT-CIERGUES,,,52447,,,,,,,,,,,,,,,,,,,1984-12-25,F,,,,,81.21,NAP,N,,,0,,,,,,
780487187,00012,78048718700012,O,1900-01-01,NN,,,2019-11-14T14:00:43,true,3,MAIRIE,6,,PL,DE LA MAIRIE,52200,SAINT-CIERGUES,,,52447,,,,,,,,,,,,,,,,,,,2008-01-01,A,,,,,93.12Z,NAFRev2,N,5.254949,47.884103,0.73,housenumber,6 Rue de la Mairie 52200 Saint-Ciergues,52447_0065_00006,G,6 RUE DE LA MAIRIE,
794556696,00019,79455669600019,P,2010-07-28,,,,2021-05-06T08:42:17,true,3,[ND],[ND],[ND],[ND],[ND],[ND],SAINT-CIERGUES,,[ND],52447,[ND],[ND],,,[ND],[ND],[ND],[ND],[ND],[ND],,,[ND],,[ND],[ND],,,2021-03-15,A,[ND],[ND],[ND],[ND],47.99A,NAFRev2,N,,,0,,,,,,
799560891,00019,79956089100019,O,2014-01-10,,,,2019-11-14T14:00:43,true,1,,6,,RUE,DE VERONNE,52200,SAINT-CIERGUES,,,52447,,,,,,,,,,,,,,,,,,,2014-01-10,A,VERGER POM POM POM POM,,,,01.24Z,NAFRev2,N,5.254793,47.884641,0.88,housenumber,6 Rue de la Veronne 52200 Saint-Ciergues,52447_0125_00006,G,6 RUE DE LA VERONNE,
801340001,00016,80134000100016,O,2014-04-01,,,,2019-11-14T14:00:43,true,1,,,,,FORT DE LA POINTE DE DIAMANT,52200,SAINT-CIERGUES,,,52447,,,,,,,,,,,,,,,,,,,2014-04-01,A,,,,,47.79Z,NAFRev2,N,5.2986273,47.8795944,0.9,poi.castle,Fort de la Pointe de Diamant (Château) Saint-Ciergues,https://osm.org/node/2371960907,G,,
804848539,00016,80484853900016,O,2014-07-24,01,2021,,2023-11-27T14:40:19,true,1,,1,,IMP,DES COMELLES,52200,SAINT-CIERGUES,,,52447,,,,,,,,,,,,,,,,,,,2014-07-24,A,,,,,01.61Z,NAFRev2,N,5.253383,47.883121,0.83,housenumber,1 Impasse des Comelles 52200 Saint-Ciergues,52447_0030_00001,G,1 IMPASSE DES COMELLES,
807854195,00011,80785419500011,O,2014-11-05,,,,2019-11-14T14:00:43,true,1,,3,,RUE,DU CLOS,52200,SAINT-CIERGUES,,,52447,,,,,,,,,,,,,,,,,,,2014-11-05,A,,,,,68.20B,NAFRev2,N,5.253332,47.884144,0.94,housenumber,3 Rue du Clos 52200 Saint-Ciergues,52447_0025_00003,G,3 RUE DU CLOS,
808080519,00016,80808051900016,O,2014-11-01,,,,2019-11-14T14:00:43,true,1,,7,,RTE,DU CHATEAU D'EAU,52200,SAINT-CIERGUES,,,52447,,,,,,,,,,,,,,,,,,,2014-11-01,A,,,,,01.11Z,NAFRev2,N,5.252388,47.886165,0.85,housenumber,7 Route du Chateau d’Eau 52200 Saint-Ciergues,52447_0020_00007,G,7 ROUTE DU CHATEAU D EAU,
810885335,00028,81088533500028,O,2022-02-01,,,,2022-05-04T08:38:19,true,2,,4,,IMP,DES SOURCES,52200,SAINT-CIERGUES,,,52447,,,,,,,,,,,,,,,,,,,2022-04-29,A,,,,,55.30Z,NAFRev2,O,5.249399,47.879775,0.83,housenumber,4 Impasse des Sources 52200 Saint-Ciergues,52447_0120_00004,G,4 IMPASSE DES SOURCES,
813303351,00023,81330335100023,O,2022-02-01,,,,2022-02-24T03:47:39,true,1,,4,,IMP,DES SOURCES,52200,SAINT-CIERGUES,,,52447,,,,,,,,,,,,,,,,,,,2022-02-01,A,,,,,68.20B,NAFRev2,N,5.249399,47.879775,0.83,housenumber,4 Impasse des Sources 52200 Saint-Ciergues,52447_0120_00004,G,4 IMPASSE DES SOURCES,
822096533,00010,82209653300010,P,2016-09-01,,,,2019-11-14T14:00:43,true,1,[ND],[ND],[ND],[ND],[ND],[ND],SAINT-CIERGUES,,[ND],52447,[ND],[ND],,,[ND],[ND],[ND],[ND],[ND],[ND],,,[ND],,[ND],[ND],,,2016-09-01,A,[ND],[ND],[ND],[ND],55.20Z,NAFRev2,N,,,0,,,,,,
838319317,00015,83831931700015,O,2018-04-02,,,,2020-09-09T08:37:05,true,2,,1,,,MOULIN SAINT MARTIN,52200,SAINT-CIERGUES,,,52447,,,,,,,,,,,,,,,,,,,2020-10-01,F,,,,,86.90F,NAFRev2,N,5.266406,47.886429,0.92,housenumber,1 Moulin de Saint Martin 52200 Saint-Ciergues,52447_0080_00001,G,1 MOULIN DE SAINT MARTIN,
842039414,00011,84203941400011,O,2018-08-22,,,,2020-10-03T03:45:33,true,1,,1,,IMP,DES COMELLES,52200,SAINT-CIERGUES,,,52447,,,,,,,,,,,,,,,,,,,2018-08-22,A,,,,,35.21Z,NAFRev2,N,5.253383,47.883121,0.83,housenumber,1 Impasse des Comelles 52200 Saint-Ciergues,52447_0030_00001,G,1 IMPASSE DES COMELLES,
845148568,00015,84514856800015,O,2019-01-01,,,,2019-11-14T14:00:43,true,1,,7,,RUE,DU LAC,52200,SAINT-CIERGUES,,,52447,,,,,,,,,,,,,,,,,,,2019-01-01,A,,,,,01.50Z,NAFRev2,N,5.255638,47.883782,0.94,housenumber,7 Rue du Lac 52200 Saint-Ciergues,52447_0055_00007,G,7 RUE DU LAC,
845620350,00254,84562035000254,O,2001-01-01,01,2021,,2023-11-27T15:31:32,false,3,,,,,,52200,SAINT-CIERGUES,,,52447,,,,,,,,,,,,,,,,,,,2013-12-31,A,,,,,46.21Z,NAFRev2,O,,,0,,,,,,
851601906,00015,85160190600015,O,2019-06-01,,,,2020-08-20T03:42:51,false,2,,6,,RUE,DE LA MAIRIE,52200,SAINT-CIERGUES,,,52447,,,,,,,,,,,,,,,,,,,2020-08-01,F,LES RUCHERS LINGONS,,,,01.49Z,NAFRev2,N,5.254949,47.884103,0.94,housenumber,6 Rue de la Mairie 52200 Saint-Ciergues,52447_0065_00006,G,6 RUE DE LA MAIRIE,
878627066,00011,87862706600011,O,2019-10-17,,,,2023-04-12T03:42:21,true,1,,7,,RES,DU LAC,52200,SAINT-CIERGUES,,,52447,,,,,,,,,,,,,,,,,,,2019-10-17,A,,,,,68.20B,NAFRev2,N,5.255638,47.883782,0.71,housenumber,7 Rue du Lac 52200 Saint-Ciergues,52447_0055_00007,G,7 RUE DU LAC,
883166803,00014,88316680300014,O,2020-03-19,,,,2020-05-04T11:16:53,true,1,,2,,,CHE DE VIRELOUP,52200,SAINT-CIERGUES,,,52447,,,,,,,,,,,,,,,,,,,2020-03-19,A,,,,,68.20A,NAFRev2,N,5.262517,47.882542,0.83,housenumber,2 Chemin de Vireloup 52200 Saint-Ciergues,52447_0135_00002,G,2 CHEMIN DE VIRELOUP,
883418634,00019,88341863400019,O,2020-04-17,,,,2020-05-18T06:23:09,true,1,,1,,IMP,DES COMELLES,52200,SAINT-CIERGUES,,,52447,,,,,,,,,,,,,,,,,,,2020-04-17,A,,,,,01.61Z,NAFRev2,N,5.253383,47.883121,0.83,housenumber,1 Impasse des Comelles 52200 Saint-Ciergues,52447_0030_00001,G,1 IMPASSE DES COMELLES,
883933467,00010,88393346700010,O,2020-05-25,,,,2020-06-08T08:23:10,true,1,,7,,RUE,DU LAC,52200,SAINT-CIERGUES,,,52447,,,,,,,,,,,,,,,,,,,2020-05-25,A,,,,,64.20Z,NAFRev2,N,5.255638,47.883782,0.94,housenumber,7 Rue du Lac 52200 Saint-Ciergues,52447_0055_00007,G,7 RUE DU LAC,
883973364,00010,88397336400010,O,2020-05-25,,,,2020-06-08T11:13:39,true,1,,2,,CHE,DE BUET,52200,SAINT-CIERGUES,,,52447,,,,,,,,,,,,,,,,,,,2020-05-25,A,,,,,64.20Z,NAFRev2,N,5.256802,47.884955,0.8,housenumber,2 Chemin de Buet 52200 Saint-Ciergues,52447_0010_00002,G,2 CHEMIN DE BUET,
884548520,00011,88454852000011,O,2020-06-11,,,,2020-06-26T07:50:34,true,1,,4,,RUE,DU CLOS,52200,SAINT-CIERGUES,,,52447,,,,,,,,,,,,,,,,,,,2020-06-11,A,,,,,64.20Z,NAFRev2,N,5.253187,47.884388,0.94,housenumber,4 Rue du Clos 52200 Saint-Ciergues,52447_0025_00004,G,4 RUE DU CLOS,
884611955,00011,88461195500011,O,2020-06-11,,,,2020-06-29T07:21:10,true,1,,1,,RUE,DE BEAUREGARD,52200,SAINT-CIERGUES,,,52447,,,,,,,,,,,,,,,,,,,2020-06-11,A,,,,,64.20Z,NAFRev2,N,5.250684,47.886113,0.93,housenumber,1 Rue de Beauregard 52200 Saint-Ciergues,52447_0002_00001,G,1 RUE DE BEAUREGARD,
885054585,00017,88505458500017,O,2020-05-25,,,,2020-07-10T09:58:15,true,1,,3,,CHE,DU TIALEVE,52200,SAINT-CIERGUES,,,52447,,,,,,,,,,,,,,,,,,,2020-05-25,A,,,,,64.20Z,NAFRev2,N,5.250901,47.885399,0.82,housenumber,3 Chemin du Tialeve 52200 Saint-Ciergues,52447_0123_00003,G,3 CHEMIN DU TIALEVE,
893675918,00013,89367591800013,O,2021-01-27,,,,2021-02-08T12:15:27,true,1,,,,,LA FONTAINE AUX BASSINS,52200,SAINT-CIERGUES,,,52447,,,,,,,,,,,,,,,,,,,2021-01-27,A,,,,,01.61Z,NAFRev2,N,5.27901,47.884041,0.92,street,Ferme de la Fontaine aux Bassins 52200 Saint-Ciergues,52447_x8hjv0,G,FERME DE LA FONTAINE AUX BASSINS,
897561205,00013,89756120500013,O,2021-03-22,,,,2023-07-29T03:41:42,true,1,,10,,RUE,DU LAC,52200,SAINT-CIERGUES,,,52447,,,,,,,,,,,,,,,,,,,2021-03-22,A,,,,L'EVENEMENTIEL 52,93.29Z,NAFRev2,N,5.255355,47.883189,0.94,housenumber,10 Rue du Lac 52200 Saint-Ciergues,52447_0055_00010,G,10 RUE DU LAC,
911519437,00014,91151943700014,O,2022-03-18,,,,2022-03-21T09:42:33,true,1,,16,,RUE,SAINT CYR,52200,SAINT-CIERGUES,,,52447,,,,,,,,,,,,,,,,,,,2022-03-18,A,,,,OPALE STORE,47.91B,NAFRev2,N,5.254775,47.88522,0.94,housenumber,16 Rue Saint Cyr 52200 Saint-Ciergues,52447_0110_00016,G,16 RUE SAINT CYR,
912802733,00010,91280273300010,O,2022-04-16,,,,2022-07-27T03:47:22,true,1,,4,,RTE,DU CHATEAU D'EAU,52200,SAINT-CIERGUES,,,52447,,,,,,,,,,,,,,,,,,,2022-04-16,A,FERME DES QUATRE VENTS,,,,01.11Z,NAFRev2,N,5.253121,47.886792,0.85,housenumber,4 Route du Chateau d’Eau 52200 Saint-Ciergues,52447_0020_00004,G,4 ROUTE DU CHATEAU D EAU,
953291689,00016,95329168900016,O,2022-01-01,,,,2023-06-30T13:25:49,true,1,,1,,RUE,DU CLOS,52200,SAINT-CIERGUES,,,52447,,,,,,,,,,,,,,,,,,,2022-01-01,A,,,,,68.20A,NAFRev2,N,5.253368,47.884741,0.94,housenumber,1 Rue du Clos 52200 Saint-Ciergues,52447_0025_00001,G,1 RUE DU CLOS,
953993953,00017,95399395300017,O,2023-06-29,,,,2023-07-01T13:41:57,true,1,,10,,RUE,DE LA GRANDE FONTAINE,52200,SAINT-CIERGUES,,,52447,,,,,,,,,,,,,,,,,,,2023-06-29,A,,,,,70.22Z,NAFRev2,N,5.254968,47.882644,0.94,housenumber,10 Rue de la Grande Fontaine 52200 Saint-Ciergues,52447_0050_00010,G,10 RUE DE LA GRANDE FONTAINE,
