siren,nic,siret,statutDiffusionEtablissement,dateCreationEtablissement,trancheEffectifsEtablissement,anneeEffectifsEtablissement,activitePrincipaleRegistreMetiersEtablissement,dateDernierTraitementEtablissement,etablissementSiege,nombrePeriodesEtablissement,complementAdresseEtablissement,numeroVoieEtablissement,indiceRepetitionEtablissement,typeVoieEtablissement,libelleVoieEtablissement,codePostalEtablissement,libelleCommuneEtablissement,libelleCommuneEtrangerEtablissement,distributionSpecialeEtablissement,codeCommuneEtablissement,codeCedexEtablissement,libelleCedexEtablissement,codePaysEtrangerEtablissement,libellePaysEtrangerEtablissement,complementAdresse2Etablissement,numeroVoie2Etablissement,indiceRepetition2Etablissement,typeVoie2Etablissement,libelleVoie2Etablissement,codePostal2Etablissement,libelleCommune2Etablissement,libelleCommuneEtranger2Etablissement,distributionSpeciale2Etablissement,codeCommune2Etablissement,codeCedex2Etablissement,libelleCedex2Etablissement,codePaysEtranger2Etablissement,libellePaysEtranger2Etablissement,dateDebut,etatAdministratifEtablissement,enseigne1Etablissement,enseigne2Etablissement,enseigne3Etablissement,denominationUsuelleEtablissement,activitePrincipaleEtablissement,nomenclatureActivitePrincipaleEtablissement,caractereEmployeurEtablissement,longitude,latitude,geo_score,geo_type,geo_adresse,geo_id,geo_ligne,geo_l4,geo_l5
216200527,00010,21620052700010,O,1983-03-01,02,2021,,2023-11-27T13:23:41,true,4,,,,RUE,DE LA MAIRIE,62250,AUDEMBERT,,,62052,,,,,,,,,,,,,,,,,,,2008-01-01,A,MAIRIE,,,,84.11Z,NAFRev2,O,1.690315,50.860672,0.94,street,Rue de la Mairie 62250 Audembert,62052_0028,G,RUE DE LA MAIRIE,
216200527,00028,21620052700028,O,1983-12-21,01,2021,,2023-11-27T13:23:41,false,4,,,,RUE,DE LA MAIRIE,62250,AUDEMBERT,,,62052,,,,,,,,,,,,,,,,,,,2020-12-25,A,ECOLE ELEMENTAIRE RPI 81,,,,85.20Z,NAFRev2,N,1.690315,50.860672,0.94,street,Rue de la Mairie 62250 Audembert,62052_0028,G,RUE DE LA MAIRIE,
266200526,00017,26620052600017,O,1983-03-01,NN,,,2022-04-29T13:57:07,true,4,MAIRIE,,,RUE,DE LA MAIRIE,62250,AUDEMBERT,,,62052,,,,,,,,,,,,,,,,,,,2015-12-31,F,CCAS,,,,88.99B,NAFRev2,N,1.690315,50.860672,0.94,street,Rue de la Mairie 62250 Audembert,62052_0028,G,RUE DE LA MAIRIE,
301273934,00010,30127393400010,O,,,,,,true,1,,,,LD,WARCOVE,62250,AUDEMBERT,,,62052,,,,,,,,,,,,,,,,,,,1984-12-25,F,,,,,87.10,NAP,N,1.676411,50.855514,0.92,street,Hameau de Warcove 62250 Audembert,62052_B070,G,HAMEAU DE WARCOVE,
315362715,00015,31536271500015,O,1979-01-01,NN,,,,true,1,,,,RTE,DE MARQUISE,62250,AUDEMBERT,,,62052,,,,,,,,,,,,,,,,,,,1998-04-20,F,,,,,45.2V,NAF1993,O,1.670937,50.865183,0.7,street,Chemin de Marquise 62250 Audembert,62052_0026,G,CHEMIN DE MARQUISE,
323523563,00019,32352356300019,O,1982-01-01,NN,,,2008-11-07T00:40:13,false,4,,,,,,62250,AUDEMBERT,,,62052,,,,,,,,,,,,,,,,,,,2002-02-01,F,,,,,50.2Z,NAF1993,O,,,0,,,,,,
323523563,00027,32352356300027,O,1988-09-30,NN,,,2013-10-08T03:44:42,true,4,,3,,,LES 3 CHEMINEES,62250,AUDEMBERT,,,62052,,,,,,,,,,,,,,,,,,,2013-08-31,F,,,,,01.11Z,NAFRev2,N,,,0,,,,,,
325501021,00043,32550102100043,O,1986-12-01,NN,,,2021-11-05T11:18:42,false,4,,,,,LES TROIS CHEMINEES,62250,AUDEMBERT,,,62052,,,,,,,,,,,,,,,,,,,2015-12-31,F,,,,,90.03A,NAFRev2,N,5.9090238,46.3037719,0.85,poi.information,Les Trois Cheminée - 1230m (Informations) Bellecombe,https://osm.org/node/4963500221,G,,
332476282,00014,33247628200014,O,,NN,,,,true,1,,,,,LA CONTRAGNE,62250,AUDEMBERT,,,62052,,,,,,,,,,,,,,,,,,,1989-12-25,F,,,,,60.02,NAP,N,1.697464,50.853759,0.58,street,Impasse la Cantraigne 62250 Audembert,62052_0007,G,IMPASSE LA CANTRAIGNE,
333415081,00012,33341508100012,O,1985-09-09,NN,,,2017-01-05T04:17:09,true,4,,,,RUE,DES GRARES,62250,AUDEMBERT,,,62052,,,,,,,,,,,,,,,,,,,2016-08-25,F,,,,,01.11Z,NAFRev2,N,1.689536,50.862744,0.75,street,Rue les Grares 62250 Audembert,62052_0013,G,RUE LES GRARES,
334788270,00018,33478827000018,O,,NN,,,,true,1,,,,RUE,DES GRARES,62250,AUDEMBERT,,,62052,,,,,,,,,,,,,,,,,,,1993-12-25,F,,,,,01.2J,NAF1993,N,1.689536,50.862744,0.75,street,Rue les Grares 62250 Audembert,62052_0013,G,RUE LES GRARES,
335225116,00029,33522511600029,P,2020-04-01,,,8121ZZ,2021-02-23T10:54:11,true,1,[ND],[ND],[ND],[ND],[ND],[ND],AUDEMBERT,,[ND],62052,[ND],[ND],,,[ND],[ND],[ND],[ND],[ND],[ND],,,[ND],,[ND],[ND],,,2020-04-01,A,[ND],[ND],[ND],[ND],81.21Z,NAFRev2,N,,,0,,,,,,
341439719,00012,34143971900012,O,1987-05-25,NN,,,2016-08-17T03:44:29,true,4,,,,,LIEU DIT LA CANTRAGNE,62250,AUDEMBERT,,,62052,,,,,,,,,,,,,,,,,,,2015-12-30,F,,,,,68.20A,NAFRev2,N,1.697464,50.853759,0.79,street,Impasse la Cantraigne 62250 Audembert,62052_0007,G,IMPASSE LA CANTRAIGNE,
344292099,00035,34429209900035,O,2015-06-15,,,,2021-02-23T10:59:20,true,1,,3,,RUE,DE LA SARRE,62250,AUDEMBERT,,,62052,,,,,,,,,,,,,,,,,,,2015-06-15,A,,,,,68.20B,NAFRev2,N,1.693638,50.860348,0.95,housenumber,3 Rue de la Sarre 62250 Audembert,62052_0056_00003,G,3 RUE DE LA SARRE,
347997728,00048,34799772800048,O,2010-04-01,,,,2014-12-12T08:54:33,true,2,,315,,RUE,LES GRARES,62250,AUDEMBERT,,,62052,,,,,,,,,,,,,,,,,,,2014-12-08,F,,,,,68.31Z,NAFRev2,N,1.689155,50.863005,0.95,housenumber,315 Rue les Grares 62250 Audembert,62052_0013_00315,G,315 RUE LES GRARES,
377551312,00012,37755131200012,O,,NN,,,,true,1,,,,,FERME DE LA NOIRE CHOQUE,62250,AUDEMBERT,,,62052,,,,,,,,,,,,,,,,,,,1990-12-04,F,,,,,01.07,NAP,N,1.696652,50.859823,0.78,street,Rue de la Noire Choque 62250 Audembert,62052_0031,G,RUE DE LA NOIRE CHOQUE,
379402639,00015,37940263900015,O,1990-06-30,NN,,,2015-07-20T16:25:59,false,4,,,,,,62250,AUDEMBERT,,,62052,,,,,,,,,,,,,,,,,,,2015-06-30,F,,,,,01.50Z,NAFRev2,N,,,0,,,,,,
381304740,00016,38130474000016,O,1990-12-04,NN,,,2022-12-17T04:08:55,true,4,,,,,FERME DE LA NOIRE CHOQUE,62250,AUDEMBERT,,,62052,,,,,,,,,,,,,,,,,,,2022-12-31,F,,,,,01.11Z,NAFRev2,N,1.696652,50.859823,0.78,street,Rue de la Noire Choque 62250 Audembert,62052_0031,G,RUE DE LA NOIRE CHOQUE,
382937811,00018,38293781100018,O,1991-07-01,NN,,,2019-05-21T11:24:43,true,4,,,,,LA VALLEE,62250,AUDEMBERT,,,62052,,,,,,,,,,,,,,,,,,,2008-10-01,A,,,,,68.20B,NAFRev2,N,1.690463,50.85862,0.93,street,Rue de la Vallée 62250 Audembert,62052_0065,G,RUE DE LA VALLEE,
382937811,00026,38293781100026,O,2017-04-01,,,,2019-05-21T11:24:53,false,2,,850,,RUE,DE LA VALLEE,62250,AUDEMBERT,,,62052,,,,,,,,,,,,,,,,,,,2018-12-31,F,,,,,01.47Z,NAFRev2,N,1.686677,50.854712,0.95,housenumber,850 Rue de la Vallée 62250 Audembert,62052_0065_00850,G,850 RUE DE LA VALLEE,
391535739,00018,39153573900018,O,1993-06-21,NN,,,2009-06-27T07:06:38,false,4,,270,,RUE,DE LA BASSE VALLEE,62250,AUDEMBERT,,,62052,,,,,,,,,,,,,,,,,,,2007-10-31,F,,,,,01.4A,NAFRev1,O,1.688915,50.85297,0.94,housenumber,270 Rue de la Basse Vallée 62250 Audembert,62052_0004_00270,G,270 RUE DE LA BASSE VALLEE,
391535739,00034,39153573900034,O,2018-08-12,,,,2021-05-18T15:16:04,true,1,,456,,IMP,DE LA CANTRAIGNE,62250,AUDEMBERT,,,62052,,,,,,,,,,,,,,,,,,,2018-08-12,A,,,,,68.20A,NAFRev2,N,1.697394,50.853949,0.8,housenumber,456 Impasse la Cantraigne 62250 Audembert,62052_0007_00456,G,456 IMPASSE LA CANTRAIGNE,
391547668,00015,39154766800015,O,,NN,,,,true,1,,,,,LE VILLAGE,62250,AUDEMBERT,,,62052,,,,,,,,,,,,,,,,,,,1992-12-31,F,,,,,52.6G,NAF1993,N,1.697638,50.857583,0.36,street,Impasse de la Ronville 62250 Audembert,62052_0042,G,IMPASSE DE LA RONVILLE,
392504817,00025,39250481700025,O,1997-12-31,NN,,,2010-07-08T09:06:37,false,4,,261,,RUE,DE LA MAIRIE,62250,AUDEMBERT,,,62052,,,,,,,,,,,,,,,,,,,2010-07-01,F,,,,,49.41A,NAFRev2,N,1.688939,50.859865,0.94,housenumber,261 Rue de la Mairie 62250 Audembert,62052_0028_00261,G,261 RUE DE LA MAIRIE,
395096985,00019,39509698500019,O,1983-01-01,NN,,,,true,1,,,,,,62250,AUDEMBERT,,,62052,,,,,,,,,,,,,,,,,,,2000-12-31,F,,,,,01.3Z,NAF1993,N,,,0,,,,,,
398251231,00013,39825123100013,O,1980-01-01,NN,,,2017-03-20T10:09:49,true,3,,,,,LA NOIRE CHOQUE,62250,AUDEMBERT,,,62052,,,,,,,,,,,,,,,,,,,2008-01-01,A,,,,,01.50Z,NAFRev2,N,1.696652,50.859823,0.93,street,Rue de la Noire Choque 62250 Audembert,62052_0031,G,RUE DE LA NOIRE CHOQUE,
398323774,00032,39832377400032,O,2004-06-01,,,,2008-01-04T18:47:18,true,3,,160,,RUE,DE L EGLISE,62250,AUDEMBERT,,,62052,,,,,,,,,,,,,,,,,,,2008-01-01,A,,,,,86.21Z,NAFRev2,N,1.69169,50.862161,0.94,housenumber,160 Rue de l'Eglise 62250 Audembert,62052_0009_00160,G,160 RUE DE L EGLISE,
402499644,00019,40249964400019,O,1995-09-01,NN,,,2008-01-04T20:05:21,true,3,,456,,RUE,DE LA VALLEE,62250,AUDEMBERT,,,62052,,,,,,,,,,,,,,,,,,,2008-01-01,A,,,,,01.42Z,NAFRev2,N,1.689155,50.857497,0.95,housenumber,456 Rue de la Vallée 62250 Audembert,62052_0065_00456,G,456 RUE DE LA VALLEE,
403460447,00010,40346044700010,O,1995-12-15,NN,,,,true,3,,,,CHE,DEPARTEMENTAL 238,62250,AUDEMBERT,,,62052,,,,,,,,,,,,,,,,,,,1997-01-27,F,,,,,70.2A,NAF1993,N,,,0,,,,,,
404247769,00015,40424776900015,O,1963-01-01,NN,,,2018-06-05T10:35:42,false,5,,,,,,62250,AUDEMBERT,,,62052,,,,,,,,,,,,,,,,,,,2018-03-15,F,,,,,01.11Z,NAFRev2,O,,,0,,,,,,
404247777,00018,40424777700018,O,1981-12-01,NN,,,2006-10-28T03:20:07,true,3,,,,,,62250,AUDEMBERT,,,62052,,,,,,,,,,,,,,,,,,,2006-09-30,F,,,,,01.3Z,NAFRev1,N,,,0,,,,,,
404247785,00011,40424778500011,O,1973-09-15,NN,,,2009-02-23T09:01:54,true,4,,,,,LIEUDIT LA BASSE VALLEE,62250,AUDEMBERT,,,62052,,,,,,,,,,,,,,,,,,,2008-12-31,F,,,,,01.41Z,NAFRev2,N,1.68888,50.853053,0.93,street,Rue de la Basse Vallée 62250 Audembert,62052_0004,G,RUE DE LA BASSE VALLEE,
404247793,00015,40424779300015,P,1979-01-30,00,2020,,2022-08-29T09:24:40,true,6,[ND],[ND],[ND],[ND],[ND],[ND],AUDEMBERT,,[ND],62052,[ND],[ND],,,[ND],[ND],[ND],[ND],[ND],[ND],,,[ND],,[ND],[ND],,,2020-12-01,A,[ND],[ND],[ND],[ND],68.20A,NAFRev2,N,,,0,,,,,,
404247801,00016,40424780100016,O,1992-01-01,NN,,,2008-01-04T20:37:38,true,5,,,,,LA NOIRE BERNE,62250,AUDEMBERT,,,62052,,,,,,,,,,,,,,,,,,,2008-01-01,A,,,,,01.11Z,NAFRev2,N,1.696652,50.859823,0.63,street,Rue de la Noire Choque 62250 Audembert,62052_0031,G,RUE DE LA NOIRE CHOQUE,
407540848,00022,40754084800022,O,2010-05-06,,,,2012-11-09T01:03:44,true,2,,261,,RUE,DE LA VALLEE,62250,AUDEMBERT,,,62052,,,,,,,,,,,,,,,,,,,2010-08-09,F,,,,,73.11Z,NAFRev2,N,1.690713,50.858972,0.95,housenumber,261 Rue de la Vallée 62250 Audembert,62052_0065_00261,G,261 RUE DE LA VALLEE,
408118016,00026,40811801600026,O,1996-12-18,NN,,,2019-01-09T14:39:20,true,4,,,,,LIEU DIT LA CANTRAGNE,62250,AUDEMBERT,,,62052,,,,,,,,,,,,,,,,,,,2017-12-31,F,,,,,68.20A,NAFRev2,N,1.697464,50.853759,0.79,street,Impasse la Cantraigne 62250 Audembert,62052_0007,G,IMPASSE LA CANTRAIGNE,
413293689,00076,41329368900076,O,2020-11-16,,,,2021-02-23T11:35:37,true,1,,240,,RUE,DE LA VALLEE,62250,AUDEMBERT,,,62052,,,,,,,,,,,,,,,,,,,2020-11-16,A,,,,,01.49Z,NAFRev2,N,1.690705,50.859169,0.95,housenumber,240 Rue de la Vallée 62250 Audembert,62052_0065_00240,G,240 RUE DE LA VALLEE,
415074301,00011,41507430100011,O,1998-01-12,,,,,true,1,,145,,IMP,DE LA RONVILLE,62250,AUDEMBERT,,,62052,,,,,,,,,,,,,,,,,,,1998-01-12,F,,,,,93.0N,NAF1993,N,1.696173,50.857934,0.87,housenumber,145 Impasse de la Ronville 62250 Audembert,62052_0042_00145,G,145 IMPASSE DE LA RONVILLE,
420371999,00020,42037199900020,O,2008-01-17,,,,2021-02-23T11:41:25,true,1,,355,,IMP,DE LA RONVILLE,62250,AUDEMBERT,,,62052,,,,,,,,,,,,,,,,,,,2008-01-17,A,,,,,01.11Z,NAFRev2,N,1.698597,50.856751,0.87,housenumber,355 Impasse de la Ronville 62250 Audembert,62052_0042_00355,G,355 IMPASSE DE LA RONVILLE,
422896084,00023,42289608400023,O,2015-06-15,,,,2021-02-23T11:44:40,true,1,,3,,RUE,DE LA SARRE,62250,AUDEMBERT,,,62052,,,,,,,,,,,,,,,,,,,2015-06-15,A,,,,,68.20B,NAFRev2,N,1.693638,50.860348,0.95,housenumber,3 Rue de la Sarre 62250 Audembert,62052_0056_00003,G,3 RUE DE LA SARRE,
424364818,00015,42436481800015,O,1999-10-01,NN,,,2006-10-31T00:20:05,true,4,,56,,CHE,DU BREUIL,62250,AUDEMBERT,,,62052,,,,,,,,,,,,,,,,,,,2004-12-16,F,,,,,60.2L,NAFRev1,N,1.689194,50.860559,0.83,housenumber,56 Chemin du Breuil 62250 Audembert,62052_0005_00056,G,56 CHEMIN DU BREUIL,
430748681,00011,43074868100011,O,,NN,,,,true,1,,,,,LES TROIS CHEMINEES,62250,AUDEMBERT,,,62052,,,,,,,,,,,,,,,,,,,1988-10-01,F,,,,,01.3Z,NAF1993,N,5.9090238,46.3037719,0.85,poi.information,Les Trois Cheminée - 1230m (Informations) Bellecombe,https://osm.org/node/4963500221,G,,
431599539,00019,43159953900019,O,2000-05-26,,,,2011-05-03T00:42:08,false,3,,145,,IMP,DE LA RONVILLE,62250,AUDEMBERT,,,62052,,,,,,,,,,,,,,,,,,,2000-12-31,F,,,,,50.1Z,NAF1993,N,1.696173,50.857934,0.87,housenumber,145 Impasse de la Ronville 62250 Audembert,62052_0042_00145,G,145 IMPASSE DE LA RONVILLE,
435109319,00010,43510931900010,O,2001-02-09,NN,,,,false,3,,20,,RUE,DE LA MAIRIE,62250,AUDEMBERT,,,62052,,,,,,,,,,,,,,,,,,,2001-12-25,F,,,,,85.1G,NAF1993,N,1.691297,50.861169,0.94,housenumber,20 Rue de la Mairie 62250 Audembert,62052_0028_00020,G,20 RUE DE LA MAIRIE,
439362682,00056,43936268200056,O,2014-02-26,,,,2017-08-03T11:47:32,true,2,,104,,RUE,DE LA SARRE,62250,AUDEMBERT,,,62052,,,,,,,,,,,,,,,,,,,2015-01-23,F,,,,,70.22Z,NAFRev2,N,1.694343,50.859635,0.95,housenumber,104 Rue de la Sarre 62250 Audembert,62052_0056_00104,G,104 RUE DE LA SARRE,
440602928,00010,44060292800010,O,2001-12-01,NN,,,,false,4,,56,,CHE,DU BREUIL,62250,AUDEMBERT,,,62052,,,,,,,,,,,,,,,,,,,2002-03-18,F,,,,,71.1Z,NAF1993,N,1.689194,50.860559,0.83,housenumber,56 Chemin du Breuil 62250 Audembert,62052_0005_00056,G,56 CHEMIN DU BREUIL,
441480100,00037,44148010000037,O,2017-11-01,,,,2021-02-23T13:23:03,true,1,,,,PL,DU MARRONNIER,62250,AUDEMBERT,,,62052,,,,,,,,,,,,,,,,,,,2017-11-01,A,,,,,68.31Z,NAFRev2,N,1.692536,50.861194,0.83,street,Place du Marronnier 62250 Audembert,62052_0029,G,PLACE DU MARRONNIER,
443593587,00027,44359358700027,O,2004-05-03,,,,2006-11-25T18:07:07,false,3,,351,,IMP,DE LA RONVILLE,62250,AUDEMBERT,,,62052,,,,,,,,,,,,,,,,,,,2005-12-10,F,,,,,70.3A,NAFRev1,N,1.698613,50.856746,0.87,housenumber,351 Impasse de la Ronville 62250 Audembert,62052_0042_00351,G,351 IMPASSE DE LA RONVILLE,
443942362,00023,44394236200023,O,2002-09-01,NN,,,,false,4,MR DRUART NICOLAS,,,,WARCOVE LA FERME ROSE,62250,AUDEMBERT,,,62052,,,,,,,,,,,,,,,,,,,2003-09-15,F,,,,,17.2J,NAFRev1,O,,,0,,,,,,
448894261,00016,44889426100016,O,2000-07-01,NN,,,2023-01-21T03:46:39,true,4,,80,,IMP,DE LA ROUVILLE,62250,AUDEMBERT,,,62052,,,,,,,,,,,,,,,,,,,2022-12-31,F,,,,,55.20Z,NAFRev2,N,1.695565,50.858445,0.74,housenumber,80 Impasse de la Ronville 62250 Audembert,62052_0042_00080,G,80 IMPASSE DE LA RONVILLE,
449097914,00013,44909791400013,O,2003-06-23,NN,,,2008-01-04T23:38:08,true,3,,22,,HAM,DE WARCOVE,62250,AUDEMBERT,,,62052,,,,,,,,,,,,,,,,,,,2008-01-01,A,,,,,68.20A,NAFRev2,N,1.675249,50.857529,0.87,housenumber,22 Hameau de Warcove 62250 Audembert,62052_b070_00022,G,22 HAMEAU DE WARCOVE,
449734250,00011,44973425000011,O,2003-08-04,,,,2008-11-08T02:28:38,false,3,LIEUDIT NOIRBERNE,62,,RTE,DE WISSANT,62250,AUDEMBERT,,,62052,,,,,,,,,,,,,,,,,,,2005-07-29,F,ETABLISSEMENT LA SEIZE,,,,45.3F,NAFRev1,O,1.681767,50.843993,0.63,locality,Le Courtil de Wissant 62250 Audembert,62052_B022,G,LE COURTIL DE WISSANT,
449734250,00037,44973425000037,O,2009-07-01,00,2021,4322BB,2023-11-27T13:15:55,true,4,,301,,RTE,ROUTE DE WISSANT,62250,AUDEMBERT,,,62052,,,,,,,,,,,,,,,,,,,2021-06-28,F,SEIZE - INDUSTRIE,,,,43.22B,NAFRev2,O,1.681767,50.843993,0.45,locality,Le Courtil de Wissant 62250 Audembert,62052_B022,G,LE COURTIL DE WISSANT,
451277057,00019,45127705700019,O,2004-01-01,NN,,,2008-01-05T02:23:00,true,3,LE COLOMBIER,,,RTE,DE MARQUISE,62250,AUDEMBERT,,,62052,,,,,,,,,,,,,,,,,,,2008-01-01,A,,,,,85.59A,NAFRev2,N,1.670937,50.865183,0.7,street,Chemin de Marquise 62250 Audembert,62052_0026,G,CHEMIN DE MARQUISE,
452138068,00039,45213806800039,O,2008-07-01,,,,2009-03-13T09:58:44,true,2,,,,CHE,DU BEDAT,62250,AUDEMBERT,,,62052,,,,,,,,,,,,,,,,,,,2008-07-02,F,,,,,01.43Z,NAFRev2,N,1.680883,50.844267,0.79,street,Chemin du Bedat 62250 Audembert,62052_4az6ki,G,CHEMIN DU BEDAT,
483422440,00048,48342244000048,O,2021-03-01,,,,2022-11-21T11:51:35,true,3,,55,,IMP,DE LA TAILLETTE,62250,AUDEMBERT,,,62052,,,,,,,,,,,,,,,,,,,2022-04-08,F,,,,,62.01Z,NAFRev2,N,1.689677,50.860942,0.55,housenumber,55 Impasse des Tailettes 62250 Audembert,62052_9jsib2_00055,G,55 IMPASSE DES TAILETTES,
483866596,00016,48386659600016,O,2002-07-15,NN,,,2009-09-18T13:36:31,true,4,,195,,RTE,DE  WISSANT,62250,AUDEMBERT,,,62052,,,,,,,,,,,,,,,,,,,2009-08-31,F,,,,,55.20Z,NAFRev2,N,1.681767,50.843993,0.55,locality,Le Courtil de Wissant 62250 Audembert,62052_B022,G,LE COURTIL DE WISSANT,
489807537,00019,48980753700019,O,2006-05-09,,,,2015-01-18T03:59:24,true,6,,151,,RUE,DE LA SARRE,62250,AUDEMBERT,,,62052,,,,,,,,,,,,,,,,,,,2014-12-31,F,,,,,46.19B,NAFRev2,N,1.694669,50.859474,0.95,housenumber,151 Rue de la Sarre 62250 Audembert,62052_0056_00151,G,151 RUE DE LA SARRE,
490598281,00015,49059828100015,O,2006-07-03,,,4332AA,2022-09-08T12:32:17,true,4,,85,,RUE,DE LA NOIRE CHOQUE,62250,AUDEMBERT,,,62052,,,,,,,,,,,,,,,,,,,2022-03-01,A,,,,MARCOURT REGIS,43.32A,NAFRev2,N,1.696331,50.85966,0.95,housenumber,85 Rue de la Noire Choque 62250 Audembert,62052_0031_00085,G,85 RUE DE LA NOIRE CHOQUE,
492459920,00012,49245992000012,O,2006-10-01,,,,2008-01-05T04:19:59,true,2,,451,,RUE,LES GRARES,62250,AUDEMBERT,,,62052,,,,,,,,,,,,,,,,,,,2008-01-01,A,,,,,01.11Z,NAFRev2,N,1.687788,50.863983,0.95,housenumber,451 Rue les Grares 62250 Audembert,62052_0013_00451,G,451 RUE LES GRARES,
492918479,00022,49291847900022,O,2014-07-26,,,,2021-02-23T14:00:13,true,1,,90,,RUE,DE LA NOIRE CHOQUE,62250,AUDEMBERT,,,62052,,,,,,,,,,,,,,,,,,,2014-07-26,A,,,,,68.20B,NAFRev2,N,1.696325,50.859606,0.95,housenumber,90 Rue de la Noire Choque 62250 Audembert,62052_0031_00090,G,90 RUE DE LA NOIRE CHOQUE,
497664581,00012,49766458100012,O,2007-04-20,,,,2014-07-10T00:49:40,true,3,LIEUDIT NOIRBERNES,301,,RTE,DE WISSANT,62250,AUDEMBERT,,,62052,,,,,,,,,,,,,,,,,,,2008-11-30,F,TRIESTE INDUSTRIE,,,,33.20A,NAFRev2,N,1.681767,50.843993,0.55,locality,Le Courtil de Wissant 62250 Audembert,62052_B022,G,LE COURTIL DE WISSANT,
499321362,00018,49932136200018,O,2007-08-31,,,,2014-07-10T00:55:19,true,3,,59,,RUE,DE LA VALLEE,62250,AUDEMBERT,,,62052,,,,,,,,,,,,,,,,,,,2008-10-31,F,,,,,43.99C,NAFRev2,N,1.692687,50.860197,0.95,housenumber,59 Rue de la Vallée 62250 Audembert,62052_0065_00059,G,59 RUE DE LA VALLEE,
500559927,00016,50055992700016,O,2007-11-01,NN,,4399EZ,2018-09-29T12:01:48,false,4,,270,,RUE,DE LA BASSE VALLEE,62250,AUDEMBERT,,,62052,,,,,,,,,,,,,,,,,,,2016-01-01,F,,,,,77.32Z,NAFRev2,O,1.688915,50.85297,0.94,housenumber,270 Rue de la Basse Vallée 62250 Audembert,62052_0004_00270,G,270 RUE DE LA BASSE VALLEE,
500559927,00024,50055992700024,O,2016-01-01,03,2021,4399EZ,2023-11-27T13:12:19,true,1,,38,,RUE,DE LA BASSE VALLEE,62250,AUDEMBERT,,,62052,,,,,,,,,,,,,,,,,,,2016-01-01,A,,,,,77.32Z,NAFRev2,O,1.686617,50.854543,0.94,housenumber,38 Rue de la Basse Vallée 62250 Audembert,62052_0004_00038,G,38 RUE DE LA BASSE VALLEE,
500996079,00025,50099607900025,O,2013-12-04,,,,2016-04-01T05:01:09,true,2,,145,,IMP,DE LA RONVILLE,62250,AUDEMBERT,,,62052,,,,,,,,,,,,,,,,,,,2015-12-31,F,,,,,70.22Z,NAFRev2,N,1.696173,50.857934,0.87,housenumber,145 Impasse de la Ronville 62250 Audembert,62052_0042_00145,G,145 IMPASSE DE LA RONVILLE,
502918386,00017,50291838600017,O,2008-04-01,,,,2014-07-10T01:13:08,true,2,,301,,RTE,DE WARCOVE,62250,AUDEMBERT,,,62052,,,,,,,,,,,,,,,,,,,2008-10-26,F,,,,,96.02B,NAFRev2,N,1.671683,50.855904,0.84,housenumber,301 Route de Warcove 62250 Audembert,62052_0063_00301,G,301 ROUTE DE WARCOVE,
503110140,00012,50311014000012,O,2008-03-01,NN,,,2018-09-29T12:08:57,false,3,,270,,RUE,DE LA BASSE VALLEE,62250,AUDEMBERT,,,62052,,,,,,,,,,,,,,,,,,,2016-01-01,F,,,,,49.41B,NAFRev2,O,1.688915,50.85297,0.94,housenumber,270 Rue de la Basse Vallée 62250 Audembert,62052_0004_00270,G,270 RUE DE LA BASSE VALLEE,
503110140,00020,50311014000020,O,2016-01-01,02,2021,,2023-11-27T13:17:50,true,1,,38,,RUE,DE LA BASSE VALLEE,62250,AUDEMBERT,,,62052,,,,,,,,,,,,,,,,,,,2016-01-01,A,,,,,49.41B,NAFRev2,O,1.686617,50.854543,0.94,housenumber,38 Rue de la Basse Vallée 62250 Audembert,62052_0004_00038,G,38 RUE DE LA BASSE VALLEE,
508562162,00018,50856216200018,O,2008-10-01,01,2021,,2023-11-27T13:24:49,true,1,,850,,RUE,DE LA VALLEE,62250,AUDEMBERT,,,62052,,,,,,,,,,,,,,,,,,,2008-10-01,A,,,,,01.50Z,NAFRev2,N,1.686677,50.854712,0.95,housenumber,850 Rue de la Vallée 62250 Audembert,62052_0065_00850,G,850 RUE DE LA VALLEE,
515044691,00019,51504469100019,O,2009-10-02,,,,2013-01-02T15:43:21,true,2,,90,,RUE,DE LA NOIRE CHOQUE,62250,AUDEMBERT,,,62052,,,,,,,,,,,,,,,,,,,2012-12-31,F,,,,,46.19B,NAFRev2,N,1.696325,50.859606,0.95,housenumber,90 Rue de la Noire Choque 62250 Audembert,62052_0031_00090,G,90 RUE DE LA NOIRE CHOQUE,
519644918,00012,51964491800012,O,2010-02-01,,,,2011-02-17T08:50:04,false,2,,104,,RUE,DE LA SARRE,62250,AUDEMBERT,,,62052,,,,,,,,,,,,,,,,,,,2011-01-01,F,,,,,47.19B,NAFRev2,N,1.694343,50.859635,0.95,housenumber,104 Rue de la Sarre 62250 Audembert,62052_0056_00104,G,104 RUE DE LA SARRE,
525094777,00022,52509477700022,O,2019-02-01,,,7420ZR,2023-06-04T20:10:49,true,1,,230,,,NOIRBERNES,62250,AUDEMBERT,,,62052,,,,,,,,,,,,,,,,,,,2019-02-01,A,,,,,74.20Z,NAFRev2,O,1.680715,50.844427,0.95,housenumber,230 Noirbernes 62250 Audembert,62052_nyhb6o_00230,G,230 NOIRBERNES,
530798057,00028,53079805700028,O,2013-06-01,,,,2021-02-23T15:49:25,true,1,,312,,RTE,DE WARCOVE,62250,AUDEMBERT,,,62052,,,,,,,,,,,,,,,,,,,2013-06-01,A,,,,,46.19B,NAFRev2,O,1.671081,50.856216,0.84,housenumber,312 Route de Warcove 62250 Audembert,62052_0063_00312,G,312 ROUTE DE WARCOVE,
532227279,00017,53222727900017,O,2011-06-03,01,2021,,2023-11-27T13:57:55,true,2,,140,,,NOIRBERNES,62250,AUDEMBERT,,,62052,,,,,,,,,,,,,,,,,,,2015-07-04,A,,,,,68.20B,NAFRev2,O,1.680159,50.84501,0.95,housenumber,140 Noirbernes 62250 Audembert,62052_nyhb6o_00140,G,140 NOIRBERNES,
532842739,00015,53284273900015,O,2001-07-16,,,,2017-06-21T11:33:43,true,2,,20,,RUE,DE LA MAIRIE,62250,AUDEMBERT,,,62052,,,,,,,,,,,,,,,,,,,2017-06-12,F,,,,,55.20Z,NAFRev2,N,1.691297,50.861169,0.94,housenumber,20 Rue de la Mairie 62250 Audembert,62052_0028_00020,G,20 RUE DE LA MAIRIE,
537668808,00034,53766880800034,O,2022-07-19,,,,2022-09-14T08:50:38,true,2,,11,,PL,DU MARRONNIER,62250,AUDEMBERT,,,62052,,,,,,,,,,,,,,,,,,,2022-09-01,A,,,,,66.30Z,NAFRev2,O,1.692138,50.861337,0.85,housenumber,11 Place du Marronnier 62250 Audembert,62052_0029_00011,G,11 PLACE DU MARRONNIER,
538463811,00017,53846381100017,O,2011-12-10,,,4781ZV,2015-03-18T00:41:26,true,2,,16,,IMP,DE LA RONVILLE,62250,AUDEMBERT,,,62052,,,,,,,,,,,,,,,,,,,2013-08-31,F,L'ETAL DU MOUSSAILLON,,,,47.81Z,NAFRev2,N,1.69522,50.858947,0.86,housenumber,16 Impasse de la Ronville 62250 Audembert,62052_0042_00016,G,16 IMPASSE DE LA RONVILLE,
539883058,00015,53988305800015,O,2001-05-01,,,,2012-02-14T08:21:28,true,1,,301,,RUE,DE LA VALLEE,62250,AUDEMBERT,,,62052,,,,,,,,,,,,,,,,,,,2001-05-01,A,,,,,55.20Z,NAFRev2,N,1.690463,50.85862,0.95,housenumber,301 Rue de la Vallée 62250 Audembert,62052_0065_00301,G,301 RUE DE LA VALLEE,
551750367,00015,55175036700015,O,,NN,,,,true,1,,,,,,62250,AUDEMBERT,,,62052,,,,,,,,,,,,,,,,,,,1989-07-17,F,,,,,81.21,NAP,N,,,0,,,,,,
572025526,04427,57202552604427,O,2000-12-25,NN,,,2008-01-05T02:29:43,false,2,,,,CHE,DE LA RONVILLE,62250,AUDEMBERT,,,62052,,,,,,,,,,,,,,,,,,,2008-01-01,A,,,,,36.00Z,NAFRev2,N,1.697638,50.857583,0.79,street,Impasse de la Ronville 62250 Audembert,62052_0042,G,IMPASSE DE LA RONVILLE,
651743296,00014,65174329600014,O,,,,,,true,1,,,,,,62250,AUDEMBERT,,,62052,,,,,,,,,,,,,,,,,,,1990-06-30,F,,,,,55.71,NAP,N,,,0,,,,,,
661740191,00019,66174019100019,O,,,,,,true,1,,,,RUE,DE LA VALLEE,62250,AUDEMBERT,,,62052,,,,,,,,,,,,,,,,,,,1984-12-25,F,,,,,00.98,NAP,N,1.690463,50.85862,0.95,street,Rue de la Vallée 62250 Audembert,62052_0065,G,RUE DE LA VALLEE,
661741694,00011,66174169400011,O,,,,,,true,1,,,,,,62250,AUDEMBERT,,,62052,,,,,,,,,,,,,,,,,,,1984-12-25,F,,,,,67.05,NAP,N,,,0,,,,,,