siren,nic,siret,statutDiffusionEtablissement,dateCreationEtablissement,trancheEffectifsEtablissement,anneeEffectifsEtablissement,activitePrincipaleRegistreMetiersEtablissement,dateDernierTraitementEtablissement,etablissementSiege,nombrePeriodesEtablissement,complementAdresseEtablissement,numeroVoieEtablissement,indiceRepetitionEtablissement,typeVoieEtablissement,libelleVoieEtablissement,codePostalEtablissement,libelleCommuneEtablissement,libelleCommuneEtrangerEtablissement,distributionSpecialeEtablissement,codeCommuneEtablissement,codeCedexEtablissement,libelleCedexEtablissement,codePaysEtrangerEtablissement,libellePaysEtrangerEtablissement,complementAdresse2Etablissement,numeroVoie2Etablissement,indiceRepetition2Etablissement,typeVoie2Etablissement,libelleVoie2Etablissement,codePostal2Etablissement,libelleCommune2Etablissement,libelleCommuneEtranger2Etablissement,distributionSpeciale2Etablissement,codeCommune2Etablissement,codeCedex2Etablissement,libelleCedex2Etablissement,codePaysEtranger2Etablissement,libellePaysEtranger2Etablissement,dateDebut,etatAdministratifEtablissement,enseigne1Etablissement,enseigne2Etablissement,enseigne3Etablissement,denominationUsuelleEtablissement,activitePrincipaleEtablissement,nomenclatureActivitePrincipaleEtablissement,caractereEmployeurEtablissement,longitude,latitude,geo_score,geo_type,geo_adresse,geo_id,geo_ligne,geo_l4,geo_l5
216208637,00019,21620863700019,O,1983-03-01,21,2021,,2023-11-27T13:23:52,true,4,,,,,GRAND PLACE,62138,VIOLAINES,,,62863,,,,,,,,,,,,,,,,,,,2008-01-01,A,MAIRIE,,,,84.11Z,NAFRev2,O,2.788424,50.539747,0.94,street,Rue de la Grand’Place 62138 Violaines,62863_0580,G,RUE DE LA GRAND PLACE,
216208637,00035,21620863700035,O,1983-12-21,11,2021,,2023-11-27T13:23:52,false,5,,42,,,GRAND PLACE,62138,VIOLAINES,,,62863,,,,,,,,,,,,,,,,,,,2020-12-25,A,ECOLE ELEMENTAIRE EUSTACHE VARET,,,,85.20Z,NAFRev2,N,2.78748,50.540009,0.88,housenumber,42 Rue de la Grand’Place 62138 Violaines,62863_0580_00042,G,42 RUE DE LA GRAND PLACE,
216208637,00043,21620863700043,O,1983-12-21,NN,,,,false,4,,40,,,GRAND PLACE,62138,VIOLAINES,,,62863,,,,,,,,,,,,,,,,,,,1997-12-31,F,ECOLE PRIMAIRE CENTRE EX FILLES,,,,80.1Z,NAF1993,N,2.787667,50.540097,0.88,housenumber,40 Rue de la Grand’Place 62138 Violaines,62863_0580_00040,G,40 RUE DE LA GRAND PLACE,
216208637,00050,21620863700050,O,1983-12-21,03,2021,,2023-11-27T13:23:52,false,3,,,,RUE,DES PINS,62138,VIOLAINES,,,62863,,,,,,,,,,,,,,,,,,,2008-01-01,A,ECOLE MATERNELLE LES ROSES,,,,85.10Z,NAFRev2,N,2.786492,50.540595,0.96,street,Rue des Pins 62138 Violaines,62863_0565,G,RUE DES PINS,
216208637,00068,21620863700068,O,1983-12-21,NN,,,,false,4,,13,,RUE,DU MONT SORET,62138,VIOLAINES,,,62863,,,,,,,,,,,,,,,,,,,1998-09-01,F,ECOLE PRIMAIRE DU MONT SORET,,,,80.1Z,NAF1993,N,2.796175,50.543651,0.96,housenumber,13 Rue du Mont Soret 62138 Violaines,62863_0490_00013,G,13 RUE DU MONT SORET,
216208637,00084,21620863700084,O,1995-12-25,NN,,,2019-05-17T11:34:32,false,3,MAIRIE,,,,GRAND'PLACE,62138,VIOLAINES,,,62863,,,,,,,,,,,,,,,,,,,2018-12-31,F,CENTRE COMMERCIAL,,,,68.32A,NAFRev2,N,2.788424,50.539747,0.94,street,Rue de la Grand’Place 62138 Violaines,62863_0580,G,RUE DE LA GRAND PLACE,
216208637,00092,21620863700092,O,1995-12-25,NN,,,2008-01-04T18:38:42,false,3,MAIRIE,,,,GRAND'PLACE,62138,VIOLAINES,,,62863,,,,,,,,,,,,,,,,,,,2008-01-01,A,SALLE DES FETES,,,,90.04Z,NAFRev2,N,2.788424,50.539747,0.94,street,Rue de la Grand’Place 62138 Violaines,62863_0580,G,RUE DE LA GRAND PLACE,
216208637,00100,21620863700100,O,1995-12-25,NN,,,2008-01-04T18:38:42,false,2,MAIRIE,,,,GRAND PLACE,62138,VIOLAINES,,,62863,,,,,,,,,,,,,,,,,,,2008-01-01,A,SERVICE D'ASSAINISSEMENT,,,,37.00Z,NAFRev2,N,2.788424,50.539747,0.94,street,Rue de la Grand’Place 62138 Violaines,62863_0580,G,RUE DE LA GRAND PLACE,
216208637,00118,21620863700118,O,1995-12-25,NN,,,2008-01-04T18:38:42,false,2,MAIRIE,,,,GRAND'PLACE,62138,VIOLAINES,,,62863,,,,,,,,,,,,,,,,,,,2008-01-01,A,CAMPING,,,,55.30Z,NAFRev2,N,2.788424,50.539747,0.94,street,Rue de la Grand’Place 62138 Violaines,62863_0580,G,RUE DE LA GRAND PLACE,
216208637,00126,21620863700126,O,1995-12-25,NN,,,2008-01-04T18:38:42,false,2,MAIRIE,,,,GRAND PLACE,62138,VIOLAINES,,,62863,,,,,,,,,,,,,,,,,,,2008-01-01,A,LOTISSEMENT INDUSTRIEL,,,,42.99Z,NAFRev2,N,2.788424,50.539747,0.94,street,Rue de la Grand’Place 62138 Violaines,62863_0580,G,RUE DE LA GRAND PLACE,
216208637,00134,21620863700134,O,1999-09-19,NN,,,2010-04-12T13:43:37,false,4,MAIRIE,,,,GRAND'PLACE,62138,VIOLAINES,,,62863,,,,,,,,,,,,,,,,,,,2009-12-31,F,LOTISSEMENT D'HABITATION,,,,42.99Z,NAFRev2,N,2.788424,50.539747,0.94,street,Rue de la Grand’Place 62138 Violaines,62863_0580,G,RUE DE LA GRAND PLACE,
256201948,00013,25620194800013,O,1983-03-01,NN,,,2021-10-27T08:12:20,true,5,,57,,RUE,D'OUVERT,62138,VIOLAINES,,,62863,,,,,,,,,,,,,,,,,,,2020-01-22,F,,,,,36.00Z,NAFRev2,O,2.76843,50.535754,0.96,housenumber,57 Rue d’Ouvert 62138 Violaines,62863_0520_00057,G,57 RUE D OUVERT,
266208636,00016,26620863600016,O,1983-03-01,NN,,,2008-04-26T08:31:15,true,4,MAIRIE,,,,GRAND PLACE,62138,VIOLAINES,,,62863,,,,,,,,,,,,,,,,,,,2008-01-01,A,,,,,88.99B,NAFRev2,N,2.788424,50.539747,0.94,street,Rue de la Grand’Place 62138 Violaines,62863_0580,G,RUE DE LA GRAND PLACE,
276201993,00017,27620199300017,O,,NN,,,,true,1,,,,,GRAND PLACE,62138,VIOLAINES,,,62863,,,,,,,,,,,,,,,,,,,1995-12-25,F,,,,,90.0A,NAF1993,N,2.788424,50.539747,0.94,street,Rue de la Grand’Place 62138 Violaines,62863_0580,G,RUE DE LA GRAND PLACE,
276202132,00011,27620213200011,O,,NN,,,,true,1,,,,,GRAND PLACE,62138,VIOLAINES,,,62863,,,,,,,,,,,,,,,,,,,1995-12-25,F,,,,,70.3D,NAF1993,N,2.788424,50.539747,0.94,street,Rue de la Grand’Place 62138 Violaines,62863_0580,G,RUE DE LA GRAND PLACE,
276202140,00014,27620214000014,O,,NN,,,,true,1,,,,,GRAND PLACE,62138,VIOLAINES,,,62863,,,,,,,,,,,,,,,,,,,1995-12-25,F,,,,,92.6A,NAF1993,N,2.788424,50.539747,0.94,street,Rue de la Grand’Place 62138 Violaines,62863_0580,G,RUE DE LA GRAND PLACE,
276202298,00010,27620229800010,O,,NN,,,,true,1,,,,,GRAND PLACE,62138,VIOLAINES,,,62863,,,,,,,,,,,,,,,,,,,1995-12-25,F,,,,,70.3D,NAF1993,N,2.788424,50.539747,0.94,street,Rue de la Grand’Place 62138 Violaines,62863_0580,G,RUE DE LA GRAND PLACE,
296204274,00017,29620427400017,O,1989-10-19,NN,,,2008-01-04T19:07:26,true,4,MAIRIE,,,,GRAND PLACE,62138,VIOLAINES,,,62863,,,,,,,,,,,,,,,,,,,2008-01-01,A,,,,,42.99Z,NAFRev2,N,2.788424,50.539747,0.94,street,Rue de la Grand’Place 62138 Violaines,62863_0580,G,RUE DE LA GRAND PLACE,
300346806,00049,30034680600049,O,,,,,,true,1,,14,,RUE,JEAN JAURES,62138,VIOLAINES,,,62863,,,,,,,,,,,,,,,,,,,1997-02-19,F,,,,,45.3E,NAF1993,N,2.789796,50.542339,0.96,housenumber,14 Rue Jean Jaurés 62138 Violaines,62863_0410_00014,G,14 RUE JEAN JAURES,
300672003,00013,30067200300013,O,,,,,,true,1,,,,RTE,NATIONALE,62138,VIOLAINES,,,62863,,,,,,,,,,,,,,,,,,,1984-12-25,F,,,,,,,N,2.779333,50.517929,0.83,street,Route Nationale 62138 Violaines,62863_0500,G,ROUTE NATIONALE,
300716255,00041,30071625500041,O,1993-01-01,,,,2008-11-07T00:16:54,false,3,,14,,RUE,JEAN JAURES,62138,VIOLAINES,,,62863,,,,,,,,,,,,,,,,,,,1997-02-19,F,,,,,45.3E,NAF1993,N,2.789796,50.542339,0.96,housenumber,14 Rue Jean Jaurés 62138 Violaines,62863_0410_00014,G,14 RUE JEAN JAURES,
300847373,00028,30084737300028,O,2012-08-31,,,,2023-05-16T03:44:58,true,3,,2,B,RUE,DU TRAIN DE LOOS,62138,VIOLAINES,,,62863,,,,,,,,,,,,,,,,,,,2022-12-31,F,,,,,47.76Z,NAFRev2,O,2.800321,50.534409,0.96,housenumber,2b Rue du Train de Loos 62138 Violaines,62863_0793_00002_b,G,2B RUE DU TRAIN DE LOOS,
301564100,00016,30156410000016,O,,,,,,true,1,,2,,RUE,DE L'EGLISE,62138,VIOLAINES,,,62863,,,,,,,,,,,,,,,,,,,1984-12-25,F,,,,,00.10,NAP,N,2.787139,50.539043,0.95,housenumber,2 Rue de l’Eglise 62138 Violaines,62863_0260_00002,G,2 RUE DE L EGLISE,
301809323,00019,30180932300019,O,,NN,,,,true,1,,17,,RTE,D ESTAIRES,62138,VIOLAINES,,,62863,,,,,,,,,,,,,,,,,,,1985-12-25,F,,,,,57.05,NAP,N,2.8017,50.5354,0.86,housenumber,17 Route d’Estaires 62138 Violaines,62863_0200_00017,G,17 ROUTE D ESTAIRES,
302483508,00016,30248350800016,O,1974-01-01,NN,,,,true,1,,142,,RUE,DU RETUY,62138,VIOLAINES,,,62863,,,,,,,,,,,,,,,,,,,1999-01-31,F,,,,,52.3A,NAF1993,O,2.788342,50.543778,0.96,housenumber,142 Rue du Retuy 62138 Violaines,62863_0740_00142,G,142 RUE DU RETUY,
302902168,00038,30290216800038,O,,NN,,,,true,1,,,,RUE,PAUL GAUGUIN,62138,VIOLAINES,,,62863,,,,,,,,,,,,,,,,,,,1990-10-30,F,,,,,21.08,NAP,N,2.774431,50.517808,0.95,street,Rue Paul Gauguin 62138 Violaines,62863_0555,G,RUE PAUL GAUGUIN,
303342927,00025,30334292700025,O,1996-10-01,NN,,,2006-11-25T09:15:51,false,3,,14,,RTE,DE CANTELEUX,62138,VIOLAINES,,,62863,,,,,,,,,,,,,,,,,,,2006-01-25,F,,,,,74.1J,NAFRev1,N,2.784437,50.529241,0.74,housenumber,14 Rue de Canteleu 62138 Violaines,62863_0040_00014,G,14 RUE DE CANTELEU,
303342927,00033,30334292700033,O,2006-01-25,,,,2014-07-08T00:11:58,true,3,,14,,RUE,DE CANTELEU,62138,VIOLAINES,,,62863,,,,,,,,,,,,,,,,,,,2010-04-04,F,,,,,43.91B,NAFRev2,N,2.784437,50.529241,0.96,housenumber,14 Rue de Canteleu 62138 Violaines,62863_0040_00014,G,14 RUE DE CANTELEU,
303467716,00013,30346771600013,O,,,,,,true,1,,14,T,RUE,DE CANTELEU,62138,VIOLAINES,,,62863,,,,,,,,,,,,,,,,,,,1984-12-25,F,,,,,60.04,NAP,N,2.793585,50.528553,0.96,interpolation,14 Rue de Canteleu 62138 Violaines,,G,12 RUE DE CANTELEU,
303840086,00035,30384008600035,O,2000-02-01,NN,,,2011-03-10T15:16:45,true,4,,14,,RUE,DELACROIX,62138,VIOLAINES,,,62863,,,,,,,,,,,,,,,,,,,2010-12-24,F,,,,,46.18Z,NAFRev2,N,2.781064,50.518462,0.94,housenumber,14 Rue Eugène Delacroix 62138 Violaines,62863_0290_00014,G,14 RUE EUGENE DELACROIX,
303927545,00036,30392754500036,O,1900-01-01,NN,,,,false,3,,150,,RUE,DE RETUY,62138,VIOLAINES,,,62863,,,,,,,,,,,,,,,,,,,1996-10-01,F,,,,,85.1G,NAF1993,,2.788065,50.543845,0.8,housenumber,150 Rue du Retuy 62138 Violaines,62863_0740_00150,G,150 RUE DU RETUY,
303927545,00051,30392754500051,O,1996-10-01,NN,,,2014-06-14T00:00:35,true,4,,47,,RUE,DE LA PETITE PLACE,62138,VIOLAINES,,,62863,,,,,,,,,,,,,,,,,,,2012-12-31,F,,,,,86.90E,NAFRev2,N,2.787693,50.544029,0.96,housenumber,47 Rue de la Petite Place 62138 Violaines,62863_0600_00047,G,47 RUE DE LA PETITE PLACE,
304572449,00037,30457244900037,O,1989-04-01,NN,,,2017-01-10T05:40:19,true,4,,18,,RTE,NATIONALE,62138,VIOLAINES,,,62863,,,,,,,,,,,,,,,,,,,2016-12-31,F,,,,,47.71Z,NAFRev2,N,2.780574,50.517709,0.85,housenumber,18 Route Nationale 62138 Violaines,62863_0500_00018,G,18 ROUTE NATIONALE,
305242364,00027,30524236400027,O,1900-01-01,,,,2021-10-22T03:42:32,true,4,173-175-VIOLAINES,171,,RTE,D ESTAIRES,62138,VIOLAINES,,,62863,,,,,,,,,,,,,,,,,,,2008-01-01,A,,,,,16.24Z,NAFRev2,N,2.800974,50.538824,0.87,housenumber,171 Route d’Estaires 62138 Violaines,62863_0200_00171,G,171 ROUTE D ESTAIRES,
305242364,00035,30524236400035,O,1979-10-01,NN,,,2008-01-04T19:35:00,false,3,,,,RTE,D'ESTAIRES,62138,VIOLAINES,,,62863,,,,,,,,,,,,,,,,,,,2008-01-01,A,,,,,46.21Z,NAFRev2,N,2.801199,50.537662,0.84,street,Route d’Estaires 62138 Violaines,62863_0200,G,ROUTE D ESTAIRES,
306575911,00012,30657591100012,O,1976-01-01,NN,,,,true,1,,53,,RUE,DU MARAIS,62138,VIOLAINES,,,62863,,,,,,,,,,,,,,,,,,,1999-04-30,F,,,,,45.4C,NAF1993,N,2.774034,50.548514,0.96,housenumber,53 Rue du Marais 62138 Violaines,62863_0480_00053,G,53 RUE DU MARAIS,
307357244,00051,30735724400051,O,2008-08-20,,,,2014-07-08T00:13:48,false,2,,19,A,RUE,CANTELEU,62138,VIOLAINES,,,62863,,,,,,,,,,,,,,,,,,,2008-10-01,F,EUROBAT,,,,43.99C,NAFRev2,N,2.784009,50.529127,0.95,housenumber,19a Rue de Canteleu 62138 Violaines,62863_0040_00019_a,G,19A RUE DE CANTELEU,
309110047,00037,30911004700037,O,,NN,,,,true,1,,16,,RUE,DE LA PLANQUETTE,62138,VIOLAINES,,,62863,,,,,,,,,,,,,,,,,,,1987-12-10,F,,,,,55.60,NAP,N,2.800711,50.534572,0.96,housenumber,16 Rue de la Planquette 62138 Violaines,62863_0640_00016,G,16 RUE DE LA PLANQUETTE,
310065958,00046,31006595800046,O,2003-12-16,NN,,,2006-11-25T09:25:42,true,3,,1,,RUE,PAUL GAUGUIN,62138,VIOLAINES,,,62863,,,,,,,,,,,,,,,,,,,2005-09-30,F,,,,,50.3A,NAFRev1,N,2.776262,50.518551,0.95,housenumber,1 Rue Paul Gauguin 62138 Violaines,62863_0555_00001,G,1 RUE PAUL GAUGUIN,
310992326,00010,31099232600010,O,,NN,,,,true,1,,56,,RUE,DE LA PETITE PLACE,62138,VIOLAINES,,,62863,,,,,,,,,,,,,,,,,,,1996-09-30,F,,,,,15.8C,NAF1993,N,2.786724,50.545262,0.96,housenumber,56 Rue de la Petite Place 62138 Violaines,62863_0600_00056,G,56 RUE DE LA PETITE PLACE,
311525208,00048,31152520800048,O,2002-06-01,NN,,,,false,4,,47,,RUE,DE LA PETITE PLACE,62138,VIOLAINES,,,62863,,,,,,,,,,,,,,,,,,,2003-02-02,F,,,,,85.1G,NAFRev1,N,2.787693,50.544029,0.96,housenumber,47 Rue de la Petite Place 62138 Violaines,62863_0600_00047,G,47 RUE DE LA PETITE PLACE,
311868129,00017,31186812900017,O,1978-01-01,03,2021,,2023-11-27T13:33:48,true,5,,24,,RUE,DE L ETANG,62138,VIOLAINES,,,62863,,,,,,,,,,,,,,,,,,,2008-01-01,A,,,,,43.13Z,NAFRev2,O,2.768289,50.548906,0.95,housenumber,24 Rue de l’Etang 62138 Violaines,62863_0281_00024,G,24 RUE DE L ETANG,
311992911,00066,31199291100066,O,1995-06-01,NN,,,2006-12-15T00:17:34,false,2,,40,,RUE,EUSTACHE VARET,62138,VIOLAINES,,,62863,,,,,,,,,,,,,,,,,,,1995-07-31,F,,,,,,,,2.788184,50.542159,0.96,housenumber,40 Rue Eustache Varet 62138 Violaines,62863_0220_00040,G,40 RUE EUSTACHE VARET,
312248453,00028,31224845300028,O,1996-07-27,NN,,,2008-11-07T05:57:11,true,4,ZAC DU RETUY,,,RUE,DU 8 MAI,62138,VIOLAINES,,,62863,,,,,,,,,,,,,,,,,,,2002-02-22,F,,,,,45.1D,NAF1993,O,2.79802,50.539971,0.94,street,Rue du 8 Mai 62138 Violaines,62863_i970l5,G,RUE DU 8 MAI,
312410715,00014,31241071500014,O,,NN,,,,true,1,,159,,RTE,D ESTAIRES,62138,VIOLAINES,,,62863,,,,,,,,,,,,,,,,,,,,F,,,,,57.03,NAP,N,2.79293,50.551109,0.87,housenumber,159 Route d’Estaires 62138 Violaines,62863_0200_00159,G,159 ROUTE D ESTAIRES,
313486532,00028,31348653200028,O,1992-01-01,NN,,,2006-10-27T00:38:41,true,3,,28,B,RUE,CANTELEU,62138,VIOLAINES,,,62863,,,,,,,,,,,,,,,,,,,2004-12-30,F,,,,,01.1A,NAFRev1,N,2.782823,50.529549,0.85,housenumber,28bis Rue de Canteleu 62138 Violaines,62863_0040_00028_bis,G,28BIS RUE DE CANTELEU,
313939647,00043,31393964700043,O,2006-07-12,NN,,2825ZA,2018-10-25T19:38:05,true,7,,35,B,RUE,DE LA PLANQUETTE,62138,VIOLAINES,,,62863,,,,,,,,,,,,,,,,,,,2018-06-30,F,,,,,33.12Z,NAFRev2,N,2.795921,50.536575,0.96,housenumber,35b Rue de la Planquette 62138 Violaines,62863_0640_00035_b,G,35B RUE DE LA PLANQUETTE,
314074360,00038,31407436000038,O,1987-11-01,NN,,,2006-10-27T00:40:50,false,3,,59,,RUE,RETUY,62138,VIOLAINES,,,62863,,,,,,,,,,,,,,,,,,,2005-01-01,F,,,,,85.1G,NAFRev1,N,2.791331,50.54244,0.89,housenumber,59 Rue du Retuy 62138 Violaines,62863_0740_00059,G,59 RUE DU RETUY,
314074360,00046,31407436000046,O,2005-01-01,,,,2011-11-09T11:47:24,true,3,,72,,RUE,DU RETUY,62138,VIOLAINES,,,62863,,,,,,,,,,,,,,,,,,,2011-10-01,F,,,,,86.90D,NAFRev2,N,2.793225,50.541716,0.96,housenumber,72 Rue du Retuy 62138 Violaines,62863_0740_00072,G,72 RUE DU RETUY,
314250622,00011,31425062200011,O,,,,,,true,1,,,,RUE,DE CANTELEU,62138,VIOLAINES,,,62863,,,,,,,,,,,,,,,,,,,2003-01-04,F,,,,,01.3Z,NAFRev1,N,2.791205,50.528346,0.96,street,Rue de Canteleu 62138 Violaines,62863_0040,G,RUE DE CANTELEU,
314821265,00050,31482126500050,O,2022-09-01,,,,2022-12-17T02:23:52,true,1,,167,,RTE,D'ESTAIRES,62138,VIOLAINES,,,62863,,,,,,,,,,,,,,,,,,,2022-09-01,A,,,,,01.11Z,NAFRev2,O,2.784402,50.562977,0.87,housenumber,167 Route d’Estaires 62138 Violaines,62863_0200_00167,G,167 ROUTE D ESTAIRES,
315050724,00014,31505072400014,O,,,,,,true,1,,25,,RUE,WENDHOFEN,62138,VIOLAINES,,,62863,,,,,,,,,,,,,,,,,,,1984-12-25,F,,,,,55.71,NAP,N,2.783919,50.544497,0.79,housenumber,25 Rue de Wandhofen 62138 Violaines,62863_0818_00025,G,25 RUE DE WANDHOFEN,
315857839,00015,31585783900015,O,,,,,,true,1,,,,RUE,DE LA GRAND PLACE,62138,VIOLAINES,,,62863,,,,,,,,,,,,,,,,,,,,F,,,,,69.12,NAP,N,2.788424,50.539747,0.96,street,Rue de la Grand’Place 62138 Violaines,62863_0580,G,RUE DE LA GRAND PLACE,
316538123,00019,31653812300019,O,1979-01-01,NN,,,2014-09-17T04:22:37,true,3,,14,B,RUE,DE CANTELEU,62138,VIOLAINES,,,62863,,,,,,,,,,,,,,,,,,,2008-01-01,A,,,,,68.20B,NAFRev2,N,2.794836,50.528455,0.96,housenumber,14b Rue de Canteleu 62138 Violaines,62863_0040_00014_b,G,14B RUE DE CANTELEU,
316577956,00014,31657795600014,O,1900-01-01,,,,2019-11-15T10:16:40,false,4,,74,,CHE,DE RETUY,62138,VIOLAINES,,,62863,,,,,,,,,,,,,,,,,,,1988-12-25,F,,,,,81.21,NAP,N,2.792947,50.541885,0.56,housenumber,74 Rue du Retuy 62138 Violaines,62863_0740_00074,G,74 RUE DU RETUY,
316855832,00010,31685583200010,O,,NN,,,,true,1,,44,,RUE,EUSTACHE VARET,62138,VIOLAINES,,,62863,,,,,,,,,,,,,,,,,,,,F,,,,,55.71,NAP,N,2.788188,50.542441,0.96,housenumber,44 Rue Eustache Varet 62138 Violaines,62863_0220_00044,G,44 RUE EUSTACHE VARET,
317266450,00020,31726645000020,O,,NN,,,,true,1,,41,,RUE,JEAN JAURES,62138,VIOLAINES,,,62863,,,,,,,,,,,,,,,,,,,1987-12-31,F,,,,,55.60,NAP,N,2.788309,50.542265,0.96,housenumber,41 Rue Jean Jaurés 62138 Violaines,62863_0410_00041,G,41 RUE JEAN JAURES,
317356848,00026,31735684800026,O,2003-07-31,NN,,,2021-02-11T19:34:44,true,4,,19,B,RUE,DE CANTELEU,62138,VIOLAINES,,,62863,,,,,,,,,,,,,,,,,,,2020-06-30,F,,,,,68.20B,NAFRev2,N,2.79596,50.528216,0.96,housenumber,19b Rue de Canteleu 62138 Violaines,62863_0040_00019_b,G,19B RUE DE CANTELEU,
318806338,00030,31880633800030,O,,NN,,,,true,1,,,,RTE,D'ESTAIRES,62138,VIOLAINES,,,62863,,,,,,,,,,,,,,,,,,,1996-12-31,F,,,,,52.3E,NAF1993,N,2.801199,50.537662,0.84,street,Route d’Estaires 62138 Violaines,62863_0200,G,ROUTE D ESTAIRES,
318955143,00025,31895514300025,O,,,,,,true,1,,9,,RUE,E VARET,62138,VIOLAINES,,,62863,,,,,,,,,,,,,,,,,,,1984-12-25,F,,,,,84.10,NAP,N,2.787954,50.540853,0.88,housenumber,9 Rue Eustache Varet 62138 Violaines,62863_0220_00009,G,9 RUE EUSTACHE VARET,
318955150,00012,31895515000012,O,1900-01-01,NN,,,2012-11-09T00:19:02,true,5,,153,,RUE,D ESTAIRES,62138,VIOLAINES,,,62863,,,,,,,,,,,,,,,,,,,2009-10-01,A,,,,,47.99B,NAFRev2,N,2.800465,50.54044,0.96,housenumber,153 Rue d’Estaires 62138 Violaines,62863_qduylc_00153,G,153 RUE D ESTAIRES,
319039855,00014,31903985500014,O,,NN,,,,true,1,,1,,RTE,D ESTAIRES,62138,VIOLAINES,,,62863,,,,,,,,,,,,,,,,,,,,F,,,,,67.04,NAP,N,2.801835,50.53476,0.86,housenumber,1 Route d’Estaires 62138 Violaines,62863_0200_00001,G,1 ROUTE D ESTAIRES,
319156451,00035,31915645100035,O,2010-07-15,,,,2013-08-27T03:28:37,true,2,7 RESIDENCE ALLENDE,,,RUE,DE L'EGLISE,62138,VIOLAINES,,,62863,,,,,,,,,,,,,,,,,,,2013-08-26,F,,,,,47.89Z,NAFRev2,N,2.786408,50.538444,0.95,street,Rue de l’Eglise 62138 Violaines,62863_0260,G,RUE DE L EGLISE,
319593182,00011,31959318200011,O,,NN,,,,true,1,,1,,RUE,DU MARAIS,62138,VIOLAINES,,,62863,,,,,,,,,,,,,,,,,,,1988-01-19,F,,,,,67.04,NAP,N,2.785873,50.546276,0.96,housenumber,1 Rue du Marais 62138 Violaines,62863_0480_00001,G,1 RUE DU MARAIS,
320150345,00017,32015034500017,O,,NN,,,,true,1,,15,,RUE,JEAN JAURES,62138,VIOLAINES,,,62863,,,,,,,,,,,,,,,,,,,1989-06-09,F,,,,,60.2L,NAF1993,O,2.790718,50.541644,0.96,housenumber,15 Rue Jean Jaurés 62138 Violaines,62863_0410_00015,G,15 RUE JEAN JAURES,
320150782,00011,32015078200011,O,,,,,,true,1,,57,,RUE,DE RETUY,62138,VIOLAINES,,,62863,,,,,,,,,,,,,,,,,,,1984-12-25,F,,,,,62.46,NAP,N,2.791466,50.542364,0.79,housenumber,57 Rue du Retuy 62138 Violaines,62863_0740_00057,G,57 RUE DU RETUY,
320239098,00041,32023909800041,O,,NN,,,,true,1,,,,RTE,D ESTAIRES,62138,VIOLAINES,,,62863,,,,,,,,,,,,,,,,,,,1993-04-01,F,,,,,52.1D,NAF1993,O,2.801199,50.537662,0.84,street,Route d’Estaires 62138 Violaines,62863_0200,G,ROUTE D ESTAIRES,
320335409,00019,32033540900019,O,,NN,,,,true,1,,67,,,PETITE PLACE,62138,VIOLAINES,,,62863,,,,,,,,,,,,,,,,,,,1990-06-30,F,,,,,67.05,NAP,N,2.785981,50.546039,0.89,housenumber,67 Rue de la Petite Place 62138 Violaines,62863_0600_00067,G,67 RUE DE LA PETITE PLACE,
320432768,00010,32043276800010,O,1972-05-03,NN,,,,true,4,,,,RTE,NATIONALE,62138,VIOLAINES,,,62863,,,,,,,,,,,,,,,,,,,2001-12-31,F,,,,,70.2C,NAF1993,N,2.779333,50.517929,0.83,street,Route Nationale 62138 Violaines,62863_0500,G,ROUTE NATIONALE,
320469224,00010,32046922400010,O,,NN,,,,true,1,,,,RTE,D ESTAIRES,62138,VIOLAINES,,,62863,,,,,,,,,,,,,,,,,,,1992-12-31,F,,,,,52.4C,NAF1993,N,2.801199,50.537662,0.84,street,Route d’Estaires 62138 Violaines,62863_0200,G,ROUTE D ESTAIRES,
321013724,00018,32101372400018,O,,,,,,true,1,,161,,RTE,D ESTAIRES,62138,VIOLAINES,,,62863,,,,,,,,,,,,,,,,,,,1984-12-25,F,,,,,67.04,NAP,N,2.79275,50.551422,0.87,housenumber,161 Route d’Estaires 62138 Violaines,62863_0200_00161,G,161 ROUTE D ESTAIRES,
321436826,00036,32143682600036,O,1983-01-01,NN,,,2008-11-07T00:37:40,false,4,,26,,RUE,DES SAULES,62138,VIOLAINES,,,62863,,,,,,,,,,,,,,,,,,,2006-05-05,F,,,,,28.2D,NAFRev1,O,2.785425,50.543084,0.81,street,Rue des Saules 62138 Violaines,62863_0789,G,RUE DES SAULES,
321769556,00028,32176955600028,O,,,,,,true,1,,16,,RUE,DU 11 NOVEMBRE,62138,VIOLAINES,,,62863,,,,,,,,,,,,,,,,,,,1989-04-30,F,,,,,51.10,NAP,N,2.797966,50.540632,0.95,housenumber,16 Rue du 11 Novembre 62138 Violaines,62863_0510_00016,G,16 RUE DU 11 NOVEMBRE,
321901464,00024,32190146400024,O,1991-07-01,NN,,,2021-03-18T06:33:30,false,7,,155,B,RTE,D'ESTAIRES,62138,VIOLAINES,,,62863,,,,,,,,,,,,,,,,,,,2016-12-31,F,,,,,68.20B,NAFRev2,N,2.800974,50.538824,0.78,housenumber,155bis Route d’Estaires 62138 Violaines,62863_0200_00155_bis,G,155BIS ROUTE D ESTAIRES,
322142092,00012,32214209200012,O,,NN,,,,true,1,,,,RTE,D ESTAIRES,62138,VIOLAINES,,,62863,,,,,,,,,,,,,,,,,,,,F,,,,,66.02,NAP,N,2.801199,50.537662,0.84,street,Route d’Estaires 62138 Violaines,62863_0200,G,ROUTE D ESTAIRES,
322243825,00013,32224382500013,O,,,,,,true,1,,67,,RTE,D ESTAIRES,62138,VIOLAINES,,,62863,,,,,,,,,,,,,,,,,,,1984-12-25,F,,,,,64.49,NAP,N,2.801367,50.536828,0.86,housenumber,67 Route d’Estaires 62138 Violaines,62863_0200_00067,G,67 ROUTE D ESTAIRES,
323081125,00029,32308112500029,O,1991-02-04,NN,,,2006-12-15T00:21:42,false,3,,67,,,PETITE PLACE,62138,VIOLAINES,,,62863,,,,,,,,,,,,,,,,,,,1995-06-30,F,,,,,55.4A,NAF1993,N,2.785981,50.546039,0.89,housenumber,67 Rue de la Petite Place 62138 Violaines,62863_0600_00067,G,67 RUE DE LA PETITE PLACE,
323217299,00037,32321729900037,O,1997-10-04,NN,,,2006-11-25T09:54:05,true,4,,1,,RTE,D'ESTAIRES,62138,VIOLAINES,,,62863,,,,,,,,,,,,,,,,,,,2003-04-18,F,,,,,74.1J,NAFRev1,N,2.801835,50.53476,0.86,housenumber,1 Route d’Estaires 62138 Violaines,62863_0200_00001,G,1 ROUTE D ESTAIRES,
323240762,00019,32324076200019,O,,,,,,true,1,,57,,RUE,D ESTAIRES,62138,VIOLAINES,,,62863,,,,,,,,,,,,,,,,,,,1985-12-25,F,,,,,64.49,NAP,N,2.801323,50.536529,0.96,housenumber,57 Rue d’Estaires 62138 Violaines,62863_qduylc_00057,G,57 RUE D ESTAIRES,
323583609,00025,32358360900025,O,1993-10-02,NN,,,2007-01-03T16:18:17,true,3,,21,,,GRAND'PLACE,62138,VIOLAINES,,,62863,,,,,,,,,,,,,,,,,,,2006-12-31,F,,,,,55.3A,NAFRev1,N,2.787939,50.539538,0.88,housenumber,21 Rue de la Grand’Place 62138 Violaines,62863_0580_00021,G,21 RUE DE LA GRAND PLACE,
323977165,00055,32397716500055,O,1995-07-01,NN,,,,false,3,,1,,RTE,D'ESTAIRES,62138,VIOLAINES,,,62863,,,,,,,,,,,,,,,,,,,1997-09-30,F,HAPPY SERGE,,,,55.4B,NAF1993,N,2.801835,50.53476,0.86,housenumber,1 Route d’Estaires 62138 Violaines,62863_0200_00001,G,1 ROUTE D ESTAIRES,
323977165,00113,32397716500113,O,2015-06-19,NN,,4932ZA,2023-08-05T03:37:28,true,4,(LIEU D EXPLOITATION: TOURCOING),1,T,RUE,DES CHARMES,62138,VIOLAINES,,,62863,,,,,,,,,,,,,,,,,,,2023-07-25,F,,,,TAXI HADDAD,49.32Z,NAFRev2,N,2.78912,50.540847,0.85,housenumber,1ter Rue des Charmes 62138 Violaines,62863_0095_00001_ter,G,1TER RUE DES CHARMES,
324637487,00012,32463748700012,O,,NN,,,,true,1,,,,,CENT COMMERC MAXI COOP,62138,VIOLAINES,,,62863,,,,,,,,,,,,,,,,,,,1987-04-27,F,,,,,87.08,NAP,N,,,0,,,,,,
324745710,00016,32474571000016,O,1982-04-30,NN,,,2007-10-17T12:27:34,false,3,,,,RUE,DU MONT SAURET,62138,VIOLAINES,,,62863,,,,,,,,,,,,,,,,,,,2007-09-18,F,,,,,70.2C,NAFRev1,N,2.795128,50.542693,0.77,street,Rue du Mont Soret 62138 Violaines,62863_0490,G,RUE DU MONT SORET,