siren,nic,siret,statutDiffusionEtablissement,dateCreationEtablissement,trancheEffectifsEtablissement,anneeEffectifsEtablissement,activitePrincipaleRegistreMetiersEtablissement,dateDernierTraitementEtablissement,etablissementSiege,nombrePeriodesEtablissement,complementAdresseEtablissement,numeroVoieEtablissement,indiceRepetitionEtablissement,typeVoieEtablissement,libelleVoieEtablissement,codePostalEtablissement,libelleCommuneEtablissement,libelleCommuneEtrangerEtablissement,distributionSpecialeEtablissement,codeCommuneEtablissement,codeCedexEtablissement,libelleCedexEtablissement,codePaysEtrangerEtablissement,libellePaysEtrangerEtablissement,complementAdresse2Etablissement,numeroVoie2Etablissement,indiceRepetition2Etablissement,typeVoie2Etablissement,libelleVoie2Etablissement,codePostal2Etablissement,libelleCommune2Etablissement,libelleCommuneEtranger2Etablissement,distributionSpeciale2Etablissement,codeCommune2Etablissement,codeCedex2Etablissement,libelleCedex2Etablissement,codePaysEtranger2Etablissement,libellePaysEtranger2Etablissement,dateDebut,etatAdministratifEtablissement,enseigne1Etablissement,enseigne2Etablissement,enseigne3Etablissement,denominationUsuelleEtablissement,activitePrincipaleEtablissement,nomenclatureActivitePrincipaleEtablissement,caractereEmployeurEtablissement,longitude,latitude,geo_score,geo_type,geo_adresse,geo_id,geo_ligne,geo_l4,geo_l5
217604206,00011,21760420600011,O,1983-03-01,02,2021,,2023-11-27T13:25:03,true,4,,,,,LE VILLAGE,76440,MAUQUENCHY,,,76420,,,,,,,,,,,,,,,,,,,2008-01-01,A,MAIRIE,,,,84.11Z,NAFRev2,O,1.433561,49.59986,0.35,street,Route de Mathonville 76440 Mauquenchy,76420_0080,G,ROUTE DE MATHONVILLE,
217604206,00029,21760420600029,O,1983-03-16,NN,,,2008-01-04T18:42:08,false,3,,,,,,76440,MAUQUENCHY,,,76420,,,,,,,,,,,,,,,,,,,2008-01-01,A,CANTINE SCOLAIRE DE MAUQUENCHY,,,,56.29B,NAFRev2,N,,,0,,,,,,
217604206,00037,21760420600037,O,1983-12-21,01,2021,,2023-11-27T13:25:03,false,3,,,,IMP,DE L'ECOLE,76440,MAUQUENCHY,,,76420,,,,,,,,,,,,,,,,,,,2008-01-01,A,ECOLE MATERNELLE PUBLIQUE,,,,85.10Z,NAFRev2,N,1.468432,49.605031,0.81,street,Impasse de l’Ecole 76440 Mauquenchy,76420_0030,G,IMPASSE DE L ECOLE,
257604173,00027,25760417300027,O,2001-12-20,NN,,,2017-05-04T01:37:11,false,4,MAIRIE,,,IMP,DE L'ECOLE,76440,MAUQUENCHY,,,76420,,,,,,,,,,,,,,,,,,,2016-01-20,F,,,,,49.39A,NAFRev2,O,1.468432,49.605031,0.81,street,Impasse de l’Ecole 76440 Mauquenchy,76420_0030,G,IMPASSE DE L ECOLE,
267604668,00017,26760466800017,O,1993-03-30,NN,,,2010-06-26T03:15:42,true,3,MAIRIE,,,,LE VILLAGE,76440,MAUQUENCHY,,,76420,,,,,,,,,,,,,,,,,,,2008-01-01,A,CCAS,,,,88.99B,NAFRev2,N,1.433561,49.59986,0.35,street,Route de Mathonville 76440 Mauquenchy,76420_0080,G,ROUTE DE MATHONVILLE,
317974889,00022,31797488900022,O,,NN,,,,true,1,,,,,VIEUX MANOIR,76440,MAUQUENCHY,,,76420,,,,,,,,,,,,,,,,,,,,F,,,,,24.08,NAP,N,1.489559,49.603253,0.31,street,Rue des Viviers 76440 Mauquenchy,76420_0140,G,RUE DES VIVIERS,
321099145,00039,32109914500039,O,,NN,,,,true,1,,,,,,76440,MAUQUENCHY,,,76420,,,,,,,,,,,,,,,,,,,,F,,,,,55.72,NAP,N,,,0,,,,,,
322085077,00046,32208507700046,O,2012-07-24,,,,2021-02-23T10:45:43,true,1,CHEZ MR OLIVIER HELLOT,289,,RUE,DE LECOUFFE - HAM LIFFREMONT,76440,MAUQUENCHY,,,76420,,,,,,,,,,,,,,,,,,,2012-07-24,A,,,,,01.61Z,NAFRev2,N,1.427282,49.609972,0.6,housenumber,289 Rue de Lecouffe 76440 Mauquenchy,76420_3giib6_00289,G,289 RUE DE LECOUFFE,
325903953,00017,32590395300017,O,1982-07-01,NN,,,2011-04-28T00:22:17,false,4,,,,,,76440,MAUQUENCHY,,,76420,,,,,,,,,,,,,,,,,,,1997-04-25,F,,,,,92.7C,NAF1993,O,,,0,,,,,,
325903953,00025,32590395300025,O,2003-10-15,NN,,,2008-01-04T19:11:44,true,3,,97,,RTE,DE LIFFREMONT,76440,MAUQUENCHY,,,76420,,,,,,,,,,,,,,,,,,,2008-01-01,A,,,,,46.19B,NAFRev2,N,1.465137,49.602769,0.85,housenumber,97 Route de Liffremont 76440 Mauquenchy,76420_0070_00097,G,97 ROUTE DE LIFFREMONT,
326416419,00033,32641641900033,O,2007-07-31,,,,2015-08-20T03:23:39,false,3,,,,,RUE DU MOULIN,76440,MAUQUENCHY,,,76420,,,,,,,,,,,,,,,,,,,2015-08-11,F,,,,,82.99Z,NAFRev2,N,1.474431,49.607237,0.94,street,Rue du Moulin 76440 Mauquenchy,76420_0085,G,RUE DU MOULIN,
327240727,00039,32724072700039,O,1997-01-01,NN,,,2014-11-23T04:22:59,false,4,,,,,LA CHAULE,76440,MAUQUENCHY,,,76420,,,,,,,,,,,,,,,,,,,2013-12-20,F,,,,,01.42Z,NAFRev2,N,1.486977,49.5908,0.92,street,Route de la Chaule 76440 Mauquenchy,76420_0020,G,ROUTE DE LA CHAULE,
328115217,00023,32811521700023,O,2016-07-01,,,8121ZZ,2021-02-23T10:49:25,true,1,,1102,,RTE,DU RANDILLON,76440,MAUQUENCHY,,,76420,,,,,,,,,,,,,,,,,,,2016-07-01,A,,,,,81.21Z,NAFRev2,N,1.474638,49.58777,0.86,housenumber,1102 Route du Randillon 76440 Mauquenchy,76420_0100_01102,G,1102 ROUTE DU RANDILLON,
328261664,00010,32826166400010,O,,,,,,true,1,,,,RTE,DE BUCHY,76440,MAUQUENCHY,,,76420,,,,,,,,,,,,,,,,,,,1985-12-25,F,,,,,65.03,NAP,N,1.481309,49.602346,0.52,street,Route de Rouen 76440 Mauquenchy,76420_0001,G,ROUTE DE ROUEN,
329801336,00010,32980133600010,O,1984-01-01,NN,,,,true,1,,,,,,76440,MAUQUENCHY,,,76420,,,,,,,,,,,,,,,,,,,1999-05-31,F,,,,,01.1A,NAF1993,N,,,0,,,,,,
331796367,00018,33179636700018,O,1985-01-01,NN,,,2007-01-18T09:19:57,true,4,,,,,,76440,MAUQUENCHY,,,76420,,,,,,,,,,,,,,,,,,,1995-12-25,F,,,,,01.2A,NAF1993,N,,,0,,,,,,
338939101,02028,33893910102028,O,2018-06-01,,,,2020-09-29T19:37:41,false,2,,,,IMP,DE L ECOLE,76440,MAUQUENCHY,,,76420,,,,,,,,,,,,,,,,,,,2020-08-31,F,CONVIVIO-HR-RESTAURANT SCOLAIRE DE MAUQUENCHY-76,,,,56.29B,NAFRev2,N,1.468432,49.605031,0.81,street,Impasse de l’Ecole 76440 Mauquenchy,76420_0030,G,IMPASSE DE L ECOLE,
342372042,00016,34237204200016,O,1987-04-13,,,,,true,3,,,,,LE VILLAGE,76440,MAUQUENCHY,,,76420,,,,,,,,,,,,,,,,,,,1991-12-25,F,,,,,31.12,NAP,N,1.433561,49.59986,0.35,street,Route de Mathonville 76440 Mauquenchy,76420_0080,G,ROUTE DE MATHONVILLE,
345333462,00033,34533346200033,O,2018-01-17,,,5610CQ,2021-02-23T11:00:12,true,2,,693,,RUE,DU GRAND QUESNAY,76440,MAUQUENCHY,,,76420,,,,,,,,,,,,,,,,,,,2018-06-01,A,,,,,47.89Z,NAFRev2,N,1.48063,49.603134,0.94,housenumber,693 Rue du Grand Quesnay 76440 Mauquenchy,76420_0050_00693,G,693 RUE DU GRAND QUESNAY,
347501975,00010,34750197500010,O,1988-06-01,NN,,,,true,4,,,,,,76440,MAUQUENCHY,,,76420,,,,,,,,,,,,,,,,,,,1995-12-25,F,,,,,71.3G,NAF1993,N,,,0,,,,,,
352265276,00019,35226527600019,O,1989-09-01,NN,,,,true,3,RANDILLON D1,,,,,76440,MAUQUENCHY,,,76420,,,,,,,,,,,,,,,,,,,1995-12-25,F,,,,,91.3E,NAF1993,N,1.474096,49.589249,0.71,street,Route du Randillon 76440 Mauquenchy,76420_0100,D,ROUTE DU RANDILLON,
380482273,00030,38048227300030,O,2011-12-13,,,,2021-02-23T11:08:57,true,1,,2,,IMP,SAINTE ANNA,76440,MAUQUENCHY,,,76420,,,,,,,,,,,,,,,,,,,2011-12-13,A,,,,,43.32A,NAFRev2,N,1.468035,49.606278,0.73,housenumber,2 Impasse Sainte - Anne 76440 Mauquenchy,76420_0115_00002,G,2 IMPASSE SAINTE  ANNE,
381783299,00021,38178329900021,O,2000-06-27,NN,,,2018-09-29T12:10:25,true,5,MAUQUENCHY,,,LD,LIFFREMONT,76440,MAUQUENCHY,,,76420,,,,,,,,,,,,,,,,,,,2016-04-11,A,,,,,46.21Z,NAFRev2,O,1.465253,49.602922,0.92,street,Route de Liffremont 76440 Mauquenchy,76420_0070,G,ROUTE DE LIFFREMONT,
382900520,00026,38290052000026,O,2016-09-01,,,5610CR,2021-07-16T08:47:41,true,2,,90,,RTE,DE LIFFREMONT,76440,MAUQUENCHY,,,76420,,,,,,,,,,,,,,,,,,,2020-12-31,F,,,,POINT PIZZA,56.10C,NAFRev2,N,1.465122,49.602892,0.85,housenumber,90 Route de Liffremont 76440 Mauquenchy,76420_0070_00090,G,90 ROUTE DE LIFFREMONT,
382941250,00013,38294125000013,O,1990-10-30,,,,,true,4,,,,LD,LE VILLAGE,76440,MAUQUENCHY,,,76420,,,,,,,,,,,,,,,,,,,1994-12-01,F,,,,,92.7C,NAF1993,N,1.433561,49.59986,0.35,street,Route de Mathonville 76440 Mauquenchy,76420_0080,G,ROUTE DE MATHONVILLE,
385376595,00018,38537659500018,O,1900-01-01,NN,,,2011-04-28T00:51:46,false,3,,,,HAM,DE LIFFREMONT,76440,MAUQUENCHY,,,76420,,,,,,,,,,,,,,,,,,,1993-09-30,F,,,,,74.1G,NAF1993,N,1.465253,49.602922,0.93,street,Route de Liffremont 76440 Mauquenchy,76420_0070,G,ROUTE DE LIFFREMONT,
387918949,00026,38791894900026,O,2000-01-21,,,,,true,1,,,,,LE GRAND QUESNAY,76440,MAUQUENCHY,,,76420,,,,,,,,,,,,,,,,,,,2000-06-30,F,,,,,74.8F,NAF1993,N,1.477314,49.603788,0.78,street,Rue du Grand Quesnay 76440 Mauquenchy,76420_0050,G,RUE DU GRAND QUESNAY,
389209594,00016,38920959400016,O,1992-10-01,00,2021,,2023-11-27T13:30:39,true,3,,,,,LES FORGETTES,76440,MAUQUENCHY,,,76420,,,,,,,,,,,,,,,,,,,2008-01-01,A,,,,,01.50Z,NAFRev2,N,1.434444,49.604789,0.72,street,Rue de Forgettes 76440 Mauquenchy,76420_0042,G,RUE DE FORGETTES,
391589926,00016,39158992600016,O,1988-03-26,NN,,,2008-01-04T23:54:34,true,3,,,,,,76440,MAUQUENCHY,,,76420,,,,,,,,,,,,,,,,,,,2008-01-01,A,,,,,94.99Z,NAFRev2,N,,,0,,,,,,
391870375,00014,39187037500014,O,,NN,,,,true,1,,,,,LE CENTRE,76440,MAUQUENCHY,,,76420,,,,,,,,,,,,,,,,,,,1994-01-31,F,,,,,19.2Z,NAF1993,N,0.2152555,47.9499499,0.79,poi.sports_centre,(Centre sportif) Le Mans,https://osm.org/way/482284787,G,,
392110730,00018,39211073000018,O,1992-10-01,NN,,,,true,3,,,,,LES FORGETTES,76440,MAUQUENCHY,,,76420,,,,,,,,,,,,,,,,,,,2003-07-16,F,,,,,70.2B,NAFRev1,N,1.434444,49.604789,0.72,street,Rue de Forgettes 76440 Mauquenchy,76420_0042,G,RUE DE FORGETTES,
392613022,00012,39261302200012,O,1993-01-08,,,,2008-01-05T00:06:50,true,4,,,,,LE VILLAGE,76440,MAUQUENCHY,,,76420,,,,,,,,,,,,,,,,,,,2008-01-01,A,,,,,94.99Z,NAFRev2,N,1.433561,49.59986,0.35,street,Route de Mathonville 76440 Mauquenchy,76420_0080,G,ROUTE DE MATHONVILLE,
393564034,00014,39356403400014,O,1989-04-12,NN,,,2008-01-05T00:17:33,true,3,,,,,LE VILLAGE,76440,MAUQUENCHY,,,76420,,,,,,,,,,,,,,,,,,,2008-01-01,A,,,,,94.99Z,NAFRev2,N,1.433561,49.59986,0.35,street,Route de Mathonville 76440 Mauquenchy,76420_0080,G,ROUTE DE MATHONVILLE,
393869169,00010,39386916900010,O,1994-02-01,02,2021,,2023-11-27T13:37:05,true,4,,289,,RUE,DE LECOUFFE HAM DE LIFFREMONT,76440,MAUQUENCHY,,,76420,,,,,,,,,,,,,,,,,,,2012-12-31,A,,,,,01.50Z,NAFRev2,O,1.427282,49.609972,0.6,housenumber,289 Rue de Lecouffe 76440 Mauquenchy,76420_3giib6_00289,G,289 RUE DE LECOUFFE,
394031074,00013,39403107400013,O,,NN,,,,true,1,,,,,,76440,MAUQUENCHY,,,76420,,,,,,,,,,,,,,,,,,,1996-12-31,F,,,,,01.2A,NAF1993,N,,,0,,,,,,
394083521,00010,39408352100010,O,1994-02-02,NN,,,2008-01-04T17:59:33,true,3,,,,,,76440,MAUQUENCHY,,,76420,,,,,,,,,,,,,,,,,,,2008-01-01,A,,,,,01.11Z,NAFRev2,N,,,0,,,,,,
394235436,00018,39423543600018,O,1994-01-01,NN,,,,true,1,,,,,,76440,MAUQUENCHY,,,76420,,,,,,,,,,,,,,,,,,,1998-10-01,F,,,,,01.3Z,NAF1993,N,,,0,,,,,,
399701309,00011,39970130900011,O,1995-01-01,NN,,,2015-08-23T03:46:12,true,4,,,,,,76440,MAUQUENCHY,,,76420,,,,,,,,,,,,,,,,,,,2014-12-31,F,,,,,01.41Z,NAFRev2,N,,,0,,,,,,
400197737,00010,40019773700010,O,1995-02-01,NN,,,2008-01-04T19:24:21,true,3,,,,,,76440,MAUQUENCHY,,,76420,,,,,,,,,,,,,,,,,,,2008-01-01,A,,,,,01.41Z,NAFRev2,N,,,0,,,,,,
400327961,00019,40032796100019,O,1992-10-01,NN,,,2009-05-15T09:11:52,true,4,,,,,LE RANDILLON,76440,MAUQUENCHY,,,76420,,,,,,,,,,,,,,,,,,,2009-05-01,F,,,,,01.42Z,NAFRev2,N,1.474096,49.589249,0.72,street,Route du Randillon 76440 Mauquenchy,76420_0100,G,ROUTE DU RANDILLON,
400794384,00026,40079438400026,O,2005-01-01,,,,2021-02-23T11:24:47,true,2,,,,PL,JEAN REGNIER,76440,MAUQUENCHY,,,76420,,,,,,,,,,,,,,,,,,,2008-01-01,A,,,,,68.20B,NAFRev2,N,1.468544,49.604203,0.82,street,Place Jean Regnier 76440 Mauquenchy,76420_0065,G,PLACE JEAN REGNIER,
401543053,00029,40154305300029,O,2003-09-01,NN,,4120AZ,2015-03-17T00:44:45,true,4,,168,,RUE,DES VIVIERS,76440,MAUQUENCHY,,,76420,,,,,,,,,,,,,,,,,,,2010-12-25,F,,,,,43.99C,NAFRev2,N,1.487733,49.603974,0.94,housenumber,168 Rue des Viviers 76440 Mauquenchy,76420_0140_00168,G,168 RUE DES VIVIERS,
403129786,00030,40312978600030,O,2003-05-01,NN,,4120BB,2018-09-29T12:30:03,true,4,LE GRAND QUESNAY,207,,RTE,DE RONCHEROLLES,76440,MAUQUENCHY,,,76420,,,,,,,,,,,,,,,,,,,2016-10-31,F,,,,,41.20A,NAFRev2,O,1.483102,49.604904,0.87,housenumber,207 Route de Roncherolles 76440 Mauquenchy,76420_0105_00207,G,207 ROUTE DE RONCHEROLLES,
403197163,00013,40319716300013,O,1995-10-19,00,2021,,2023-11-27T13:46:48,true,3,,105,,RTE,DE SOMMERY,76440,MAUQUENCHY,,,76420,,,,,,,,,,,,,,,,,,,2008-01-01,A,,,,,01.50Z,NAFRev2,N,1.467683,49.600734,0.85,housenumber,105 Route de Sommery 76440 Mauquenchy,76420_0120_00105,G,105 ROUTE DE SOMMERY,
403654734,00017,40365473400017,O,1996-01-22,NN,,,2008-01-04T20:26:36,true,3,,,,,,76440,MAUQUENCHY,,,76420,,,,,,,,,,,,,,,,,,,2008-01-01,A,,,,,68.20B,NAFRev2,N,,,0,,,,,,
403765845,00025,40376584500025,O,1990-12-31,NN,,,2013-02-02T12:50:30,true,4,,,,,,76440,MAUQUENCHY,,,76420,,,,,,,,,,,,,,,,,,,2010-07-22,F,,,,,01.11Z,NAFRev2,N,,,0,,,,,,
404514655,00012,40451465500012,O,1986-12-31,NN,,,,true,1,,,,,,76440,MAUQUENCHY,,,76420,,,,,,,,,,,,,,,,,,,2001-09-29,F,,,,,01.1A,NAF1993,N,,,0,,,,,,
404514663,00016,40451466300016,O,1988-12-31,NN,,,2008-01-04T20:41:51,true,3,,,,,,76440,MAUQUENCHY,,,76420,,,,,,,,,,,,,,,,,,,2008-01-01,A,,,,,01.50Z,NAFRev2,N,,,0,,,,,,
404514671,00019,40451467100019,O,1989-12-31,NN,,,2010-12-19T05:37:33,true,4,,,,,,76440,MAUQUENCHY,,,76420,,,,,,,,,,,,,,,,,,,2010-12-31,F,,,,,01.42Z,NAFRev2,N,,,0,,,,,,
404514689,00011,40451468900011,O,1988-12-31,NN,,,2008-01-04T20:41:51,true,3,,,,,,76440,MAUQUENCHY,,,76420,,,,,,,,,,,,,,,,,,,2008-01-01,A,,,,,01.11Z,NAFRev2,N,,,0,,,,,,
404514697,00014,40451469700014,O,1985-12-31,NN,,,2020-01-17T03:46:20,true,4,,,,,,76440,MAUQUENCHY,,,76420,,,,,,,,,,,,,,,,,,,2019-12-31,F,,,,,01.42Z,NAFRev2,N,,,0,,,,,,
404514705,00015,40451470500015,O,1992-09-15,NN,,,2006-10-28T03:21:59,true,3,,,,,,76440,MAUQUENCHY,,,76420,,,,,,,,,,,,,,,,,,,2004-03-31,F,,,,,01.1A,NAFRev1,N,,,0,,,,,,
408005692,00012,40800569200012,O,,NN,,,,true,1,,,,,,76440,MAUQUENCHY,,,76420,,,,,,,,,,,,,,,,,,,1996-05-31,F,,,,,01.1A,NAF1993,N,,,0,,,,,,
408947588,00021,40894758800021,O,2016-04-20,,,,2021-06-25T14:00:07,true,1,,88,,RTE,DE SOMMERY,76440,MAUQUENCHY,,,76420,,,,,,,,,,,,,,,,,,,2016-04-20,A,,,,,68.20B,NAFRev2,N,1.46899,49.598832,0.84,housenumber,88 Route de Sommery 76440 Mauquenchy,76420_0120_00088,G,88 ROUTE DE SOMMERY,
409001583,00023,40900158300023,O,1996-09-01,,,,2006-11-25T15:19:13,true,3,,,,,,76440,MAUQUENCHY,,,76420,,,,,,,,,,,,,,,,,,,1999-12-16,F,,,,,92.7C,NAF1993,N,,,0,,,,,,
411469612,00013,41146961200013,O,1997-04-02,,,,,true,1,,,,RUE,DU MOULIN,76440,MAUQUENCHY,,,76420,,,,,,,,,,,,,,,,,,,1998-03-15,F,,,,,19.2Z,NAF1993,N,1.474431,49.607237,0.94,street,Rue du Moulin 76440 Mauquenchy,76420_0085,G,RUE DU MOULIN,
412400939,00028,41240093900028,O,2017-05-02,,,,2017-09-26T10:22:25,true,1,,201,,PL,JEAN REGNIER,76440,MAUQUENCHY,,,76420,,,,,,,,,,,,,,,,,,,2017-05-02,A,,,,,68.20B,NAFRev2,N,1.468544,49.604203,0.65,street,Place Jean Regnier 76440 Mauquenchy,76420_0065,G,PLACE JEAN REGNIER,
414486837,00068,41448683700068,O,2022-07-07,,,,2023-01-09T11:02:30,true,1,LE PETIT QUESNAY,168,,RUE,DES VIVIERS,76440,MAUQUENCHY,,,76420,,,,,,,,,,,,,,,,,,,2022-07-07,A,,,,,74.90B,NAFRev2,N,1.487733,49.603974,0.94,housenumber,168 Rue des Viviers 76440 Mauquenchy,76420_0140_00168,G,168 RUE DES VIVIERS,
417634656,00017,41763465600017,O,1997-10-16,,,,,true,1,,,,,,76440,MAUQUENCHY,,,76420,,,,,,,,,,,,,,,,,,,2000-09-30,F,,,,,01.1A,NAF1993,N,,,0,,,,,,
418025599,00063,41802559900063,O,2022-01-01,,,,2022-05-04T11:50:13,true,1,,237,,RUE,DU GRAND QUESNAY,76440,MAUQUENCHY,,,76420,,,,,,,,,,,,,,,,,,,2022-01-01,A,,,,,68.31Z,NAFRev2,N,1.474508,49.605404,0.94,housenumber,237 Rue du Grand Quesnay 76440 Mauquenchy,76420_0050_00237,G,237 RUE DU GRAND QUESNAY,
418872636,00026,41887263600026,O,2003-05-01,NN,,,2008-01-04T23:27:50,true,5,LE GRAND QUESNAY,207,,RTE,DE RONCHEROLLES,76440,MAUQUENCHY,,,76420,,,,,,,,,,,,,,,,,,,2008-01-01,A,,,,,68.20B,NAFRev2,N,1.483102,49.604904,0.87,housenumber,207 Route de Roncherolles 76440 Mauquenchy,76420_0105_00207,G,207 ROUTE DE RONCHEROLLES,
419607908,00011,41960790800011,O,1998-07-01,NN,,,2012-05-05T06:26:15,true,4,MME HELLOT,,,,LIFFREMONT,76440,MAUQUENCHY,,,76420,,,,,,,,,,,,,,,,,,,2010-12-31,F,,,,,78.30Z,NAFRev2,N,1.465253,49.602922,0.92,street,Route de Liffremont 76440 Mauquenchy,76420_0070,G,ROUTE DE LIFFREMONT,
419901202,00012,41990120200012,O,1998-08-01,NN,,,2019-04-06T04:08:15,true,3,,580,,RTE,DE SOMMERY,76440,MAUQUENCHY,,,76420,,,,,,,,,,,,,,,,,,,2008-01-01,A,,,,,01.50Z,NAFRev2,N,1.464386,49.604665,0.85,housenumber,580 Route de Sommery 76440 Mauquenchy,76420_0120_00580,G,580 ROUTE DE SOMMERY,
421265604,00015,42126560400015,O,1997-01-01,NN,,,2008-01-05T00:04:32,true,3,,,,,,76440,MAUQUENCHY,,,76420,,,,,,,,,,,,,,,,,,,2008-01-01,A,,,,,01.41Z,NAFRev2,N,,,0,,,,,,
423161850,00015,42316185000015,O,1999-06-01,,,,,true,1,,,,,LE PETIT QUESNAY,76440,MAUQUENCHY,,,76420,,,,,,,,,,,,,,,,,,,1999-11-30,F,,,,,01.2A,NAF1993,N,1.477314,49.603788,0.46,street,Rue du Grand Quesnay 76440 Mauquenchy,76420_0050,G,RUE DU GRAND QUESNAY,
428814966,00019,42881496600019,O,1999-12-15,NN,,,2013-06-12T03:51:32,false,4,,,,HAM,DE LIFFREMONT,76440,MAUQUENCHY,,,76420,,,,,,,,,,,,,,,,,,,2009-01-11,A,,,,,01.11Z,NAFRev2,O,1.465253,49.602922,0.93,street,Route de Liffremont 76440 Mauquenchy,76420_0070,G,ROUTE DE LIFFREMONT,
430972547,00011,43097254700011,O,1978-01-01,NN,,,2015-12-07T15:23:32,true,5,,,,,LIFFREMONT,76440,MAUQUENCHY,,,76420,,,,,,,,,,,,,,,,,,,2014-12-24,F,,,,,01.42Z,NAFRev2,N,1.465253,49.602922,0.92,street,Route de Liffremont 76440 Mauquenchy,76420_0070,G,ROUTE DE LIFFREMONT,
430972554,00017,43097255400017,O,1968-01-01,NN,,,2008-01-05T01:57:49,true,4,,,,,LE GRAND QUESNAY,76440,MAUQUENCHY,,,76420,,,,,,,,,,,,,,,,,,,2008-01-01,A,,,,,01.43Z,NAFRev2,N,1.477314,49.603788,0.78,street,Rue du Grand Quesnay 76440 Mauquenchy,76420_0050,G,RUE DU GRAND QUESNAY,
430972562,00010,43097256200010,O,1969-01-01,NN,,,,true,5,,,,,LIFREMONT,76440,MAUQUENCHY,,,76420,,,,,,,,,,,,,,,,,,,2002-11-27,F,,,,,01.1A,NAF1993,N,1.465253,49.602922,0.83,street,Route de Liffremont 76440 Mauquenchy,76420_0070,G,ROUTE DE LIFFREMONT,
433960887,00019,43396088700019,O,1988-01-01,NN,,,,true,1,,,,,,76440,MAUQUENCHY,,,76420,,,,,,,,,,,,,,,,,,,2002-09-15,F,,,,,55.2E,NAF1993,N,,,0,,,,,,
435000856,00029,43500085600029,O,2012-12-13,01,2021,,2023-11-27T13:29:00,true,2,LIEUDIT MESNIL TREFLET,644,,RTE,DE MATHONVILLE,76440,MAUQUENCHY,,,76420,,,,,,,,,,,,,,,,,,,2013-12-31,A,,,,,01.50Z,NAFRev2,O,1.431694,49.602187,0.86,housenumber,644 Route de Mathonville 76440 Mauquenchy,76420_0080_00644,G,644 ROUTE DE MATHONVILLE,
442525754,00010,44252575400010,O,2002-07-03,NN,,,2008-11-08T02:16:10,true,3,HAMEAU DE L IFFREMONT,926,,RUE,LECOUFFE,76440,MAUQUENCHY,,,76420,,,,,,,,,,,,,,,,,,,2007-09-30,F,,,,,45.3E,NAFRev1,N,1.435074,49.611432,0.94,housenumber,926 Rue de Lecouffe 76440 Mauquenchy,76420_3giib6_00926,G,926 RUE DE LECOUFFE,
442563839,00012,44256383900012,O,2002-06-08,NN,,,2008-01-04T21:44:56,true,3,,110,,RUE,DU HETRE,76440,MAUQUENCHY,,,76420,,,,,,,,,,,,,,,,,,,2008-01-01,A,,,,,68.20A,NAFRev2,N,1.46753,49.603866,0.94,housenumber,110 Rue du Hêtre 76440 Mauquenchy,76420_0060_00110,G,110 RUE DU HETRE,
442729133,00011,44272913300011,O,2001-01-01,NN,,,2006-11-25T18:01:13,true,3,,,,,,76440,MAUQUENCHY,,,76420,,,,,,,,,,,,,,,,,,,2004-11-01,F,,,,,70.2A,NAFRev1,N,,,0,,,,,,
444930242,00011,44493024200011,O,2002-12-27,NN,,,,false,3,LIFFREMONT,,,RTE,DES FORGETTES,76440,MAUQUENCHY,,,76420,,,,,,,,,,,,,,,,,,,2003-11-19,F,,,,,70.2A,NAFRev1,N,1.434444,49.604789,0.68,street,Rue de Forgettes 76440 Mauquenchy,76420_0042,G,RUE DE FORGETTES,
451554562,00012,45155456200012,O,2003-04-02,NN,,,2010-04-18T10:20:24,true,5,CHEZ MME LOMENEDE REJANE,20,,IMP,DE LA FORGE,76440,MAUQUENCHY,,,76420,,,,,,,,,,,,,,,,,,,2008-11-30,A,,,,,90.01Z,NAFRev2,N,1.46899,49.604143,0.84,housenumber,20 Impasse de la Forge 76440 Mauquenchy,76420_0040_00020,G,20 IMPASSE DE LA FORGE,
477532568,00029,47753256800029,O,2016-09-07,,,4321AB,2022-09-27T10:49:19,false,2,,145,,RTE,DE ROUEN,76440,MAUQUENCHY,,,76420,,,,,,,,,,,,,,,,,,,2019-06-30,F,,,,KLG BATIMENT,43.21A,NAFRev2,N,1.476588,49.600347,0.84,housenumber,145 Route de Rouen 76440 Mauquenchy,76420_0001_00145,G,145 ROUTE DE ROUEN,
480566470,00021,48056647000021,O,2007-01-01,,,,2021-02-23T13:43:43,true,2,,715,,RTE,DE ROUVRAY,76440,MAUQUENCHY,,,76420,,,,,,,,,,,,,,,,,,,2008-01-01,A,,,,,68.20B,NAFRev2,N,1.491409,49.587618,0.85,housenumber,715 Route de Rouvray 76440 Mauquenchy,76420_0108_00715,G,715 ROUTE DE ROUVRAY,
483106506,00015,48310650600015,O,2005-07-01,,,,2022-04-11T09:28:13,true,2,LE GRAND QUESNAY,651,,RTE,DE ROUEN,76440,MAUQUENCHY,,,76420,,,,,,,,,,,,,,,,,,,2008-01-01,A,,,,,68.20A,NAFRev2,N,1.482904,49.603058,0.84,housenumber,651 Route de Rouen 76440 Mauquenchy,76420_0001_00651,G,651 ROUTE DE ROUEN,
489256214,00011,48925621400011,O,2006-04-01,,,,2008-11-08T03:01:35,false,2,,950,,RUE,ECOUFFE,76440,MAUQUENCHY,,,76420,,,,,,,,,,,,,,,,,,,2006-10-01,F,,,,,45.3F,NAFRev1,N,1.435874,49.611848,0.88,housenumber,950 Rue de l'Ecouffe 76440 Mauquenchy,76420_0032_00950,G,950 RUE DE L ECOUFFE,
493326011,00043,49332601100043,O,2015-12-01,,,,2022-06-26T03:38:31,true,2,,168,,RUE,DES VIVIERS,76440,MAUQUENCHY,,,76420,,,,,,,,,,,,,,,,,,,2022-03-31,F,,,,,71.12B,NAFRev2,N,1.487733,49.603974,0.94,housenumber,168 Rue des Viviers 76440 Mauquenchy,76420_0140_00168,G,168 RUE DES VIVIERS,
502261183,00029,50226118300029,O,2016-04-20,,,,2021-05-19T09:03:30,true,1,,88,,RTE,DE SOMMERY,76440,MAUQUENCHY,,,76420,,,,,,,,,,,,,,,,,,,2016-04-20,A,,,,,68.20A,NAFRev2,N,1.46899,49.598832,0.84,housenumber,88 Route de Sommery 76440 Mauquenchy,76420_0120_00088,G,88 ROUTE DE SOMMERY,
504554528,00019,50455452800019,O,2008-06-01,,,,2008-06-05T06:03:39,true,1,,168,,RUE,DES VIVIERS,76440,MAUQUENCHY,,,76420,,,,,,,,,,,,,,,,,,,2008-06-01,A,,,,,68.20B,NAFRev2,N,1.487733,49.603974,0.94,housenumber,168 Rue des Viviers 76440 Mauquenchy,76420_0140_00168,G,168 RUE DES VIVIERS,
510598014,00015,51059801400015,O,2009-02-09,,,,2012-11-10T00:32:08,true,2,,,,RUE,DES VIVIERS,76440,MAUQUENCHY,,,76420,,,,,,,,,,,,,,,,,,,2009-06-17,F,,,,,81.30Z,NAFRev2,N,1.489559,49.603253,0.94,street,Rue des Viviers 76440 Mauquenchy,76420_0140,G,RUE DES VIVIERS,
512199340,00039,51219934000039,O,2014-12-29,,,,2016-09-05T08:10:16,false,2,,690,,RTE,DE ROUEN,76440,MAUQUENCHY,,,76420,,,,,,,,,,,,,,,,,,,2016-08-01,F,,,,,47.76Z,NAFRev2,N,1.483003,49.60297,0.84,housenumber,690 Route de Rouen 76440 Mauquenchy,76420_0001_00690,G,690 ROUTE DE ROUEN,
514559491,00014,51455949100014,O,2009-09-01,,,,2012-11-10T01:13:04,true,2,,6,,RUE,DU GRAND QUESNAY,76440,MAUQUENCHY,,,76420,,,,,,,,,,,,,,,,,,,2011-07-16,A,,,,,93.29Z,NAFRev2,N,1.477314,49.603788,0.87,street,Rue du Grand Quesnay 76440 Mauquenchy,76420_0050,G,RUE DU GRAND QUESNAY,
515010767,00017,51501076700017,O,2009-10-01,,,,2023-05-03T19:36:33,true,3,,717,,RUE,DU GRAND QUESNAY,76440,MAUQUENCHY,,,76420,,,,,,,,,,,,,,,,,,,2023-05-04,A,,,,,43.99C,NAFRev2,N,1.480884,49.602967,0.94,housenumber,717 Rue du Grand Quesnay 76440 Mauquenchy,76420_0050_00717,G,717 RUE DU GRAND QUESNAY,
524118577,00013,52411857700013,O,2010-07-28,,,,2010-08-03T10:13:57,true,1,,47,,RUE,DU TILLEUL,76440,MAUQUENCHY,,,76420,,,,,,,,,,,,,,,,,,,2010-07-28,A,,,,,01.49Z,NAFRev2,N,1.474467,49.603996,0.94,housenumber,47 Rue du Tilleul 76440 Mauquenchy,76420_0130_00047,G,47 RUE DU TILLEUL,
524821931,00010,52482193100010,P,2010-09-01,NN,,,2021-02-17T11:05:16,false,3,[ND],[ND],[ND],[ND],[ND],[ND],MAUQUENCHY,,[ND],76420,[ND],[ND],,,[ND],[ND],[ND],[ND],[ND],[ND],,,[ND],,[ND],[ND],,,2013-11-30,F,[ND],[ND],[ND],[ND],74.90A,NAFRev2,O,,,0,,,,,,
528671704,00013,52867170400013,O,2011-01-01,,,,2013-05-17T19:56:56,true,1,,351,,RUE,DES VIVIERS,76440,MAUQUENCHY,,,76420,,,,,,,,,,,,,,,,,,,2011-01-01,A,,,,,01.50Z,NAFRev2,N,1.490511,49.602633,0.94,housenumber,351 Rue des Viviers 76440 Mauquenchy,76420_0140_00351,G,351 RUE DES VIVIERS,
529634446,00015,52963444600015,P,2010-12-01,,,5610CQ,2023-06-12T13:09:08,true,4,[ND],[ND],[ND],[ND],[ND],[ND],MAUQUENCHY,,[ND],76420,[ND],[ND],,,[ND],[ND],[ND],[ND],[ND],[ND],,,[ND],,[ND],[ND],,,2023-05-17,A,[ND],[ND],[ND],[ND],56.10C,NAFRev2,N,,,0,,,,,,