siren,nic,siret,statutDiffusionEtablissement,dateCreationEtablissement,trancheEffectifsEtablissement,anneeEffectifsEtablissement,activitePrincipaleRegistreMetiersEtablissement,dateDernierTraitementEtablissement,etablissementSiege,nombrePeriodesEtablissement,complementAdresseEtablissement,numeroVoieEtablissement,indiceRepetitionEtablissement,typeVoieEtablissement,libelleVoieEtablissement,codePostalEtablissement,libelleCommuneEtablissement,libelleCommuneEtrangerEtablissement,distributionSpecialeEtablissement,codeCommuneEtablissement,codeCedexEtablissement,libelleCedexEtablissement,codePaysEtrangerEtablissement,libellePaysEtrangerEtablissement,complementAdresse2Etablissement,numeroVoie2Etablissement,indiceRepetition2Etablissement,typeVoie2Etablissement,libelleVoie2Etablissement,codePostal2Etablissement,libelleCommune2Etablissement,libelleCommuneEtranger2Etablissement,distributionSpeciale2Etablissement,codeCommune2Etablissement,codeCedex2Etablissement,libelleCedex2Etablissement,codePaysEtranger2Etablissement,libellePaysEtranger2Etablissement,dateDebut,etatAdministratifEtablissement,enseigne1Etablissement,enseigne2Etablissement,enseigne3Etablissement,denominationUsuelleEtablissement,activitePrincipaleEtablissement,nomenclatureActivitePrincipaleEtablissement,caractereEmployeurEtablissement,longitude,latitude,geo_score,geo_type,geo_adresse,geo_id,geo_ligne,geo_l4,geo_l5
218102986,00013,21810298600013,O,1983-03-01,02,2021,,2023-11-27T13:25:34,true,4,,,,,,81500,TEULAT,,,81298,,,,,,,,,,,,,,,,,,,2008-01-01,A,MAIRIE,,,,84.11Z,NAFRev2,O,,,0,,,,,,
218102986,00039,21810298600039,O,2007-09-01,02,2021,,2023-11-27T13:25:34,false,2,,,,,,81500,TEULAT,,,81298,,,,,,,,,,,,,,,,,,,2008-01-01,A,ECOLE ELEMENTAIRE PUBLIQUE,,,,85.20Z,NAFRev2,N,,,0,,,,,,
218102986,00047,21810298600047,O,2018-01-29,,,,2023-07-27T09:34:02,false,1,,,,,,81500,TEULAT,,,81298,,,,,,,,,,,,,,,,,,,2018-01-29,A,ASSAINISSEMENT,,,,37.00Z,NAFRev2,N,,,0,,,,,,
268103967,00017,26810396700017,O,1984-11-20,NN,,,2017-08-06T14:19:32,true,4,,,,,MAIRIE,81500,TEULAT,,,81298,,,,,,,,,,,,,,,,,,,2017-08-01,F,CCAS,,,,88.99B,NAFRev2,N,1.712295,43.642337,0.38,street,Chemin de la Callerie 81500 Teulat,81298_0008,G,CHEMIN DE LA CALLERIE,
298107194,00011,29810719400011,O,1983-09-14,NN,,,2015-05-14T03:53:34,true,3,,,,,MAIRIE,81500,TEULAT,,,81298,,,,,,,,,,,,,,,,,,,2008-01-01,A,,,,,42.99Z,NAFRev2,N,1.712295,43.642337,0.38,street,Chemin de la Callerie 81500 Teulat,81298_0008,G,CHEMIN DE LA CALLERIE,
302261185,00011,30226118500011,O,,NN,,,2006-11-25T09:14:24,true,1,,,,,,81500,TEULAT,,,81298,,,,,,,,,,,,,,,,,,,1988-07-31,F,,,,,97.23,NAP,N,,,0,,,,,,
306043894,00014,30604389400014,O,1900-01-01,NN,,,2008-11-07T00:21:48,true,4,,,,LD,MONTAUCEL BAS,81500,TEULAT,,,81298,,,,,,,,,,,,,,,,,,,1993-09-28,F,,,,,45.4C,NAF1993,N,1.719696,43.622546,0.35,street,Impasse de la Montagne 81500 Teulat,81298_0029,G,IMPASSE DE LA MONTAGNE,
306158577,00016,30615857700016,O,,,,,,true,1,,,,LD,NAGASSE,81500,TEULAT,,,81298,,,,,,,,,,,,,,,,,,,1984-12-25,F,,,,,,,N,1.695929,43.636048,0.45,street,Impasse de la Batisse 81500 Teulat,81298_0004,G,IMPASSE DE LA BATISSE,
306914607,00016,30691460700016,O,,NN,,,,true,1,,,,LD,MONTAUCEL BAS,81500,TEULAT,,,81298,,,,,,,,,,,,,,,,,,,1991-05-03,F,,,,,55.71,NAP,N,1.719696,43.622546,0.35,street,Impasse de la Montagne 81500 Teulat,81298_0029,G,IMPASSE DE LA MONTAGNE,
306925439,00037,30692543900037,O,1998-04-01,,,,,true,1,,,,,MONTAUSEL BAS,81500,TEULAT,,,81298,,,,,,,,,,,,,,,,,,,2000-07-31,F,,,,,45.2L,NAF1993,N,1.719696,43.622546,0.35,street,Impasse de la Montagne 81500 Teulat,81298_0029,G,IMPASSE DE LA MONTAGNE,
309356806,00039,30935680600039,O,2003-01-01,NN,,,2018-11-16T04:31:15,true,4,,,,,PUGNERES,81500,TEULAT,,,81298,,,,,,,,,,,,,,,,,,,2018-11-09,F,,,,,96.09Z,NAFRev2,N,1.713612,43.63537,0.92,street,Route de Pugneres 81500 Teulat,81298_0038,G,ROUTE DE PUGNERES,
311694632,00010,31169463200010,O,1978-01-01,NN,,,2008-11-07T00:26:38,true,4,,,,,EN BERDIE,81500,TEULAT,,,81298,,,,,,,,,,,,,,,,,,,2003-02-28,F,,,,,45.2V,NAFRev1,N,1.713844,43.651102,0.37,street,Impasse En Bayrolles 81500 Teulat,81298_0005,G,IMPASSE EN BAYROLLES,
313245649,00022,31324564900022,O,1978-07-01,NN,,,2008-11-07T00:28:29,false,3,,,,,LE FUSTIER,81500,TEULAT,,,81298,,,,,,,,,,,,,,,,,,,1997-10-01,F,,,,,28.6D,NAF1993,,1.707157,43.640972,0.51,street,Impasse En Fustié 81500 Teulat,81298_0018,G,IMPASSE EN FUSTIE,
313284119,00010,31328411900010,O,,,,,,true,1,,,,,,81500,TEULAT,,,81298,,,,,,,,,,,,,,,,,,,,F,,,,,81.21,NAP,N,,,0,,,,,,
313739039,00011,31373903900011,O,1978-01-01,NN,,,,true,3,,,,,,81500,TEULAT,,,81298,,,,,,,,,,,,,,,,,,,2003-11-30,F,,,,,45.2V,NAFRev1,,,,0,,,,,,
316261155,00014,31626115500014,O,,NN,,,,true,1,,,,LD,LE PRE LONG,81500,TEULAT,,,81298,,,,,,,,,,,,,,,,,,,,F,,,,,56.01,NAP,N,6.5599343,44.9461041,0.88,poi.platform,La Salle - Villeneuve Pré Long - RN 91 (Plateforme) La Salle-les-Alpes,https://osm.org/way/266576996,G,,
322946773,00023,32294677300023,O,,,,,,true,1,,,,,LE RODIER,81500,TEULAT,,,81298,,,,,,,,,,,,,,,,,,,1984-12-25,F,,,,,64.49,NAP,N,1.724278,43.628181,0.38,street,Route de Montcabrier 81500 Teulat,81298_0030,G,ROUTE DE MONTCABRIER,
325098341,00010,32509834100010,P,1982-07-01,NN,,,2019-09-28T04:01:38,true,6,[ND],[ND],[ND],[ND],[ND],[ND],TEULAT,,[ND],81298,[ND],[ND],,,[ND],[ND],[ND],[ND],[ND],[ND],,,[ND],,[ND],[ND],,,2018-07-31,F,[ND],[ND],[ND],[ND],01.61Z,NAFRev2,O,,,0,,,,,,
325098341,00028,32509834100028,P,1994-01-01,NN,,,2018-08-22T08:11:17,false,4,[ND],[ND],[ND],[ND],[ND],[ND],TEULAT,,[ND],81298,[ND],[ND],,,[ND],[ND],[ND],[ND],[ND],[ND],,,[ND],,[ND],[ND],,,2018-07-31,F,[ND],[ND],[ND],[ND],01.11Z,NAFRev2,N,,,0,,,,,,
329704118,00010,32970411800010,O,,,,,,true,1,,,,,EN BAYROLIS,81500,TEULAT,,,81298,,,,,,,,,,,,,,,,,,,1997-12-25,F,,,,,91.3E,NAF1993,N,1.713844,43.651102,0.69,street,Impasse En Bayrolles 81500 Teulat,81298_0005,G,IMPASSE EN BAYROLLES,
329704126,00013,32970412600013,O,,NN,,,2006-11-25T10:11:37,true,1,,,,,EN COLX,81500,TEULAT,,,81298,,,,,,,,,,,,,,,,,,,,F,,,,,95.12,NAP,N,1.709375,43.628063,0.45,street,Impasse En Carpet 81500 Teulat,81298_0009,G,IMPASSE EN CARPET,
331706622,00015,33170662200015,O,1985-02-01,NN,,,2014-10-31T19:40:18,true,4,,,,LD,EN VERDIE,81500,TEULAT,,,81298,,,,,,,,,,,,,,,,,,,2001-11-02,F,,,,,01.1A,NAF1993,N,1.725905,43.650646,0.38,street,Chemin En Vigne 81500 Teulat,81298_0044,G,CHEMIN EN VIGNE,
339550113,00015,33955011300015,O,1986-09-03,NN,,,2008-01-04T21:31:46,true,3,,,,,,81500,TEULAT,,,81298,,,,,,,,,,,,,,,,,,,2008-01-01,A,,,,,56.29B,NAFRev2,N,,,0,,,,,,
341231389,00014,34123138900014,O,,,,,,true,1,,,,,L'ORMETTE,81500,TEULAT,,,81298,,,,,,,,,,,,,,,,,,,1987-09-30,F,,,,,79.01,NAP,N,2.3189044,47.8318174,0.88,poi.industrial,ZA de l'Ormette (Zone industrielle) Saint-Benoît-sur-Loire,https://osm.org/way/486313593,G,,
351973920,00017,35197392000017,O,,NN,,,,true,1,,,,,EN GALAUP,81500,TEULAT,,,81298,,,,,,,,,,,,,,,,,,,1993-11-30,F,,,,,01.1A,NAF1993,N,1.71628,43.630338,0.46,street,Impasse En Garric 81500 Teulat,81298_0021,G,IMPASSE EN GARRIC,
380020107,00013,38002010700013,O,,NN,,,,true,1,,,,,LA NAGASSE,81500,TEULAT,,,81298,,,,,,,,,,,,,,,,,,,1991-09-30,F,,,,,67.01,NAP,O,1.695929,43.636048,0.51,street,Impasse de la Batisse 81500 Teulat,81298_0004,G,IMPASSE DE LA BATISSE,
383152782,00132,38315278200132,O,2004-04-01,NN,,,2007-05-19T11:04:42,false,4,,,,,,81500,TEULAT,,,81298,,,,,,,,,,,,,,,,,,,2005-12-27,F,,,,,74.3B,NAFRev1,O,,,0,,,,,,
383770062,00024,38377006200024,O,1998-01-01,NN,,,2014-07-08T01:09:34,false,6,,,,,MONTAUCEL BAS,81500,TEULAT,,,81298,,,,,,,,,,,,,,,,,,,2009-01-19,F,,,,,16.23Z,NAFRev2,N,1.719696,43.622546,0.35,street,Impasse de la Montagne 81500 Teulat,81298_0029,G,IMPASSE DE LA MONTAGNE,
384130555,00012,38413055500012,O,,NN,,,,true,1,,,,LD,LA NAGASSE,81500,TEULAT,,,81298,,,,,,,,,,,,,,,,,,,1995-07-31,F,,,,,92.3H,NAF1993,N,1.695929,43.636048,0.51,street,Impasse de la Batisse 81500 Teulat,81298_0004,G,IMPASSE DE LA BATISSE,
387460728,00026,38746072800026,O,1999-06-01,NN,,,2009-06-27T06:46:17,false,3,,,,,L'OBIT,81500,TEULAT,,,81298,,,,,,,,,,,,,,,,,,,2007-04-19,F,,,,,28.3C,NAFRev1,O,1.721392,43.642929,0.91,street,Chemin de l’Obit 81500 Teulat,81298_0035,G,CHEMIN DE L OBIT,
387540651,00040,38754065100040,P,2009-12-02,,,,2021-12-09T11:09:31,false,1,[ND],[ND],[ND],[ND],[ND],[ND],TEULAT,,[ND],81298,[ND],[ND],,,[ND],[ND],[ND],[ND],[ND],[ND],,,[ND],,[ND],[ND],,,2009-12-02,A,[ND],[ND],[ND],[ND],96.02B,NAFRev2,N,,,0,,,,,,
390723120,00049,39072312000049,O,1997-12-01,,,,2014-07-08T01:18:01,false,4,,,,LD,EN BIROBIAN,81500,TEULAT,,,81298,,,,,,,,,,,,,,,,,,,2008-10-01,F,,,,,43.99C,NAFRev2,N,1.713844,43.651102,0.32,street,Impasse En Bayrolles 81500 Teulat,81298_0005,G,IMPASSE EN BAYROLLES,
390723120,00056,39072312000056,O,2008-10-01,,,4399CZ,2022-05-17T14:12:19,true,1,,1,,PAS,DU MENUISIER,81500,TEULAT,,,81298,,,,,,,,,,,,,,,,,,,2008-10-01,A,,,,,43.99C,NAFRev2,N,1.697682,43.63535,0.84,housenumber,1 Passage du Menuisier 81500 Teulat,81298_0028_00001,G,1 PASSAGE DU MENUISIER,
392028783,00026,39202878300026,O,1994-09-15,NN,,,2009-02-03T05:09:52,true,4,,,,,LA PLANE,81500,TEULAT,,,81298,,,,,,,,,,,,,,,,,,,2005-09-01,F,,,,,51.5L,NAFRev1,O,1.728091,43.635166,0.41,street,Route de la Mouline 81500 Teulat,81298_0031,G,ROUTE DE LA MOULINE,
394095244,00015,39409524400015,O,1972-07-15,NN,,,,true,3,,,,,EN BIREBIAU,81500,TEULAT,,,81298,,,,,,,,,,,,,,,,,,,2003-12-01,F,,,,,01.1A,NAFRev1,N,1.713844,43.651102,0.32,street,Impasse En Bayrolles 81500 Teulat,81298_0005,G,IMPASSE EN BAYROLLES,
394431019,00055,39443101900055,O,2018-03-29,,,,2018-05-21T03:33:28,true,1,,,,,LD FOURNERIE,81500,TEULAT,,,81298,,,,,,,,,,,,,,,,,,,2018-03-29,A,,,,,90.03B,NAFRev2,N,1.712295,43.642337,0.37,street,Chemin de la Callerie 81500 Teulat,81298_0008,G,CHEMIN DE LA CALLERIE,
399054592,00015,39905459200015,O,,,,,,true,1,,,,RTE,DE PUYLAURENS,81500,TEULAT,,,81298,,,,,,,,,,,,,,,,,,,1997-03-31,F,,,,,74.1G,NAF1993,N,1.696023,43.629436,0.84,street,Route de Puylaurens 81500 Teulat,81298_0039,G,ROUTE DE PUYLAURENS,
399556141,00014,39955614100014,P,1994-07-23,NN,,,,false,4,[ND],[ND],[ND],[ND],[ND],[ND],TEULAT,,[ND],81298,[ND],[ND],,,[ND],[ND],[ND],[ND],[ND],[ND],,,[ND],,[ND],[ND],,,1998-01-01,F,[ND],[ND],[ND],[ND],85.1G,NAF1993,N,,,0,,,,,,
399979467,00020,39997946700020,O,2012-10-01,,,,2014-09-23T08:43:38,false,2,,,,LD,BEL AIR,81500,TEULAT,,,81298,,,,,,,,,,,,,,,,,,,2014-09-18,F,,,,,46.19B,NAFRev2,N,1.709008,43.637389,0.33,street,Impasse Bellevue 81500 Teulat,81298_0006,G,IMPASSE BELLEVUE,
400391165,00026,40039116500026,O,1999-01-01,NN,,,,true,1,,,,,MONTAUCEL,81500,TEULAT,,,81298,,,,,,,,,,,,,,,,,,,2001-12-31,F,,,,,70.3A,NAF1993,N,1.719696,43.622546,0.46,street,Impasse de la Montagne 81500 Teulat,81298_0029,G,IMPASSE DE LA MONTAGNE,
400811477,00019,40081147700019,O,1995-04-25,NN,,,,true,1,,,,LD,LA NAGASSE,81500,TEULAT,,,81298,,,,,,,,,,,,,,,,,,,1998-11-06,F,,,,,55.3A,NAF1993,N,1.695929,43.636048,0.51,street,Impasse de la Batisse 81500 Teulat,81298_0004,G,IMPASSE DE LA BATISSE,
402006563,00017,40200656300017,O,1995-09-01,NN,,,,true,1,,,,LD,LA NAGASSE,81500,TEULAT,,,81298,,,,,,,,,,,,,,,,,,,1997-11-21,F,,,,,92.3H,NAF1993,O,1.695929,43.636048,0.51,street,Impasse de la Batisse 81500 Teulat,81298_0004,G,IMPASSE DE LA BATISSE,
403138993,00015,40313899300015,O,1995-12-01,NN,,,,false,4,,,,,LE VILLAGE,81500,TEULAT,,,81298,,,,,,,,,,,,,,,,,,,2001-03-01,F,PAYSAGES FRUITIERS,,,,01.4B,NAF1993,N,2.2950702,48.9311749,0.9,poi.bar,bar le village Gennevilliers,https://osm.org/node/3287755128,G,,
405090044,00018,40509004400018,O,1963-01-01,NN,,,,true,1,,,,,EN PAULET,81500,TEULAT,,,81298,,,,,,,,,,,,,,,,,,,1999-12-31,F,,,,,01.3Z,NAF1993,N,1.709375,43.628063,0.38,street,Impasse En Carpet 81500 Teulat,81298_0009,G,IMPASSE EN CARPET,
405090051,00013,40509005100013,O,,NN,,,,true,1,,,,,EN VIGNES,81500,TEULAT,,,81298,,,,,,,,,,,,,,,,,,,1997-09-30,F,,,,,01.3Z,NAF1993,N,1.725905,43.650646,0.73,street,Chemin En Vigne 81500 Teulat,81298_0044,G,CHEMIN EN VIGNE,
405090069,00015,40509006900015,O,1971-01-01,NN,,,2006-10-28T03:26:09,true,3,,,,,PUGNERE,81500,TEULAT,,,81298,,,,,,,,,,,,,,,,,,,2005-08-31,F,,,,,01.1A,NAFRev1,N,1.713612,43.63537,0.8,street,Route de Pugneres 81500 Teulat,81298_0038,G,ROUTE DE PUGNERES,
405090077,00018,40509007700018,O,1976-01-01,NN,,,2017-01-16T11:31:15,true,3,,,,,EN GARRIC,81500,TEULAT,,,81298,,,,,,,,,,,,,,,,,,,2008-01-01,A,,,,,01.11Z,NAFRev2,N,1.71628,43.630338,0.91,street,Impasse En Garric 81500 Teulat,81298_0021,G,IMPASSE EN GARRIC,
405090085,00011,40509008500011,O,1981-01-01,NN,,,2019-01-10T14:24:01,true,5,,,,,PUGNERES,81500,TEULAT,,,81298,,,,,,,,,,,,,,,,,,,2018-12-31,F,,,,,01.11Z,NAFRev2,N,1.713612,43.63537,0.92,street,Route de Pugneres 81500 Teulat,81298_0038,G,ROUTE DE PUGNERES,
405090093,00015,40509009300015,O,1994-11-01,NN,,,2023-05-05T20:37:50,true,4,,,,,LA REVELLE,81500,TEULAT,,,81298,,,,,,,,,,,,,,,,,,,2016-12-25,F,,,,,01.11Z,NAFRev2,N,1.698291,43.632448,0.92,street,Chemin de la Revelle 81500 Teulat,81298_0040,G,CHEMIN DE LA REVELLE,
405134370,00015,40513437000015,O,,NN,,,,true,1,,,,,FOURNEZY,81500,TEULAT,,,81298,,,,,,,,,,,,,,,,,,,1997-10-19,F,,,,,01.4A,NAF1993,N,,,0,,,,,,
407899103,00078,40789910300078,P,2023-04-24,,,,2023-06-03T11:49:11,true,1,[ND],[ND],[ND],[ND],[ND],[ND],TEULAT,,[ND],81298,[ND],[ND],,,[ND],[ND],[ND],[ND],[ND],[ND],,,[ND],,[ND],[ND],,,2023-04-08,A,[ND],[ND],[ND],[ND],86.22C,NAFRev2,N,,,0,,,,,,
408058352,00027,40805835200027,O,2002-11-01,NN,,,2014-04-07T08:51:21,true,3,,,,,LA REVELLE,81500,TEULAT,,,81298,,,,,,,,,,,,,,,,,,,2008-01-01,A,,,,,85.59B,NAFRev2,N,1.698291,43.632448,0.92,street,Chemin de la Revelle 81500 Teulat,81298_0040,G,CHEMIN DE LA REVELLE,
408445112,00019,40844511200019,O,1983-11-01,NN,,,2021-01-21T12:18:51,true,4,,,,,EN GALAUP,81500,TEULAT,,,81298,,,,,,,,,,,,,,,,,,,2020-12-31,F,,,,,01.11Z,NAFRev2,N,1.71628,43.630338,0.46,street,Impasse En Garric 81500 Teulat,81298_0021,G,IMPASSE EN GARRIC,
409590130,00012,40959013000012,O,,NN,,,,true,1,,,,,EN BRANQUE,81500,TEULAT,,,81298,,,,,,,,,,,,,,,,,,,1997-09-01,F,,,,,70.2C,NAF1993,N,1.713844,43.651102,0.34,street,Impasse En Bayrolles 81500 Teulat,81298_0005,G,IMPASSE EN BAYROLLES,
409740354,00017,40974035400017,O,1900-01-01,NN,,,2011-05-03T00:28:03,false,3,,,,,LE PRELONG,81500,TEULAT,,,81298,,,,,,,,,,,,,,,,,,,1997-09-30,F,,,,,51.1R,NAF1993,N,6.5598072,44.9454896,0.88,poi,Route de Prélong (Pont) La Salle-les-Alpes,https://osm.org/way/33183758,G,,
409786852,00023,40978685200023,O,2020-11-27,,,,2021-04-13T19:34:11,true,1,,4,,RTE,DE MONTCABRIER,81500,TEULAT,,,81298,,,,,,,,,,,,,,,,,,,2020-11-27,A,,,,,68.20A,NAFRev2,N,1.709688,43.630502,0.86,housenumber,4 Route de Montcabrier 81500 Teulat,81298_0030_00004,G,4 ROUTE DE MONTCABRIER,
410591184,00024,41059118400024,O,2009-01-06,,,,2020-12-08T08:44:36,true,2,,,,,LA REVELLE,81500,TEULAT,,,81298,,,,,,,,,,,,,,,,,,,2020-12-04,F,,,,,96.04Z,NAFRev2,N,1.698291,43.632448,0.92,street,Chemin de la Revelle 81500 Teulat,81298_0040,G,CHEMIN DE LA REVELLE,
411822505,00011,41182250500011,O,1997-04-02,NN,,,2010-01-10T05:23:46,true,4,,,,,AUX VIGNES,81500,TEULAT,,,81298,,,,,,,,,,,,,,,,,,,2009-12-29,F,,,,,96.09Z,NAFRev2,N,1.725905,43.650646,0.43,street,Chemin En Vigne 81500 Teulat,81298_0044,G,CHEMIN EN VIGNE,
411895592,00011,41189559200011,O,1997-04-08,NN,,,,false,4,,,,,LE CHATEAU,81500,TEULAT,,,81298,,,,,,,,,,,,,,,,,,,2002-10-01,F,,,,,92.3B,NAF1993,N,1.713552,43.640829,0.68,street,Chemin du Chateau d’Eau 81500 Teulat,81298_0010,G,CHEMIN DU CHATEAU D EAU,
412617979,00015,41261797900015,O,1997-06-01,NN,,,,false,4,,,,LD,LA PLANE,81500,TEULAT,,,81298,,,,,,,,,,,,,,,,,,,1999-02-17,F,,,,,51.5L,NAF1993,O,1.728091,43.635166,0.41,street,Route de la Mouline 81500 Teulat,81298_0031,G,ROUTE DE LA MOULINE,
412687642,00030,41268764200030,O,2010-01-01,,,,2020-01-15T03:54:23,true,1,,,,,PUGNERES,81500,TEULAT,,,81298,,,,,,,,,,,,,,,,,,,2010-01-01,A,,,,,90.01Z,NAFRev2,N,1.713612,43.63537,0.92,street,Route de Pugneres 81500 Teulat,81298_0038,G,ROUTE DE PUGNERES,
413120320,00093,41312032000093,O,2005-12-27,NN,,,2020-08-25T10:40:55,false,3,,,,,,81500,TEULAT,,,81298,,,,,,,,,,,,,,,,,,,2018-02-01,F,,,,,71.20B,NAFRev2,O,,,0,,,,,,
414573774,00018,41457377400018,O,1997-10-01,NN,,,2008-03-23T04:49:38,true,3,,,,,EN VIGNE,81500,TEULAT,,,81298,,,,,,,,,,,,,,,,,,,2008-01-01,A,,,,,01.50Z,NAFRev2,N,1.725905,43.650646,0.92,street,Chemin En Vigne 81500 Teulat,81298_0044,G,CHEMIN EN VIGNE,
415409929,00023,41540992900023,O,2000-02-28,NN,,,2018-07-30T12:44:34,false,4,,,,LD,CANTECOUQUI,81500,TEULAT,,,81298,,,,,,,,,,,,,,,,,,,2018-07-01,F,,,,,70.22Z,NAFRev2,N,,,0,,,,,,
419492319,00019,41949231900019,O,1997-01-01,NN,,,2008-01-04T23:37:37,true,3,,,,,,81500,TEULAT,,,81298,,,,,,,,,,,,,,,,,,,2008-01-01,A,,,,,01.11Z,NAFRev2,N,,,0,,,,,,
420150013,00050,42015001300050,O,2022-06-30,,,,2023-06-01T13:28:23,false,2,,2,,RTE,DES COTEAUX,81500,TEULAT,,,81298,,,,,,,,,,,,,,,,,,,2023-05-15,F,,,,,86.90E,NAFRev2,N,1.69847,43.635758,0.85,housenumber,2 Route des Coteaux 81500 Teulat,81298_0012_00002,G,2 ROUTE DES COTEAUX,
420150013,00068,42015001300068,O,2023-05-15,,,,2023-06-03T11:29:19,true,1,LOT. LES HAUTS DE COCAGNE,12,,CHE,DE COCAGNE,81500,TEULAT,,,81298,,,,,,,,,,,,,,,,,,,2023-05-15,A,,,,,86.90E,NAFRev2,N,1.714329,43.634788,0.38,housenumber,12 Route de Pugneres 81500 Teulat,81298_0038_00012,G,12 ROUTE DE PUGNERES,
425246774,00011,42524677400011,O,1975-01-01,NN,,,2013-02-09T12:39:55,true,4,,,,,LA REVELE,81500,TEULAT,,,81298,,,,,,,,,,,,,,,,,,,2012-12-25,F,,,,,01.11Z,NAFRev2,N,1.698291,43.632448,0.83,street,Chemin de la Revelle 81500 Teulat,81298_0040,G,CHEMIN DE LA REVELLE,
425277514,00013,42527751400013,O,1970-01-01,NN,,,2023-07-03T20:28:58,true,4,,,,,LA LENELLE,81500,TEULAT,,,81298,,,,,,,,,,,,,,,,,,,2015-12-25,F,,,,,01.11Z,NAFRev2,N,1.698291,43.632448,0.51,street,Chemin de la Revelle 81500 Teulat,81298_0040,G,CHEMIN DE LA REVELLE,
425277522,00016,42527752200016,O,1974-01-01,NN,,,2023-07-03T20:28:58,true,4,,,,,LA PLAINE,81500,TEULAT,,,81298,,,,,,,,,,,,,,,,,,,2016-12-25,F,,,,,01.11Z,NAFRev2,N,1.728091,43.635166,0.46,street,Route de la Mouline 81500 Teulat,81298_0031,G,ROUTE DE LA MOULINE,
428217368,00011,42821736800011,O,1991-01-01,NN,,,,false,4,,,,,NAREMUS,81500,TEULAT,,,81298,,,,,,,,,,,,,,,,,,,2003-01-01,F,,,,,92.3A,NAF1993,N,,,0,,,,,,
429700289,00011,42970028900011,O,1998-09-01,NN,,,,true,3,,,,,LA NAGASSE,81500,TEULAT,,,81298,,,,,,,,,,,,,,,,,,,2003-06-02,F,,,,,70.2C,NAFRev1,N,1.695929,43.636048,0.51,street,Impasse de la Batisse 81500 Teulat,81298_0004,G,IMPASSE DE LA BATISSE,
431623008,00015,43162300800015,O,2000-05-01,NN,,,2021-02-02T03:45:43,true,4,,18,B,RTE,DU GIROU,81500,TEULAT,,,81298,,,,,,,,,,,,,,,,,,,2020-06-30,F,,,,,93.29Z,NAFRev2,N,1.692246,43.628895,0.74,housenumber,18bis Route du Girou 81500 Teulat,81298_0022_00018_bis,G,18BIS ROUTE DU GIROU,
432311520,00022,43231152000022,O,2019-07-01,,,,2021-02-23T13:13:28,true,1,,6,,CHE,EN GRELOU,81500,TEULAT,,,81298,,,,,,,,,,,,,,,,,,,2019-07-01,A,,,,,70.22Z,NAFRev2,N,1.710183,43.646425,0.83,housenumber,6 Chemin En Grelou 81500 Teulat,81298_0023_00006,G,6 CHEMIN EN GRELOU,
432622926,00017,43262292600017,O,2000-08-01,NN,,,2008-03-26T03:49:00,true,3,,,,,LE BOURG,81500,TEULAT,,,81298,,,,,,,,,,,,,,,,,,,2007-06-30,F,,,,,55.3B,NAFRev1,N,1.697364,43.635048,0.62,street,Place du Bourg 81500 Teulat,81298_0007,G,PLACE DU BOURG,
433494036,00026,43349403600026,O,2011-09-01,,,,2021-02-23T13:15:02,true,1,,3,,,CHE D'EN VIGNE,81500,TEULAT,,,81298,,,,,,,,,,,,,,,,,,,2011-09-01,A,,,,,64.20Z,NAFRev2,N,1.723627,43.653932,0.72,housenumber,3 Chemin En Vigne 81500 Teulat,81298_0044_00003,G,3 CHEMIN EN VIGNE,
434109195,00033,43410919500033,O,2016-06-15,,,,2019-06-07T14:13:14,true,2,LE BOURG,,,LD,FOURNERI,81500,TEULAT,,,81298,,,,,,,,,,,,,,,,,,,2018-09-30,F,,,,,58.14Z,NAFRev2,N,1.697364,43.635048,0.34,street,Place du Bourg 81500 Teulat,81298_0007,D,PLACE DU BOURG,
434207254,00021,43420725400021,O,2003-07-15,NN,,,2018-03-01T14:44:12,false,4,,,,,BORDE BLANQUE,81500,TEULAT,,,81298,,,,,,,,,,,,,,,,,,,2018-01-18,F,,,,,71.12B,NAFRev2,N,,,0,,,,,,
434207254,00039,43420725400039,O,2018-01-18,,,,2022-11-23T12:29:26,false,2,,1,,RTE,DE LA MOULINE,81500,TEULAT,,,81298,,,,,,,,,,,,,,,,,,,2022-09-01,F,,,,,71.12B,NAFRev2,N,1.725693,43.63501,0.85,housenumber,1 Route de la Mouline 81500 Teulat,81298_0031_00001,G,1 ROUTE DE LA MOULINE,
435261532,00020,43526153200020,O,2018-08-01,,,,2021-02-23T13:17:24,true,1,,6,,CHE,EN GRELOU,81500,TEULAT,,,81298,,,,,,,,,,,,,,,,,,,2018-08-01,A,,,,,70.22Z,NAFRev2,N,1.710183,43.646425,0.83,housenumber,6 Chemin En Grelou 81500 Teulat,81298_0023_00006,G,6 CHEMIN EN GRELOU,
437621543,00010,43762154300010,O,2001-04-02,NN,,,2008-01-04T19:54:06,true,3,,,,,LA REVELLE,81500,TEULAT,,,81298,,,,,,,,,,,,,,,,,,,2008-01-01,A,,,,,90.01Z,NAFRev2,N,1.698291,43.632448,0.92,street,Chemin de la Revelle 81500 Teulat,81298_0040,G,CHEMIN DE LA REVELLE,
437712417,00017,43771241700017,O,2000-01-01,NN,,,2008-02-27T09:56:10,true,3,,,,,EN PAULET,81500,TEULAT,,,81298,,,,,,,,,,,,,,,,,,,2007-09-30,F,,,,,01.1A,NAFRev1,N,1.709375,43.628063,0.38,street,Impasse En Carpet 81500 Teulat,81298_0009,G,IMPASSE EN CARPET,
439713512,00010,43971351200010,O,2001-11-02,NN,,,2010-11-16T00:19:02,false,3,,,,,EN COLX,81500,TEULAT,,,81298,,,,,,,,,,,,,,,,,,,2005-05-23,F,,,,,52.6E,NAFRev1,N,1.709375,43.628063,0.45,street,Impasse En Carpet 81500 Teulat,81298_0009,G,IMPASSE EN CARPET,
439909748,00014,43990974800014,O,1997-01-01,NN,,,2016-01-12T00:23:45,true,3,,,,,,81500,TEULAT,,,81298,,,,,,,,,,,,,,,,,,,2008-01-01,A,,,,,01.61Z,NAFRev2,N,,,0,,,,,,
441085974,00026,44108597400026,O,2018-12-12,,,,2021-02-23T13:22:30,true,1,,4,,CHE,DU CHATEAU D'EAU,81500,TEULAT,,,81298,,,,,,,,,,,,,,,,,,,2018-12-12,A,,,,,68.20B,NAFRev2,N,1.717593,43.637479,0.85,housenumber,4 Chemin du Chateau d’Eau 81500 Teulat,81298_0010_00004,G,4 CHEMIN DU CHATEAU D EAU,
442570099,00014,44257009900014,O,2001-06-26,NN,,,,false,4,,,,,LE CHATEAU,81500,TEULAT,,,81298,,,,,,,,,,,,,,,,,,,2003-06-01,F,,,,,74.1J,NAFRev1,N,1.713552,43.640829,0.68,street,Chemin du Chateau d’Eau 81500 Teulat,81298_0010,G,CHEMIN DU CHATEAU D EAU,
442570099,00022,44257009900022,O,2003-06-01,NN,,,2009-05-18T17:09:02,true,3,,,,,LE CHATEAU,81500,TEULAT,,,81298,,,,,,,,,,,,,,,,,,,2008-01-01,A,,,,,70.22Z,NAFRev2,N,1.713552,43.640829,0.68,street,Chemin du Chateau d’Eau 81500 Teulat,81298_0010,G,CHEMIN DU CHATEAU D EAU,
444025647,00025,44402564700025,O,2014-04-15,,,8121ZZ,2019-10-21T15:03:01,true,3,,12,,IMP,EN CARPET,81500,TEULAT,,,81298,,,,,,,,,,,,,,,,,,,2018-07-01,A,,,,,81.21Z,NAFRev2,N,1.709873,43.627756,0.83,housenumber,12 Impasse En Carpet 81500 Teulat,81298_0009_00012,G,12 IMPASSE EN CARPET,
448190447,00038,44819044700038,O,2016-06-15,,,,2021-07-06T10:50:07,true,1,,2,,RTE,DE LA BALERME LIEU DIT EN FOURNE,81500,TEULAT,,,81298,,,,,,,,,,,,,,,,,,,2016-06-15,A,,,,,58.14Z,NAFRev2,N,1.698354,43.635916,0.51,housenumber,2 Route de la Balerme 81500 Teulat,81298_0003_00002,G,2 ROUTE DE LA BALERME,
449877364,00025,44987736400025,O,2015-11-01,,,,2017-02-14T04:11:22,true,2,,,,,EN VERDIE,81500,TEULAT,,,81298,,,,,,,,,,,,,,,,,,,2016-07-03,F,,,,,47.81Z,NAFRev2,N,1.725905,43.650646,0.38,street,Chemin En Vigne 81500 Teulat,81298_0044,G,CHEMIN EN VIGNE,
449956119,00027,44995611900027,O,2004-05-01,,,,2017-12-25T03:34:34,true,7,,,,,DAREN,81500,TEULAT,,,81298,,,,,,,,,,,,,,,,,,,2017-11-30,F,,,,,70.22Z,NAFRev2,N,1.714,43.626541,0.91,street,Route de Daren 81500 Teulat,81298_0013,G,ROUTE DE DAREN,
450062807,00018,45006280700018,O,2002-11-01,NN,,,2023-10-18T10:37:17,true,3,,35,,RTE,DES COTEAUX,81500,TEULAT,,,81298,,,,,,,,,,,,,,,,,,,2023-10-02,A,,,,TR SERVICES,43.29B,NAFRev2,N,1.71688,43.644939,0.85,housenumber,35 Route des Coteaux 81500 Teulat,81298_0012_00035,G,35 ROUTE DES COTEAUX,
450286406,00019,45028640600019,O,2003-04-01,,,,2017-04-13T03:48:19,true,4,,,,,LA REVELLE,81500,TEULAT,,,81298,,,,,,,,,,,,,,,,,,,2012-12-06,F,,,,,85.59B,NAFRev2,O,1.698291,43.632448,0.92,street,Chemin de la Revelle 81500 Teulat,81298_0040,G,CHEMIN DE LA REVELLE,