siren,nic,siret,statutDiffusionEtablissement,dateCreationEtablissement,trancheEffectifsEtablissement,anneeEffectifsEtablissement,activitePrincipaleRegistreMetiersEtablissement,dateDernierTraitementEtablissement,etablissementSiege,nombrePeriodesEtablissement,complementAdresseEtablissement,numeroVoieEtablissement,indiceRepetitionEtablissement,typeVoieEtablissement,libelleVoieEtablissement,codePostalEtablissement,libelleCommuneEtablissement,libelleCommuneEtrangerEtablissement,distributionSpecialeEtablissement,codeCommuneEtablissement,codeCedexEtablissement,libelleCedexEtablissement,codePaysEtrangerEtablissement,libellePaysEtrangerEtablissement,complementAdresse2Etablissement,numeroVoie2Etablissement,indiceRepetition2Etablissement,typeVoie2Etablissement,libelleVoie2Etablissement,codePostal2Etablissement,libelleCommune2Etablissement,libelleCommuneEtranger2Etablissement,distributionSpeciale2Etablissement,codeCommune2Etablissement,codeCedex2Etablissement,libelleCedex2Etablissement,codePaysEtranger2Etablissement,libellePaysEtranger2Etablissement,dateDebut,etatAdministratifEtablissement,enseigne1Etablissement,enseigne2Etablissement,enseigne3Etablissement,denominationUsuelleEtablissement,activitePrincipaleEtablissement,nomenclatureActivitePrincipaleEtablissement,caractereEmployeurEtablissement,longitude,latitude,geo_score,geo_type,geo_adresse,geo_id,geo_ligne,geo_l4,geo_l5
210204509,00017,21020450900017,O,1983-03-01,02,2021,,2023-11-30T10:17:58,true,3,,,,RUE,PASTEUR,02800,MAYOT,,,02473,,,,,,,,,,,,,,,,,,,2008-01-01,A,MAIRIE,,,,84.11Z,NAFRev2,N,3.384549,49.705506,0.95,street,Rue Pasteur 02800 Mayot,02473_0048,G,RUE PASTEUR,
210204509,00025,21020450900025,O,1983-12-21,NN,,,2011-04-23T04:11:32,false,4,,,,RUE,PASTEUR,02800,MAYOT,,,02473,,,,,,,,,,,,,,,,,,,2008-01-01,A,ECOLE ELEMENTAIRE PUBLIQUE,,,,85.20Z,NAFRev2,N,3.384549,49.705506,0.95,street,Rue Pasteur 02800 Mayot,02473_0048,G,RUE PASTEUR,
260204615,00017,26020461500017,O,1983-03-01,NN,,,2016-07-23T12:22:21,true,4,MAIRIE,,,RUE,PASTEUR,02800,MAYOT,,,02473,,,,,,,,,,,,,,,,,,,2016-01-01,F,CCAS,,,,88.99B,NAFRev2,N,3.384549,49.705506,0.95,street,Rue Pasteur 02800 Mayot,02473_0048,G,RUE PASTEUR,
260208251,00017,26020825100017,O,1983-03-01,NN,,,2010-06-26T03:03:01,true,3,MAIRIE,,,RUE,PASTEUR,02800,MAYOT,,,02473,,,,,,,,,,,,,,,,,,,2008-01-01,A,CDE,,,,88.99B,NAFRev2,N,3.384549,49.705506,0.95,street,Rue Pasteur 02800 Mayot,02473_0048,G,RUE PASTEUR,
290200922,00018,29020092200018,O,,NN,,,2006-11-25T09:10:16,true,1,,,,,MAIRIE,02800,MAYOT,,,02473,,,,,,,,,,,,,,,,,,,1997-01-01,F,,,,,70.1C,NAF1993,N,3.0709671,50.6304695,0.92,poi.townhall,Hôtel de Ville Lille,https://osm.org/way/40917078,G,,
309459832,00015,30945983200015,O,,NN,,,,true,1,,,,RUE,GRANDE,02800,MAYOT,,,02473,,,,,,,,,,,,,,,,,,,1990-01-15,F,,,,,67.08,NAP,N,3.386607,49.70339,0.42,street,Rue de l'Eglise 02800 Mayot,02473_0029,G,RUE DE L EGLISE,
334478203,00022,33447820300022,O,,NN,,,,true,1,,25,,RUE,PASTEUR,02800,MAYOT,,,02473,,,,,,,,,,,,,,,,,,,1994-04-13,F,,,,,45.4J,NAF1993,N,3.384408,49.704222,0.95,housenumber,25 Rue Pasteur 02800 Mayot,02473_0048_00025,G,25 RUE PASTEUR,
340733328,00017,34073332800017,O,1986-12-01,NN,,,2008-01-04T21:45:14,true,3,,8,,RUE,PASTEUR,02800,MAYOT,,,02473,,,,,,,,,,,,,,,,,,,2008-01-01,A,,,,,01.11Z,NAFRev2,N,3.385848,49.701926,0.95,housenumber,8 Rue Pasteur 02800 Mayot,02473_0048_00008,G,8 RUE PASTEUR,
341103232,00011,34110323200011,O,,NN,,,,true,1,,21,,RUE,PASTEUR,02800,MAYOT,,,02473,,,,,,,,,,,,,,,,,,,1988-06-20,F,,,,,29.11,NAP,N,3.384485,49.703586,0.95,housenumber,21 Rue Pasteur 02800 Mayot,02473_0048_00021,G,21 RUE PASTEUR,
341737385,00011,34173738500011,O,1987-02-01,01,2021,,2023-11-30T10:27:56,true,4,,8,,RUE,PASTEUR,02800,MAYOT,,,02473,,,,,,,,,,,,,,,,,,,2008-01-01,A,,,,,01.50Z,NAFRev2,N,3.385848,49.701926,0.95,housenumber,8 Rue Pasteur 02800 Mayot,02473_0048_00008,G,8 RUE PASTEUR,
408638187,00018,40863818700018,O,1996-08-22,,,,2006-10-28T03:35:29,true,3,,1,,RUE,PONT,02800,MAYOT,,,02473,,,,,,,,,,,,,,,,,,,2005-06-01,F,,,,,01.3Z,NAFRev1,N,3.383694,49.703999,0.85,housenumber,1 Rue du Pont 02800 Mayot,02473_0055_00001,G,1 RUE DU PONT,
414997544,00021,41499754400021,O,1999-01-01,NN,,,2008-11-08T01:31:10,false,4,,43,T,RUE,PASTEUR,02800,MAYOT,,,02473,,,,,,,,,,,,,,,,,,,2002-04-01,F,,,,,52.6D,NAF1993,N,3.384035,49.706728,0.83,housenumber,43ter Rue Pasteur 02800 Mayot,02473_0048_00043_ter,G,43TER RUE PASTEUR,
418347027,00025,41834702700025,O,2009-02-11,,,,2012-11-09T01:09:31,true,2,,7,,RUE,DE L'EGLISE,02800,MAYOT,,,02473,,,,,,,,,,,,,,,,,,,2011-10-28,F,A.M.D,,,,45.20A,NAFRev2,N,3.387287,49.703541,0.94,housenumber,7 Rue de l'Eglise 02800 Mayot,02473_0029_00007,G,7 RUE DE L EGLISE,
424102986,00017,42410298600017,O,1996-01-01,NN,,,2008-01-05T00:50:56,true,3,,16,,RUE,PASTEUR,02800,MAYOT,,,02473,,,,,,,,,,,,,,,,,,,2008-01-01,A,,,,,47.99A,NAFRev2,N,3.385629,49.702868,0.95,housenumber,16 Rue Pasteur 02800 Mayot,02473_0048_00016,G,16 RUE PASTEUR,
425357092,00013,42535709200013,O,1969-01-01,NN,,,2012-07-28T14:55:06,true,4,,,,RUE,DE BRISSAY CHOIGNY,02800,MAYOT,,,02473,,,,,,,,,,,,,,,,,,,2008-12-25,F,,,,,01.43Z,NAFRev2,N,3.3780391,49.7210657,0.8,poi.townhall,Mairie de Brissay-Choigny (Hôtel de ville) Brissay-Choigny,https://osm.org/way/143978941,G,,
425357100,00014,42535710000014,O,1970-01-01,NN,,,,true,3,,,,,,02800,MAYOT,,,02473,,,,,,,,,,,,,,,,,,,2003-01-31,F,,,,,01.3Z,NAFRev1,N,,,0,,,,,,
430753210,00029,43075321000029,O,2000-07-05,NN,,,2021-02-23T11:50:28,true,3,,2,,RUE,JACQUES JACQUET,02800,MAYOT,,,02473,,,,,,,,,,,,,,,,,,,2008-01-01,A,,,,,68.20B,NAFRev2,N,3.381789,49.704353,0.94,housenumber,2 Rue Jacques Jacquet 02800 Mayot,02473_0042_00002,G,2 RUE JACQUES JACQUET,
452199383,00012,45219938300012,O,2004-02-13,02,2021,,2023-11-30T10:20:17,true,3,,12,,RUE,CHANTRAINE,02800,MAYOT,,,02473,,,,,,,,,,,,,,,,,,,2008-01-01,A,,,,,81.30Z,NAFRev2,N,3.380233,49.704587,0.94,housenumber,12 Rue Chantraine 02800 Mayot,02473_0017_00012,G,12 RUE CHANTRAINE,
483247375,00015,48324737500015,O,2005-06-01,,,,2019-07-23T04:03:37,true,3,,1,,RUE,DU PONT,02800,MAYOT,,,02473,,,,,,,,,,,,,,,,,,,2019-05-02,F,,,,,01.11Z,NAFRev2,N,3.383694,49.703999,0.94,housenumber,1 Rue du Pont 02800 Mayot,02473_0055_00001,G,1 RUE DU PONT,
483888327,00010,48388832700010,O,2005-09-05,,,,2009-06-27T12:20:35,false,2,,17,,RUE,PASTEUR,02800,MAYOT,,,02473,,,,,,,,,,,,,,,,,,,2007-05-01,F,,,,,45.3A,NAFRev1,N,3.384954,49.703279,0.95,housenumber,17 Rue Pasteur 02800 Mayot,02473_0048_00017,G,17 RUE PASTEUR,
483888327,00028,48388832700028,O,2007-05-01,NN,,,2014-07-10T00:15:09,true,4,,2,,RUE,MAYOT,02800,MAYOT,,,02473,,,,,,,,,,,,,,,,,,,2011-05-31,F,,,,,43.21A,NAFRev2,O,3.381982,49.705165,0.91,housenumber,2 Rue Chantraine 02800 Mayot,02473_0017_00002,G,2 RUE CHANTRAINE,
485149983,00010,48514998300010,O,2005-11-21,,,,2020-06-23T03:47:28,true,3,,49,,RUE,PASTEUR,02800,MAYOT,,,02473,,,,,,,,,,,,,,,,,,,2020-02-13,F,,,,,68.20B,NAFRev2,N,3.384234,49.707616,0.95,housenumber,49 Rue Pasteur 02800 Mayot,02473_0048_00049,G,49 RUE PASTEUR,
491658720,00017,49165872000017,O,2006-06-01,,,,2018-11-17T04:27:32,true,2,,12,,RUE,CHANTRAINE,02800,MAYOT,,,02473,,,,,,,,,,,,,,,,,,,2008-01-01,A,,,,,68.20B,NAFRev2,N,3.380233,49.704587,0.94,housenumber,12 Rue Chantraine 02800 Mayot,02473_0017_00012,G,12 RUE CHANTRAINE,
491720421,00016,49172042100016,O,2006-10-02,NN,,,2011-04-23T15:41:23,true,2,,12,,RUE,CHANTRAINE,02800,MAYOT,,,02473,,,,,,,,,,,,,,,,,,,2008-01-01,A,,,,,02.40Z,NAFRev2,N,3.380233,49.704587,0.94,housenumber,12 Rue Chantraine 02800 Mayot,02473_0017_00012,G,12 RUE CHANTRAINE,
493892152,00015,49389215200015,O,2007-02-01,,,,2017-06-16T10:45:58,false,3,,6,,RUE,DE L'EGLISE,02800,MAYOT,,,02473,,,,,,,,,,,,,,,,,,,2010-08-09,F,,,,,46.18Z,NAFRev2,N,3.387131,49.703473,0.94,housenumber,6 Rue de l'Eglise 02800 Mayot,02473_0029_00006,G,6 RUE DE L EGLISE,
499121580,00017,49912158000017,O,2007-06-22,NN,,,2010-04-18T13:03:10,false,4,,49,,RUE,PASTEUR,02800,MAYOT,,,02473,,,,,,,,,,,,,,,,,,,2008-11-01,F,,,,,64.20Z,NAFRev2,O,3.384234,49.707616,0.95,housenumber,49 Rue Pasteur 02800 Mayot,02473_0048_00049,G,49 RUE PASTEUR,
501425920,00029,50142592000029,O,2010-03-24,,,9602AB,2016-06-08T10:52:01,false,2,,13,,RUE,PASTEUR,02800,MAYOT,,,02473,,,,,,,,,,,,,,,,,,,2016-03-06,F,M COIFF,,,,96.02A,NAFRev2,N,3.385068,49.703198,0.95,housenumber,13 Rue Pasteur 02800 Mayot,02473_0048_00013,G,13 RUE PASTEUR,
501425920,00037,50142592000037,O,2016-03-06,,,9602AB,2019-08-30T03:37:55,true,2,,1,,RUE,JACQUES JACQUET,02800,MAYOT,,,02473,,,,,,,,,,,,,,,,,,,2019-08-26,F,,,,,96.02A,NAFRev2,N,3.382189,49.703635,0.94,housenumber,1 Rue Jacques Jacquet 02800 Mayot,02473_0042_00001,G,1 RUE JACQUES JACQUET,
519733786,00015,51973378600015,O,2010-02-01,,,,2015-04-16T08:33:00,true,3,,28,,RUE,PASTEUR,02800,MAYOT,,,02473,,,,,,,,,,,,,,,,,,,2015-03-31,F,WEB FINANCE,,,,47.91A,NAFRev2,N,3.384641,49.706332,0.95,housenumber,28 Rue Pasteur 02800 Mayot,02473_0048_00028,G,28 RUE PASTEUR,
520806803,00026,52080680300026,O,2016-09-07,,,1610AQ,2023-09-05T20:01:42,true,3,,8,,RUE,CHANTRAINE,02800,MAYOT,,,02473,,,,,,,,,,,,,,,,,,,2023-06-30,A,,,,,16.10A,NAFRev2,N,3.380945,49.704533,0.94,housenumber,8 Rue Chantraine 02800 Mayot,02473_0017_00008,G,8 RUE CHANTRAINE,
780198982,00016,78019898200016,O,,NN,,,,true,1,,,,RUE,DU FORT,02800,MAYOT,,,02473,,,,,,,,,,,,,,,,,,,,F,,,,,01.80,NAP,N,3.385513,49.704449,0.94,street,Rue du Fort 02800 Mayot,02473_0033,G,RUE DU FORT,
780198990,00027,78019899000027,O,,NN,,,2020-01-25T03:38:31,true,1,,1,,RUE,DES PRES,02800,MAYOT,,,02473,,,,,,,,,,,,,,,,,,,2002-04-30,F,,,,,45.4J,NAF1993,N,3.381483,49.704067,0.94,housenumber,1 Rue des Prés 02800 Mayot,02473_0058_00001,G,1 RUE DES PRES,
780199006,00013,78019900600013,O,,NN,,,,true,1,,,,RUE,GRANDE,02800,MAYOT,,,02473,,,,,,,,,,,,,,,,,,,1988-01-29,F,,,,,84.12,NAP,N,3.386607,49.70339,0.42,street,Rue de l'Eglise 02800 Mayot,02473_0029,G,RUE DE L EGLISE,
780213849,00026,78021384900026,O,2002-10-02,,,,,true,1,,11,,RUE,PASTEUR,02800,MAYOT,,,02473,,,,,,,,,,,,,,,,,,,2002-10-02,F,,,,,45.2J,NAF1993,O,3.385246,49.703062,0.95,housenumber,11 Rue Pasteur 02800 Mayot,02473_0048_00011,G,11 RUE PASTEUR,
790760425,00013,79076042500013,O,2013-01-15,02,2021,4332AA,2023-11-30T10:51:01,true,2,,47,,RUE,PASTEUR,02800,MAYOT,,,02473,,,,,,,,,,,,,,,,,,,2013-03-04,A,,,,,43.32A,NAFRev2,O,3.384225,49.706844,0.95,housenumber,47 Rue Pasteur 02800 Mayot,02473_0048_00047,G,47 RUE PASTEUR,
813426467,00037,81342646700037,O,2019-07-24,,,,2021-02-23T17:31:56,true,1,,17,,RUE,PASTEUR,02800,MAYOT,,,02473,,,,,,,,,,,,,,,,,,,2019-07-24,A,,,,,85.52Z,NAFRev2,N,3.384954,49.703279,0.95,housenumber,17 Rue Pasteur 02800 Mayot,02473_0048_00017,G,17 RUE PASTEUR,
813545100,00014,81354510000014,O,2015-06-25,,,,2015-09-16T12:58:50,true,1,,2,B,RUE,PASTEUR,02800,MAYOT,,,02473,,,,,,,,,,,,,,,,,,,2015-06-25,A,,,,,94.99Z,NAFRev2,N,3.386514,49.701145,0.83,housenumber,2bis Rue Pasteur 02800 Mayot,02473_0048_00002_bis,G,2BIS RUE PASTEUR,
814542486,00018,81454248600018,O,2015-11-09,,,,2018-01-13T04:16:59,true,2,,6,,RUE,DU PONT,02800,MAYOT,,,02473,,,,,,,,,,,,,,,,,,,2017-12-31,F,,,,,43.34Z,NAFRev2,N,3.383668,49.704055,0.94,housenumber,6 Rue du Pont 02800 Mayot,02473_0055_00006,G,6 RUE DU PONT,
823829213,00011,82382921300011,O,2016-11-21,,,,2018-01-04T03:37:43,true,2,,6,,RUE,DU PONT,02800,MAYOT,,,02473,,,,,,,,,,,,,,,,,,,2017-12-15,F,,,,CHEZ D'JESS,56.10C,NAFRev2,N,3.383668,49.704055,0.94,housenumber,6 Rue du Pont 02800 Mayot,02473_0055_00006,G,6 RUE DU PONT,
829833961,00016,82983396100016,P,2017-05-18,,,,2017-05-24T08:41:17,true,1,[ND],[ND],[ND],[ND],[ND],[ND],MAYOT,,[ND],02473,[ND],[ND],,,[ND],[ND],[ND],[ND],[ND],[ND],,,[ND],,[ND],[ND],,,2017-05-18,A,[ND],[ND],[ND],[ND],47.71Z,NAFRev2,N,,,0,,,,,,
835041930,00016,83504193000016,O,2018-02-01,,,5610CQ,2018-05-15T03:53:36,true,2,,4,,RUE,JACQUES JACQUET,02800,MAYOT,,,02473,,,,,,,,,,,,,,,,,,,2018-04-15,F,,,,,56.10C,NAFRev2,N,3.381978,49.704016,0.94,housenumber,4 Rue Jacques Jacquet 02800 Mayot,02473_0042_00004,G,4 RUE JACQUES JACQUET,
838739373,00010,83873937300010,O,2018-03-12,,,,2018-04-09T07:42:17,true,1,,26,,RUE,PASTEUR,02800,MAYOT,,,02473,,,,,,,,,,,,,,,,,,,2018-03-12,A,,,,BOOK'SIS,47.91A,NAFRev2,N,3.38444,49.703847,0.95,housenumber,26 Rue Pasteur 02800 Mayot,02473_0048_00026,G,26 RUE PASTEUR,
842072241,00016,84207224100016,O,2018-09-10,,,,2018-10-17T12:03:52,true,2,,49,,,RUE PASTEUR,02800,MAYOT,,,02473,,,,,,,,,,,,,,,,,,,2018-10-15,F,,,,,46.19B,NAFRev2,N,3.384234,49.707616,0.95,housenumber,49 Rue Pasteur 02800 Mayot,02473_0048_00049,G,49 RUE PASTEUR,
844463323,00015,84446332300015,P,2018-12-25,,,,2019-01-12T03:54:02,true,1,[ND],[ND],[ND],[ND],[ND],[ND],MAYOT,,[ND],02473,[ND],[ND],,,[ND],[ND],[ND],[ND],[ND],[ND],,,[ND],,[ND],[ND],,,2018-12-25,A,[ND],[ND],[ND],[ND],47.91A,NAFRev2,N,,,0,,,,,,
848730784,00016,84873078400016,P,2019-03-04,,,,2019-03-01T08:35:54,true,1,[ND],[ND],[ND],[ND],[ND],[ND],MAYOT,,[ND],02473,[ND],[ND],,,[ND],[ND],[ND],[ND],[ND],[ND],,,[ND],,[ND],[ND],,,2019-03-04,A,[ND],[ND],[ND],[ND],85.59B,NAFRev2,N,,,0,,,,,,
852886951,00015,85288695100015,O,2019-05-03,,,,2022-05-12T03:42:49,true,2,,1,,RUE,DU PONT,02800,MAYOT,,,02473,,,,,,,,,,,,,,,,,,,2022-03-01,F,,,,,01.11Z,NAFRev2,N,3.383694,49.703999,0.94,housenumber,1 Rue du Pont 02800 Mayot,02473_0055_00001,G,1 RUE DU PONT,
878236736,00012,87823673600012,O,2019-10-05,,,,2019-10-21T08:02:23,true,1,,4,,RUE,DE L'EGLISE,02800,MAYOT,,,02473,,,,,,,,,,,,,,,,,,,2019-10-05,A,,,,,68.20B,NAFRev2,N,3.386985,49.703466,0.94,housenumber,4 Rue de l'Eglise 02800 Mayot,02473_0029_00004,G,4 RUE DE L EGLISE,
882952005,00016,88295200500016,P,2020-04-01,,,,2020-04-20T08:33:59,true,1,[ND],[ND],[ND],[ND],[ND],[ND],MAYOT,,[ND],02473,[ND],[ND],,,[ND],[ND],[ND],[ND],[ND],[ND],,,[ND],,[ND],[ND],,,2020-04-01,A,[ND],[ND],[ND],[ND],47.99A,NAFRev2,N,,,0,,,,,,
887677599,00011,88767759900011,O,2020-07-24,,,3213ZZ,2023-03-31T03:35:48,true,2,,8,,RUE,CHANTRAINE,02800,MAYOT,,,02473,,,,,,,,,,,,,,,,,,,2023-03-29,F,,,,,32.13Z,NAFRev2,N,3.380945,49.704533,0.94,housenumber,8 Rue Chantraine 02800 Mayot,02473_0017_00008,G,8 RUE CHANTRAINE,
892808015,00010,89280801500010,O,2021-01-04,,,,2021-02-05T16:13:59,true,1,,2,,RUE,CHANTRAINE,02800,MAYOT,,,02473,,,,,,,,,,,,,,,,,,,2021-01-04,A,,,,,02.20Z,NAFRev2,N,3.381982,49.705165,0.94,housenumber,2 Rue Chantraine 02800 Mayot,02473_0017_00002,G,2 RUE CHANTRAINE,
900809336,00010,90080933600010,O,2021-06-21,,,,2023-08-22T19:36:13,true,2,,1,,RUE,DE L'EGLISE,02800,MAYOT,,,02473,,,,,,,,,,,,,,,,,,,2023-08-08,F,,,,L'AURORE FANTAISIE,47.91B,NAFRev2,N,3.385437,49.703134,0.94,housenumber,1 Rue de l'Eglise 02800 Mayot,02473_0029_00001,G,1 RUE DE L EGLISE,
909959884,00018,90995988400018,P,2022-03-01,,,,2022-02-04T04:29:35,true,1,[ND],[ND],[ND],[ND],[ND],[ND],MAYOT,,[ND],02473,[ND],[ND],,,[ND],[ND],[ND],[ND],[ND],[ND],,,[ND],,[ND],[ND],,,2022-03-01,A,[ND],[ND],[ND],[ND],01.11Z,NAFRev2,N,,,0,,,,,,
