siren,nic,siret,statutDiffusionEtablissement,dateCreationEtablissement,trancheEffectifsEtablissement,anneeEffectifsEtablissement,activitePrincipaleRegistreMetiersEtablissement,dateDernierTraitementEtablissement,etablissementSiege,nombrePeriodesEtablissement,complementAdresseEtablissement,numeroVoieEtablissement,indiceRepetitionEtablissement,typeVoieEtablissement,libelleVoieEtablissement,codePostalEtablissement,libelleCommuneEtablissement,libelleCommuneEtrangerEtablissement,distributionSpecialeEtablissement,codeCommuneEtablissement,codeCedexEtablissement,libelleCedexEtablissement,codePaysEtrangerEtablissement,libellePaysEtrangerEtablissement,complementAdresse2Etablissement,numeroVoie2Etablissement,indiceRepetition2Etablissement,typeVoie2Etablissement,libelleVoie2Etablissement,codePostal2Etablissement,libelleCommune2Etablissement,libelleCommuneEtranger2Etablissement,distributionSpeciale2Etablissement,codeCommune2Etablissement,codeCedex2Etablissement,libelleCedex2Etablissement,codePaysEtranger2Etablissement,libellePaysEtranger2Etablissement,dateDebut,etatAdministratifEtablissement,enseigne1Etablissement,enseigne2Etablissement,enseigne3Etablissement,denominationUsuelleEtablissement,activitePrincipaleEtablissement,nomenclatureActivitePrincipaleEtablissement,caractereEmployeurEtablissement,longitude,latitude,geo_score,geo_type,geo_adresse,geo_id,geo_ligne,geo_l4,geo_l5
210700860,00013,21070086000013,O,1983-03-01,03,2021,,2023-11-30T10:18:00,true,4,HOTEL DE VILLE,3,,PL,DE LA MAIRIE,07300,ETABLES,,,07086,,,,,,,,,,,,,,,,,,,2008-01-01,A,MAIRIE,,,,84.11Z,NAFRev2,O,4.725235,45.101483,0.84,housenumber,3 Place de la Mairie 07300 Étables,07086_0011_00003,G,3 PLACE DE LA MAIRIE,
210700860,00021,21070086000021,O,1983-12-21,01,2021,,2023-11-30T10:18:00,false,4,,,,,LE VILLAGE,07300,ETABLES,,,07086,,,,,,,,,,,,,,,,,,,2008-01-01,A,ECOLE ELEMENTAIRE PUBLIQUE,,,,85.20Z,NAFRev2,N,4.768584,45.090693,0.44,street,Route Vieille Route 07300 Étables,07086_0105,G,ROUTE VIEILLE ROUTE,
210700860,00039,21070086000039,O,2001-10-01,NN,,,2014-06-19T14:27:26,false,3,HOTEL DE VILLE,3,,PL,DE LA MAIRIE,07300,ETABLES,,,07086,,,,,,,,,,,,,,,,,,,2008-01-01,A,ASSAINISSEMENT,,,,37.00Z,NAFRev2,N,4.725235,45.101483,0.84,housenumber,3 Place de la Mairie 07300 Étables,07086_0011_00003,G,3 PLACE DE LA MAIRIE,
250700168,00017,25070016800017,O,1983-03-01,NN,,,2021-10-27T08:11:57,true,4,,,,,HOTEL DE VILLE,07300,ETABLES,,,07086,,,,,,,,,,,,,,,,,,,2020-04-23,F,,,,,84.13Z,NAFRev2,N,4.768584,45.090693,0.4,street,Route Vieille Route 07300 Étables,07086_0105,G,ROUTE VIEILLE ROUTE,
250700978,00019,25070097800019,O,1984-08-06,02,2021,,2023-11-30T10:18:57,true,3,,,,,MAIRIE,07300,ETABLES,,,07086,,,,,,,,,,,,,,,,,,,2008-01-01,A,,,,,42.99Z,NAFRev2,N,4.725543,45.101449,0.91,street,Place de la Mairie 07300 Étables,07086_0011,G,PLACE DE LA MAIRIE,
260701982,00019,26070198200019,O,1992-01-01,NN,,,2017-08-06T14:06:46,true,4,,,,,MAIRIE,07300,ETABLES,,,07086,,,,,,,,,,,,,,,,,,,2017-08-01,F,CCAS,,,,88.99B,NAFRev2,N,4.725543,45.101449,0.91,street,Place de la Mairie 07300 Étables,07086_0011,G,PLACE DE LA MAIRIE,
290701481,00019,29070148100019,O,1989-01-01,NN,,,2009-03-09T09:54:22,true,3,,,,,MAIRIE,07300,ETABLES,,,07086,,,,,,,,,,,,,,,,,,,2006-06-19,F,,,,,70.1C,NAFRev1,N,4.725543,45.101449,0.91,street,Place de la Mairie 07300 Étables,07086_0011,G,PLACE DE LA MAIRIE,
300476884,00014,30047688400014,O,,,,,,true,1,,,,,,07300,ETABLES,,,07086,,,,,,,,,,,,,,,,,,,1984-12-25,F,,,,,,,N,,,0,,,,,,
301193538,00032,30119353800032,O,1980-01-01,,,,,false,3,,,,,,07300,ETABLES,,,07086,,,,,,,,,,,,,,,,,,,1994-06-02,F,,,,,51.5L,NAF1993,N,,,0,,,,,,
308031715,00011,30803171500011,O,1984-01-01,NN,,,2008-01-04T19:48:54,true,3,,,,,CREMOLIERES,07300,ETABLES,,,07086,,,,,,,,,,,,,,,,,,,2008-01-01,A,,,,,01.11Z,NAFRev2,N,4.733807,45.111684,0.85,street,Route de Crémolière 07300 Étables,07086_0095,G,ROUTE DE CREMOLIERE,
308737386,00018,30873738600018,O,,NN,,,,true,1,,,,,,07300,ETABLES,,,07086,,,,,,,,,,,,,,,,,,,,F,,,,,67.04,NAP,N,,,0,,,,,,
309112894,00014,30911289400014,O,,NN,,,,true,1,,,,,CROIX DU FRAISSE,07300,ETABLES,,,07086,,,,,,,,,,,,,,,,,,,,F,,,,,55.71,NAP,N,4.726721,45.118071,0.78,street,Route de la Croix du Fraysse 07300 Étables,07086_0096,G,ROUTE DE LA CROIX DU FRAYSSE,
312173487,00017,31217348700017,O,1900-01-01,NN,,,2011-04-28T00:14:01,false,4,,,,,LA PAYE  LE VILLAGE,07300,ETABLES,,,07086,,,,,,,,,,,,,,,,,,,1997-12-31,F,,,,,45.4C,NAF1993,N,,,0,,,,,,
312173487,00025,31217348700025,O,2002-05-14,NN,,4399CZ,2015-03-18T00:59:37,true,4,HLM LE PAYAS NÂ° 5,,,,,07300,ETABLES,,,07086,,,,,,,,,,,,,,,,,,,2014-06-27,F,,,,,43.99C,NAFRev2,N,,,0,,,,,,
312350200,00019,31235020000019,O,1963-01-01,NN,,,2008-11-07T00:27:27,false,3,,,,,CREMOLIERE,07300,ETABLES,,,07086,,,,,,,,,,,,,,,,,,,2005-03-16,F,,,,,52.4L,NAFRev1,N,4.733807,45.111684,0.93,street,Route de Crémolière 07300 Étables,07086_0095,G,ROUTE DE CREMOLIERE,
312350200,00027,31235020000027,O,2005-03-16,,,,2008-11-07T00:27:27,true,2,,,,,BOSC,07300,ETABLES,,,07086,,,,,,,,,,,,,,,,,,,2007-12-31,F,,,,,52.4L,NAFRev1,N,4.730726,45.116473,0.32,street,Chemin Bonvoisins 07300 Étables,07086_0004,G,CHEMIN BONVOISINS,
313818296,00011,31381829600011,O,,NN,,,,true,1,,,,LD,LA CROIX DU FRAISSE,07300,ETABLES,,,07086,,,,,,,,,,,,,,,,,,,1988-09-30,F,,,,,55.60,NAP,N,4.726721,45.118071,0.8,street,Route de la Croix du Fraysse 07300 Étables,07086_0096,G,ROUTE DE LA CROIX DU FRAYSSE,
315610006,00019,31561000600019,O,,,,,,true,1,,,,HAM,DE CREMOLIERES,07300,ETABLES,,,07086,,,,,,,,,,,,,,,,,,,1997-06-30,F,,,,,29.3C,NAF1993,N,4.733807,45.111684,0.87,street,Route de Crémolière 07300 Étables,07086_0095,G,ROUTE DE CREMOLIERE,
317625481,00013,31762548100013,O,,NN,,,2007-01-18T09:14:40,true,1,,,,,LE GRAND CHENE,07300,ETABLES,,,07086,,,,,,,,,,,,,,,,,,,1983-12-25,F,,,,,01.1A,NAF1993,N,4.734454,45.100338,0.62,street,Chemin de Grand Verne 07300 Étables,07086_0045,G,CHEMIN DE GRAND VERNE,
317625499,00015,31762549900015,O,1979-01-01,NN,,,,true,1,,,,,QUARTIER DES CREMOLIERES,07300,ETABLES,,,07086,,,,,,,,,,,,,,,,,,,2000-12-31,F,,,,,01.1A,NAF1993,N,4.733807,45.111684,0.51,street,Route de Crémolière 07300 Étables,07086_0095,G,ROUTE DE CREMOLIERE,
320005655,00065,32000565500065,O,2006-07-01,,,,2007-01-19T10:42:15,false,2,,,,,LE VILLAGE,07300,ETABLES,,,07086,,,,,,,,,,,,,,,,,,,2006-12-24,F,,,,,52.6D,NAFRev1,N,4.768584,45.090693,0.44,street,Route Vieille Route 07300 Étables,07086_0105,G,ROUTE VIEILLE ROUTE,
320014194,00023,32001419400023,O,1993-01-01,NN,,,2015-04-29T10:36:49,false,5,,147,,RUE,QUARTIER CHILET,07300,ETABLES,,,07086,,,,,,,,,,,,,,,,,,,2014-12-31,F,,,,,50.40Z,NAFRev2,N,,,0,,,,,,
320014194,00031,32001419400031,O,2008-01-01,,,,2015-04-27T13:16:52,false,2,,,,QUA,CHILET,07300,ETABLES,,,07086,,,,,,,,,,,,,,,,,,,2014-12-31,F,,,,,50.40Z,NAFRev2,N,,,0,,,,,,
320915150,00017,32091515000017,O,,,,,,true,1,,,,,,07300,ETABLES,,,07086,,,,,,,,,,,,,,,,,,,1988-09-23,F,,,,,55.60,NAP,N,,,0,,,,,,
322606419,00065,32260641900065,O,1998-04-19,NN,,,2010-09-01T06:08:41,true,4,,,,,LE PETIT ALLARD,07300,ETABLES,,,07086,,,,,,,,,,,,,,,,,,,2010-09-01,F,,,,,47.89Z,NAFRev2,N,4.744095,45.087095,0.44,street,Chemin du Petit Marzillac 07300 Étables,07086_0042,G,CHEMIN DU PETIT MARZILLAC,
325767655,00047,32576765500047,O,2021-02-01,,,,2021-05-06T08:39:04,true,1,,290,,RUE,DU CHATEAU,07300,ETABLES,,,07086,,,,,,,,,,,,,,,,,,,2021-02-01,A,,,,,86.90E,NAFRev2,N,4.72493,45.100669,0.95,housenumber,290 Rue du Château 07300 Étables,07086_0104_00290,G,290 RUE DU CHATEAU,
326348513,00077,32634851300077,O,2003-01-02,NN,,,2008-12-03T07:11:11,true,3,,,,,LE VILLAGE,07300,ETABLES,,,07086,,,,,,,,,,,,,,,,,,,2005-05-18,F,,,,,85.1G,NAFRev1,N,4.768584,45.090693,0.44,street,Route Vieille Route 07300 Étables,07086_0105,G,ROUTE VIEILLE ROUTE,
328888409,00013,32888840900013,O,,,,,,true,1,,,,,GITE REAT MAURINS,07300,ETABLES,,,07086,,,,,,,,,,,,,,,,,,,1985-12-25,F,,,,,64.11,NAP,N,,,0,,,,,,
329315139,00017,32931513900017,O,1984-01-09,NN,,,2012-05-05T02:02:14,true,4,,,,,AU GRAND VERNE,07300,ETABLES,,,07086,,,,,,,,,,,,,,,,,,,2010-05-31,F,,,,,01.45Z,NAFRev2,N,4.734454,45.100338,0.74,street,Chemin de Grand Verne 07300 Étables,07086_0045,G,CHEMIN DE GRAND VERNE,
329315139,00025,32931513900025,O,1900-01-01,NN,,,2011-04-28T00:24:46,false,2,,,,,AU GRAND VERNE,07300,ETABLES,,,07086,,,,,,,,,,,,,,,,,,,1992-10-01,F,,,,,,,,4.734454,45.100338,0.74,street,Chemin de Grand Verne 07300 Étables,07086_0045,G,CHEMIN DE GRAND VERNE,
330152034,00055,33015203400055,O,2007-10-20,,,,2018-07-12T16:33:17,true,3,LES BISES,,,,LIEUDIT MAURINS,07300,ETABLES,,,07086,,,,,,,,,,,,,,,,,,,2015-10-07,F,,,,,45.32Z,NAFRev2,N,4.743415,45.078884,0.92,street,Route de Maurins 07300 Étables,07086_0097,G,ROUTE DE MAURINS,
330706656,00015,33070665600015,O,1984-09-11,NN,,,2006-10-27T02:05:18,true,3,,,,,MAURINS,07300,ETABLES,,,07086,,,,,,,,,,,,,,,,,,,2005-04-01,F,,,,,01.2E,NAFRev1,N,4.743415,45.078884,0.92,street,Route de Maurins 07300 Étables,07086_0097,G,ROUTE DE MAURINS,
330925215,00015,33092521500015,O,,NN,,,,true,1,,,,,QUARTIER AU BOIS,07300,ETABLES,,,07086,,,,,,,,,,,,,,,,,,,,F,,,,,01.57,NAP,N,4.73426,45.097399,0.35,street,Chemin du Bois de Verne 07300 Étables,07086_0020,G,CHEMIN DU BOIS DE VERNE,
331843094,00011,33184309400011,O,1985-01-02,NN,,,,true,1,,,,LD,LA CROIX DU FRAISSE,07300,ETABLES,,,07086,,,,,,,,,,,,,,,,,,,1998-03-31,F,,,,,45.4C,NAF1993,O,4.726721,45.118071,0.8,street,Route de la Croix du Fraysse 07300 Étables,07086_0096,G,ROUTE DE LA CROIX DU FRAYSSE,
331880807,00010,33188080700010,O,1985-01-01,NN,,,,true,1,,,,,,07300,ETABLES,,,07086,,,,,,,,,,,,,,,,,,,1995-07-20,F,,,,,01.1F,NAF1993,N,,,0,,,,,,
332405703,00015,33240570300015,O,1985-04-15,NN,,,2008-01-04T20:25:20,true,3,,,,,CHAVEROCHE,07300,ETABLES,,,07086,,,,,,,,,,,,,,,,,,,2008-01-01,A,,,,,01.41Z,NAFRev2,N,4.732605,45.105452,0.92,street,Chemin de Chaveroche 07300 Étables,07086_0022,G,CHEMIN DE CHAVEROCHE,
332469907,00015,33246990700015,O,1985-01-01,NN,,,2007-01-18T09:20:24,true,3,,,,,PEYREFOUR,07300,ETABLES,,,07086,,,,,,,,,,,,,,,,,,,1995-12-25,F,,,,,01.2J,NAF1993,N,,,0,,,,,,
334461134,00010,33446113400010,O,1985-05-01,NN,,,2021-11-27T03:50:05,true,3,,,,,AU GRAND CHERE,07300,ETABLES,,,07086,,,,,,,,,,,,,,,,,,,2008-01-01,A,,,,,01.41Z,NAFRev2,N,4.73863,45.105172,0.39,street,Chemin de Petit Chere 07300 Étables,07086_0071,G,CHEMIN DE PETIT CHERE,
335511291,00015,33551129100015,O,,,,,,true,1,,,,,CREMOLIERE,07300,ETABLES,,,07086,,,,,,,,,,,,,,,,,,,1987-07-01,F,,,,,48.01,NAP,N,4.733807,45.111684,0.93,street,Route de Crémolière 07300 Étables,07086_0095,G,ROUTE DE CREMOLIERE,
335912069,00010,33591206900010,O,,,,,,true,1,,,,,,07300,ETABLES,,,07086,,,,,,,,,,,,,,,,,,,1984-12-25,F,,,,,01.00,NAP,N,,,0,,,,,,
335914065,00016,33591406500016,O,,,,,,true,1,,,,LD,C DU FRAISSE,07300,ETABLES,,,07086,,,,,,,,,,,,,,,,,,,1987-04-27,F,,,,,67.04,NAP,N,4.726721,45.118071,0.59,street,Route de la Croix du Fraysse 07300 Étables,07086_0096,G,ROUTE DE LA CROIX DU FRAYSSE,
335914438,00015,33591443800015,O,,,,,,true,1,,,,,,07300,ETABLES,,,07086,,,,,,,,,,,,,,,,,,,1988-12-31,F,,,,,01.00,NAP,N,,,0,,,,,,
335915328,00017,33591532800017,O,,,,,,true,1,,,,HAM,CREMOLIERE,07300,ETABLES,,,07086,,,,,,,,,,,,,,,,,,,1985-12-25,F,,,,,40.11,NAP,N,4.733807,45.111684,0.93,street,Route de Crémolière 07300 Étables,07086_0095,G,ROUTE DE CREMOLIERE,
336211693,00013,33621169300013,O,,,,,,true,1,,,,LD,LA CULA,07300,ETABLES,,,07086,,,,,,,,,,,,,,,,,,,1984-12-25,F,,,,,00.97,NAP,N,4.744138,45.075821,0.92,street,chemin de la Cula 07300 Étables,07086_0028,G,CHEMIN DE LA CULA,
336510292,00012,33651029200012,O,,,,,,true,1,,,,,,07300,ETABLES,,,07086,,,,,,,,,,,,,,,,,,,1989-12-31,F,,,,,38.40,NAP,N,,,0,,,,,,
336710587,00013,33671058700013,O,,NN,,,,true,1,,,,,,07300,ETABLES,,,07086,,,,,,,,,,,,,,,,,,,,F,,,,,55.60,NAP,N,,,0,,,,,,
336910849,00015,33691084900015,O,1984-01-01,NN,,,2006-11-25T10:29:02,true,4,,,,,,07300,ETABLES,,,07086,,,,,,,,,,,,,,,,,,,2006-09-30,F,,,,,70.2C,NAFRev1,N,,,0,,,,,,
337211700,00014,33721170000014,O,1963-01-01,NN,,,2006-10-27T02:45:03,true,3,,,,HAM,CREMOLIERE,07300,ETABLES,,,07086,,,,,,,,,,,,,,,,,,,2004-12-31,F,,,,,70.2C,NAFRev1,N,4.733807,45.111684,0.93,street,Route de Crémolière 07300 Étables,07086_0095,G,ROUTE DE CREMOLIERE,
337211700,00022,33721170000022,O,1979-05-01,NN,,,2006-11-25T10:29:03,false,3,,,,,CREMOLIERES,07300,ETABLES,,,07086,,,,,,,,,,,,,,,,,,,2004-12-31,F,,,,,29.3C,NAFRev1,N,4.733807,45.111684,0.85,street,Route de Crémolière 07300 Étables,07086_0095,G,ROUTE DE CREMOLIERE,
340008796,00013,34000879600013,O,1987-01-01,NN,,,2008-01-04T21:37:06,true,3,LE VILLAGE,,,,,07300,ETABLES,,,07086,,,,,,,,,,,,,,,,,,,2008-01-01,A,,,,,56.30Z,NAFRev2,N,4.768584,45.090693,0.44,street,Route Vieille Route 07300 Étables,07086_0105,D,ROUTE VIEILLE ROUTE,
340138262,00019,34013826200019,O,1987-01-12,NN,,,2011-05-11T15:00:02,true,5,,,,,CREMOLIERES,07300,ETABLES,,,07086,,,,,,,,,,,,,,,,,,,2009-12-31,F,,,,,77.39Z,NAFRev2,N,4.733807,45.111684,0.85,street,Route de Crémolière 07300 Étables,07086_0095,G,ROUTE DE CREMOLIERE,
340178441,00010,34017844100010,O,,NN,,,,true,1,,,,,CREMOLIERES,07300,ETABLES,,,07086,,,,,,,,,,,,,,,,,,,1988-03-29,F,,,,,64.25,NAP,N,4.733807,45.111684,0.85,street,Route de Crémolière 07300 Étables,07086_0095,G,ROUTE DE CREMOLIERE,
343525374,00033,34352537400033,O,2008-06-26,,,,2011-04-17T06:29:50,true,2,,,,,LA CROIX DU FRAYSSE,07300,ETABLES,,,07086,,,,,,,,,,,,,,,,,,,2011-03-31,F,,,,,47.89Z,NAFRev2,N,4.726721,45.118071,0.93,street,Route de la Croix du Fraysse 07300 Étables,07086_0096,G,ROUTE DE LA CROIX DU FRAYSSE,
343905345,00033,34390534500033,O,1998-07-02,NN,,,2008-11-08T00:18:33,false,4,CREMOLIERES,,,,LES CLOS FLEURIS,07300,ETABLES,,,07086,,,,,,,,,,,,,,,,,,,2001-11-23,F,,,,,29.5G,NAF1993,N,4.736091,45.109335,0.35,street,Chemin de l’Enclos 07300 Étables,07086_0069,G,CHEMIN DE L ENCLOS,
347450405,00027,34745040500027,O,1988-09-01,NN,,,2007-07-03T05:06:49,true,3,,,,,QUARTIER CREMOLLIERE,07300,ETABLES,,,07086,,,,,,,,,,,,,,,,,,,2007-06-30,F,,,,,52.6D,NAFRev1,N,4.733807,45.111684,0.49,street,Route de Crémolière 07300 Étables,07086_0095,G,ROUTE DE CREMOLIERE,
348247677,00019,34824767700019,O,1988-10-03,NN,,4399CZ,2015-03-17T00:28:08,true,5,,,,,FOUREY,07300,ETABLES,,,07086,,,,,,,,,,,,,,,,,,,2012-12-31,A,,,,,43.99C,NAFRev2,N,4.727386,45.11194,0.92,street,Chemin de Fourey 07300 Étables,07086_0025,G,CHEMIN DE FOUREY,
349187872,00016,34918787200016,O,1991-03-05,NN,,,2016-04-26T03:56:56,true,6,,,,,CREMOLIERE,07300,ETABLES,,,07086,,,,,,,,,,,,,,,,,,,2015-01-01,A,,,,,68.20B,NAFRev2,N,4.733807,45.111684,0.93,street,Route de Crémolière 07300 Étables,07086_0095,G,ROUTE DE CREMOLIERE,
349236257,00011,34923625700011,O,1989-01-01,NN,,,,true,1,,,,,RORON,07300,ETABLES,,,07086,,,,,,,,,,,,,,,,,,,2000-11-04,F,,,,,15.6A,NAF1993,N,-1.7234565,48.0923156,0.72,poi.track,Chemin Robert de Boron Rennes,https://osm.org/way/29961373,G,,
349835520,00017,34983552000017,O,1989-02-15,NN,,,2016-03-07T11:23:09,false,5,,,,,LE VILLAGE,07300,ETABLES,,,07086,,,,,,,,,,,,,,,,,,,2014-10-31,F,,,,,90.01Z,NAFRev2,N,4.768584,45.090693,0.44,street,Route Vieille Route 07300 Étables,07086_0105,G,ROUTE VIEILLE ROUTE,
349959015,00018,34995901500018,O,1988-06-01,NN,,,2018-09-29T12:39:49,true,3,,,,,,07300,ETABLES,,,07086,,,,,,,,,,,,,,,,,,,2008-01-01,A,,,,,01.24Z,NAFRev2,N,,,0,,,,,,
349959015,00026,34995901500026,O,2014-01-01,,,,2019-12-04T09:53:18,false,2,,160,,,CHEMIN DES VERGERS,07300,ETABLES,,,07086,,,,,,,,,,,,,,,,,,,2019-12-31,F,,,,,74.90B,NAFRev2,N,4.727709,45.117132,0.94,housenumber,160 Chemin des Vergers 07300 Étables,07086_0085_00160,G,160 CHEMIN DES VERGERS,
350171724,00031,35017172400031,O,2001-06-23,NN,,4334ZC,2015-03-17T00:29:14,true,3,,,,,LE BOSC,07300,ETABLES,,,07086,,,,,,,,,,,,,,,,,,,2008-01-01,A,,,,,43.34Z,NAFRev2,N,3.0325751,43.3501976,0.9,poi.peak,Le Bosc (Pic) Capestang,https://osm.org/node/4102662097,G,,
350998332,00026,35099833200026,O,2013-07-17,,,,2021-02-23T11:03:40,true,1,,270,,CHE,DE LA CULA,07300,ETABLES,,,07086,,,,,,,,,,,,,,,,,,,2013-07-17,A,,,,SYSTEM HYDRAULIQUE,45.32Z,NAFRev2,N,4.74449,45.080534,0.84,housenumber,270 chemin de la Cula 07300 Étables,07086_0028_00270,G,270 CHEMIN DE LA CULA,
353321151,00014,35332115100014,O,1989-01-01,NN,,,2008-01-04T23:53:01,true,3,,,,,CREMOLLIERES,07300,ETABLES,,,07086,,,,,,,,,,,,,,,,,,,2008-01-01,A,,,,,01.24Z,NAFRev2,N,4.733807,45.111684,0.72,street,Route de Crémolière 07300 Étables,07086_0095,G,ROUTE DE CREMOLIERE,
354002537,00018,35400253700018,O,,NN,,,,true,1,,,,,LE GRAND PERRIN,07300,ETABLES,,,07086,,,,,,,,,,,,,,,,,,,1991-07-31,F,,,,,01.07,NAP,N,4.734454,45.100338,0.48,street,Chemin de Grand Verne 07300 Étables,07086_0045,G,CHEMIN DE GRAND VERNE,
377571757,00014,37757175700014,O,1990-04-02,NN,,,2008-11-08T00:32:32,false,4,,,,,LA PAYE,07300,ETABLES,,,07086,,,,,,,,,,,,,,,,,,,1999-04-01,F,ENTREPRISE CHIROL BERNARD,,,,45.3A,NAF1993,O,4.73268,45.114238,0.46,street,Chemin de la Plaine 07300 Étables,07086_0110,G,CHEMIN DE LA PLAINE,
377571757,00022,37757175700022,O,1999-04-01,NN,,4321AB,2022-07-01T04:20:25,true,7,,600,,RTE,DE REAT,07300,ETABLES,,,07086,,,,,,,,,,,,,,,,,,,2022-06-30,F,,,,CHIROL BERNARD,43.21A,NAFRev2,N,4.724855,45.107054,0.84,housenumber,600 Route de Reat 07300 Étables,07086_0098_00600,G,600 ROUTE DE REAT,
378540843,00018,37854084300018,O,1990-07-03,,,,2008-11-08T00:34:10,true,3,,,,,LA CROIX DU FRAYSSE,07300,ETABLES,,,07086,,,,,,,,,,,,,,,,,,,1992-06-30,F,,,,,45.1A,NAF1993,N,4.726721,45.118071,0.93,street,Route de la Croix du Fraysse 07300 Étables,07086_0096,G,ROUTE DE LA CROIX DU FRAYSSE,
379075104,00032,37907510400032,O,1997-04-16,NN,,,,false,4,,,,,DOMAINE DU MOULIN,07300,ETABLES,,,07086,,,,,,,,,,,,,,,,,,,2003-04-18,F,,,,,70.2C,NAFRev1,N,5.0706344,44.3247685,0.9,poi.attraction,Domaine du Moulin (Attraction) Vinsobres,https://osm.org/way/117043825,G,,
380574756,00017,38057475600017,O,1991-01-01,NN,,,2008-01-04T21:44:40,true,3,,,,,MORENS,07300,ETABLES,,,07086,,,,,,,,,,,,,,,,,,,2008-01-01,A,,,,,01.21Z,NAFRev2,N,6.0606122,45.4981657,0.89,poi,Pont Morens La Chavanne,https://osm.org/way/39706574,G,,
380835637,00014,38083563700014,O,1991-01-01,NN,,,2023-09-28T15:35:02,true,3,,350,,CHE,DE CHAVEROCHE,07300,ETABLES,,,07086,,,,,,,,,,,,,,,,,,,2008-01-01,A,,,,,01.41Z,NAFRev2,N,4.732817,45.10548,0.89,housenumber,350 Chemin de Chaveroche 07300 Étables,07086_0022_00350,G,350 CHEMIN DE CHAVEROCHE,
380854273,00014,38085427300014,O,1991-01-01,NN,,,2016-01-12T00:13:50,true,3,,,,,PETIT CHERE,07300,ETABLES,,,07086,,,,,,,,,,,,,,,,,,,2008-01-01,A,,,,,01.13Z,NAFRev2,N,4.73863,45.105172,0.92,street,Chemin de Petit Chere 07300 Étables,07086_0071,G,CHEMIN DE PETIT CHERE,
381485341,00014,38148534100014,O,1991-04-04,NN,,,2013-10-03T04:49:49,true,7,,,,,LE PONT,07300,ETABLES,,,07086,,,,,,,,,,,,,,,,,,,2013-09-23,F,,,,,90.02Z,NAFRev2,N,4.744703,45.078361,0.34,street,Chemin du Soleil Levant 07300 Étables,07086_0090,G,CHEMIN DU SOLEIL LEVANT,
381769074,00018,38176907400018,O,1991-04-02,NN,,,2008-11-08T00:40:08,false,3,,,,,LA CROIX DU FRAYSSE,07300,ETABLES,,,07086,,,,,,,,,,,,,,,,,,,1995-08-01,F,,,,,45.1A,NAF1993,N,4.726721,45.118071,0.93,street,Route de la Croix du Fraysse 07300 Étables,07086_0096,G,ROUTE DE LA CROIX DU FRAYSSE,
381924075,00025,38192407500025,O,2003-10-22,NN,,,2008-05-13T13:51:32,false,4,,,,,LES BLACHES,07300,ETABLES,,,07086,,,,,,,,,,,,,,,,,,,2008-01-02,F,,,,,68.20A,NAFRev2,N,4.744095,45.087095,0.43,street,Chemin du Petit Marzillac 07300 Étables,07086_0042,G,CHEMIN DU PETIT MARZILLAC,
382037927,00037,38203792700037,O,2006-05-02,,,,2008-07-07T16:50:56,false,3,,,,QUAI,CHILET,07300,ETABLES,,,07086,,,,,,,,,,,,,,,,,,,2008-07-05,F,,,,,70.22Z,NAFRev2,N,,,0,,,,,,
382666030,00103,38266603000103,O,2020-08-01,,,,2021-12-04T14:28:58,true,3,,735,,RTE,DE REAT,07300,ETABLES,,,07086,,,,,,,,,,,,,,,,,,,2021-11-18,A,LE PETIT JESUS,,,ALARY DIDIER,47.81Z,NAFRev2,N,4.724324,45.107989,0.84,housenumber,735 Route de Reat 07300 Étables,07086_0098_00735,G,735 ROUTE DE REAT,
384941514,00018,38494151400018,O,1992-03-13,NN,,,2020-09-24T14:50:42,true,4,,,,,MORINS,07300,ETABLES,,,07086,,,,,,,,,,,,,,,,,,,2020-09-23,F,,,,,01.24Z,NAFRev2,N,4.743415,45.078884,0.52,street,Route de Maurins 07300 Étables,07086_0097,G,ROUTE DE MAURINS,
388887523,00024,38888752300024,O,2002-02-01,NN,,,2015-05-14T05:35:16,true,7,,,,QUA,LAPAYE,07300,ETABLES,,,07086,,,,,,,,,,,,,,,,,,,2013-07-31,F,,,,,43.32B,NAFRev2,O,,,0,,,,,,
389339516,00012,38933951600012,O,,,,,,true,1,,,,,LES PATAS,07300,ETABLES,,,07086,,,,,,,,,,,,,,,,,,,1996-12-31,F,,,,,01.1A,NAF1993,N,4.726506,45.100703,0.57,street,Rue des Payas 07300 Étables,07086_0103,G,RUE DES PAYAS,
389635954,00016,38963595400016,O,1981-01-01,,,,,true,3,,,,,BEL AIR,07300,ETABLES,,,07086,,,,,,,,,,,,,,,,,,,2003-06-30,F,,,,,01.1A,NAFRev1,,4.767402,45.090191,0.91,street,Chemin du Petit Bel Air 07300 Étables,07086_0088,G,CHEMIN DU PETIT BEL AIR,
390354157,00013,39035415700013,O,1993-01-01,NN,,,2008-01-04T23:38:57,true,3,,,,,PEYREFOUR,07300,ETABLES,,,07086,,,,,,,,,,,,,,,,,,,2008-01-01,A,,,,,01.21Z,NAFRev2,N,,,0,,,,,,
391088986,00040,39108898600040,O,2008-08-01,,,,2010-03-26T04:54:12,false,2,,,,,LE BOSC,07300,ETABLES,,,07086,,,,,,,,,,,,,,,,,,,2009-10-30,F,,,,,47.82Z,NAFRev2,N,3.0325751,43.3501976,0.9,poi.peak,Le Bosc (Pic) Capestang,https://osm.org/node/4102662097,G,,
391133550,00015,39113355000015,O,1980-01-01,NN,,,2016-01-24T03:50:19,true,3,,,,,CHAPELONNE,07300,ETABLES,,,07086,,,,,,,,,,,,,,,,,,,2008-01-01,A,,,,,01.24Z,NAFRev2,N,4.757447,45.099363,0.92,street,chemin de la Chapelonne 07300 Étables,07086_0021,G,CHEMIN DE LA CHAPELONNE,
393127568,00011,39312756800011,O,1993-11-19,02,2021,,2023-11-30T10:24:17,true,5,,595,,RTE,DE LA CROIX DU FRAYSSE,07300,ETABLES,,,07086,,,,,,,,,,,,,,,,,,,2022-01-01,A,FOOTBALL CLUB DU PLATEAU ARDECHOIS,,,,93.12Z,NAFRev2,O,4.726721,45.118071,0.78,street,Route de la Croix du Fraysse 07300 Étables,07086_0096,G,ROUTE DE LA CROIX DU FRAYSSE,
393349857,00010,39334985700010,O,1993-11-12,NN,,,2020-09-21T09:09:55,true,4,,,,,CREMOLIERE,07300,ETABLES,,,07086,,,,,,,,,,,,,,,,,,,2020-09-18,F,,,,,68.20B,NAFRev2,N,4.733807,45.111684,0.93,street,Route de Crémolière 07300 Étables,07086_0095,G,ROUTE DE CREMOLIERE,
393448816,00024,39344881600024,O,1993-01-01,NN,,,2021-02-23T11:19:11,true,3,,,,,LES COTS,07300,ETABLES,,,07086,,,,,,,,,,,,,,,,,,,2008-01-01,A,,,,,01.41Z,NAFRev2,N,4.722614,45.10234,0.81,street,Chemin des Cots 07300 Étables,07086_0048,G,CHEMIN DES COTS,
393561998,00013,39356199800013,O,1994-01-01,NN,,,2008-01-05T00:17:32,true,3,,,,,DOMAINE DU MOULIN,07300,ETABLES,,,07086,,,,,,,,,,,,,,,,,,,2008-01-01,A,,,,,68.20A,NAFRev2,N,5.0706344,44.3247685,0.9,poi.attraction,Domaine du Moulin (Attraction) Vinsobres,https://osm.org/way/117043825,G,,
393562244,00011,39356224400011,O,1994-01-01,NN,,,2009-12-13T05:37:16,true,4,,,,,DOMAINE DU MOULIN,07300,ETABLES,,,07086,,,,,,,,,,,,,,,,,,,2008-12-31,F,,,,,01.11Z,NAFRev2,N,5.0706344,44.3247685,0.9,poi.attraction,Domaine du Moulin (Attraction) Vinsobres,https://osm.org/way/117043825,G,,
394826523,00026,39482652300026,O,1998-04-15,,,,2006-12-15T00:53:17,false,3,,,,,CHAVEROCHE,07300,ETABLES,,,07086,,,,,,,,,,,,,,,,,,,1999-09-30,F,,,,,52.6E,NAF1993,N,4.732605,45.105452,0.92,street,Chemin de Chaveroche 07300 Étables,07086_0022,G,CHEMIN DE CHAVEROCHE,
395104300,00029,39510430000029,O,1996-09-30,NN,,,,false,4,,,,,,07300,ETABLES,,,07086,,,,,,,,,,,,,,,,,,,1997-07-01,F,HB-MG,,,,50.3A,NAF1993,O,,,0,,,,,,
398139568,00024,39813956800024,O,1996-06-28,NN,,,,true,1,,,,,GRAND PERRIN,07300,ETABLES,,,07086,,,,,,,,,,,,,,,,,,,2000-06-24,F,,,,,22.1E,NAF1993,N,4.740214,45.088409,0.5,street,chemin du Grand Marzillac 07300 Étables,07086_0087,G,CHEMIN DU GRAND MARZILLAC,
398707208,00011,39870720800011,O,1900-01-01,NN,,,2006-12-15T00:55:55,false,3,,,,,DOMAINE DU MOULIN,07300,ETABLES,,,07086,,,,,,,,,,,,,,,,,,,1994-12-31,F,,,,,52.2P,NAF1993,N,5.0706344,44.3247685,0.9,poi.attraction,Domaine du Moulin (Attraction) Vinsobres,https://osm.org/way/117043825,G,,