siren,nic,siret,statutDiffusionEtablissement,dateCreationEtablissement,trancheEffectifsEtablissement,anneeEffectifsEtablissement,activitePrincipaleRegistreMetiersEtablissement,dateDernierTraitementEtablissement,etablissementSiege,nombrePeriodesEtablissement,complementAdresseEtablissement,numeroVoieEtablissement,indiceRepetitionEtablissement,typeVoieEtablissement,libelleVoieEtablissement,codePostalEtablissement,libelleCommuneEtablissement,libelleCommuneEtrangerEtablissement,distributionSpecialeEtablissement,codeCommuneEtablissement,codeCedexEtablissement,libelleCedexEtablissement,codePaysEtrangerEtablissement,libellePaysEtrangerEtablissement,complementAdresse2Etablissement,numeroVoie2Etablissement,indiceRepetition2Etablissement,typeVoie2Etablissement,libelleVoie2Etablissement,codePostal2Etablissement,libelleCommune2Etablissement,libelleCommuneEtranger2Etablissement,distributionSpeciale2Etablissement,codeCommune2Etablissement,codeCedex2Etablissement,libelleCedex2Etablissement,codePaysEtranger2Etablissement,libellePaysEtranger2Etablissement,dateDebut,etatAdministratifEtablissement,enseigne1Etablissement,enseigne2Etablissement,enseigne3Etablissement,denominationUsuelleEtablissement,activitePrincipaleEtablissement,nomenclatureActivitePrincipaleEtablissement,caractereEmployeurEtablissement,longitude,latitude,geo_score,geo_type,geo_adresse,geo_id,geo_ligne,geo_l4,geo_l5
211002373,00010,21100237300010,O,1983-03-01,02,2021,,2023-11-30T10:18:01,true,4,,94,,,GRANDE RUE,10270,MONTAULIN,,,10245,,,,,,,,,,,,,,,,,,,2008-01-01,A,MAIRIE,,,,84.11Z,NAFRev2,O,4.194153,48.252299,0.96,housenumber,94 Grande Rue 10270 Montaulin,10245_0050_00094,G,94 GRANDE RUE,
211002373,00028,21100237300028,O,1983-12-21,02,2021,,2023-11-30T10:18:01,false,3,,94,,,GRANDE RUE,10270,MONTAULIN,,,10245,,,,,,,,,,,,,,,,,,,2008-01-01,A,ECOLE PRIMAIRE PUBLIQUE,,,,85.20Z,NAFRev2,N,4.194153,48.252299,0.96,housenumber,94 Grande Rue 10270 Montaulin,10245_0050_00094,G,94 GRANDE RUE,
211002373,00036,21100237300036,O,1983-12-21,NN,,,2016-04-26T01:19:36,false,5,,7,,RUE,DE LA LIBERATION DAUDES,10270,MONTAULIN,,,10245,,,,,,,,,,,,,,,,,,,2008-09-01,A,ECOLE ELEMENTAIRE PUBLIQUE,,,,85.20Z,NAFRev2,N,4.183437,48.244121,0.76,housenumber,7 Rue de la Liberation 10270 Montaulin,10245_0070_00007,G,7 RUE DE LA LIBERATION,
211002373,00044,21100237300044,O,2003-09-01,NN,,,2014-06-13T23:25:05,false,3,,7,,RUE,DE LA LIBERATION DAUDES,10270,MONTAULIN,,,10245,,,,,,,,,,,,,,,,,,,2008-01-01,A,ECOLE MATERNELLE PUBLIQUE,,,,85.10Z,NAFRev2,N,4.183437,48.244121,0.76,housenumber,7 Rue de la Liberation 10270 Montaulin,10245_0070_00007,G,7 RUE DE LA LIBERATION,
251001467,00017,25100146700017,O,1995-06-23,NN,,,2006-10-26T23:43:14,true,3,,,,,,10270,MONTAULIN,,,10245,,,,,,,,,,,,,,,,,,,2006-03-27,F,,,,,75.1E,NAFRev1,N,,,0,,,,,,
261002398,00012,26100239800012,O,1983-03-01,NN,,,2010-06-26T03:04:12,true,3,MAIRIE,26,,,GRANDE RUE,10270,MONTAULIN,,,10245,,,,,,,,,,,,,,,,,,,2008-01-01,A,CCAS,,,,88.99B,NAFRev2,N,4.185892,48.246551,0.96,housenumber,26 Grande Rue 10270 Montaulin,10245_0050_00026,G,26 GRANDE RUE,
261005821,00010,26100582100010,O,,,,,,true,1,,,,,,10270,MONTAULIN,,,10245,,,,,,,,,,,,,,,,,,,,F,,,,,95.11,NAP,N,,,0,,,,,,
291002350,00010,29100235000010,O,1985-01-10,01,2021,,2023-11-30T10:19:16,true,4,MAIRIE,26,,,GRANDE RUE,10270,MONTAULIN,,,10245,,,,,,,,,,,,,,,,,,,2014-02-02,A,,,,,42.99Z,NAFRev2,O,4.185892,48.246551,0.96,housenumber,26 Grande Rue 10270 Montaulin,10245_0050_00026,G,26 GRANDE RUE,
300968948,00012,30096894800012,O,,,,,,true,1,,,,,GRANDE RUE,10270,MONTAULIN,,,10245,,,,,,,,,,,,,,,,,,,1984-12-25,F,,,,,67.04,NAP,N,4.193724,48.25152,0.96,street,Grande Rue 10270 Montaulin,10245_0050,G,GRANDE RUE,
302334347,00028,30233434700028,O,,,,,,true,1,,,,RTE,DE MONTABERT,10270,MONTAULIN,,,10245,,,,,,,,,,,,,,,,,,,1997-03-10,F,,,,,45.2V,NAF1993,N,4.18418,48.248132,0.79,street,Rue de Montabert 10270 Montaulin,10245_0080,G,RUE DE MONTABERT,
302334354,00024,30233435400024,O,,,,,,true,1,,,,RTE,DE MONTABERT,10270,MONTAULIN,,,10245,,,,,,,,,,,,,,,,,,,1997-03-10,F,,,,,45.2V,NAF1993,N,4.18418,48.248132,0.79,street,Rue de Montabert 10270 Montaulin,10245_0080,G,RUE DE MONTABERT,
304900921,00020,30490092100020,O,,NN,,,,true,1,,,,,,10270,MONTAULIN,,,10245,,,,,,,,,,,,,,,,,,,1997-03-10,F,,,,,45.2V,NAF1993,O,,,0,,,,,,
308068493,00029,30806849300029,O,,,,,,true,1,,,,,,10270,MONTAULIN,,,10245,,,,,,,,,,,,,,,,,,,1985-12-25,F,,,,,64.11,NAP,N,,,0,,,,,,
309424737,00018,30942473700018,O,,NN,,,,true,1,,,,,,10270,MONTAULIN,,,10245,,,,,,,,,,,,,,,,,,,1990-12-15,F,,,,,77.12,NAP,N,,,0,,,,,,
312180755,00018,31218075500018,O,1978-01-01,NN,,,2014-07-08T00:16:14,true,5,,2,,RUE,HAMEAU DAUDES,10270,MONTAULIN,,,10245,,,,,,,,,,,,,,,,,,,2010-11-30,F,,,,,43.21A,NAFRev2,O,4.20204,48.254539,0.44,housenumber,2 Rue des Hatelles 10270 Montaulin,10245_0062_00002,G,2 RUE DES HATELLES,
312427008,00023,31242700800023,O,1997-06-01,NN,,,2010-04-21T08:06:01,false,6,,7,,RUE,DE LA HAIE DE LA PELLE,10270,MONTAULIN,,,10245,,,,,,,,,,,,,,,,,,,2010-01-01,F,,,,,82.99Z,NAFRev2,N,4.189577,48.25466,0.95,housenumber,7 Rue de la Haie de la Pelle 10270 Montaulin,10245_0055_00007,G,7 RUE DE LA HAIE DE LA PELLE,
312632367,00040,31263236700040,O,,,,,,true,1,,74,,,GRANDE RUE,10270,MONTAULIN,,,10245,,,,,,,,,,,,,,,,,,,1989-10-23,F,,,,,70.2C,NAF1993,N,4.193724,48.25152,0.96,street,Grande Rue 10270 Montaulin,10245_0050,G,GRANDE RUE,
314190885,00033,31419088500033,O,,NN,,,,true,1,,,,,GRANDE RUE,10270,MONTAULIN,,,10245,,,,,,,,,,,,,,,,,,,1988-03-14,F,,,,,65.03,NAP,N,4.193724,48.25152,0.96,street,Grande Rue 10270 Montaulin,10245_0050,G,GRANDE RUE,
314993213,00037,31499321300037,O,1980-02-01,NN,,,,false,4,,4,,CHE,DE MONTABERT,10270,MONTAULIN,,,10245,,,,,,,,,,,,,,,,,,,2002-12-31,F,,,,,45.4M,NAF1993,O,4.1852,48.247059,0.76,housenumber,4 Rue de Montabert 10270 Montaulin,10245_0080_00004,G,4 RUE DE MONTABERT,
316042209,00015,31604220900015,O,1900-01-01,NN,,,2011-04-28T00:15:58,false,3,,19,,,GRANDE RUE,10270,MONTAULIN,,,10245,,,,,,,,,,,,,,,,,,,1994-06-30,F,,,,,01.1A,NAF1993,N,4.186235,48.246795,0.96,interpolation,19 Grande Rue 10270 Montaulin,,G,17 GRANDE RUE,
316560101,00016,31656010100016,O,,,,,,true,1,,1,,,LOTISSEMENT LA CUMINE,10270,MONTAULIN,,,10245,,,,,,,,,,,,,,,,,,,1986-09-18,F,,,,,47.02,NAP,N,4.196293,48.257843,0.47,housenumber,1 Rue de la Cumine 10270 Montaulin,10245_0035_00001,G,1 RUE DE LA CUMINE,
319572574,00014,31957257400014,O,,,,,,true,1,,,,,,10270,MONTAULIN,,,10245,,,,,,,,,,,,,,,,,,,1984-12-25,F,,,,,59.08,NAP,N,,,0,,,,,,
320141039,00018,32014103900018,O,1980-11-01,NN,,,,true,3,,,,,,10270,MONTAULIN,,,10245,,,,,,,,,,,,,,,,,,,1992-12-25,F,,,,,70.1D,NAF1993,N,,,0,,,,,,
327623104,00020,32762310400020,O,2016-01-05,,,,2017-03-17T09:58:45,false,1,,,,,LES NOUES,10270,MONTAULIN,,,10245,,,,,,,,,,,,,,,,,,,2016-01-05,A,,,,,02.10Z,NAFRev2,N,4.214248,48.241644,0.94,street,Les Noues 10270 Montaulin,10245_zsl67w,G,LES NOUES,
331422089,00010,33142208900010,O,,NN,,,,true,1,,,,,HAM DAUDES,10270,MONTAULIN,,,10245,,,,,,,,,,,,,,,,,,,1987-07-23,F,,,,,15.09,NAP,N,4.202348,48.254108,0.38,street,Chemin des Hatelles 10270 Montaulin,10245_0060,G,CHEMIN DES HATELLES,
332419217,00010,33241921700010,O,,NN,,,,true,1,,14,,RUE,DE MONTABERT,10270,MONTAULIN,,,10245,,,,,,,,,,,,,,,,,,,1988-07-11,F,,,,,78.02,NAP,N,4.18326,48.249758,0.95,housenumber,14 Rue de Montabert 10270 Montaulin,10245_0080_00014,G,14 RUE DE MONTABERT,
332540665,00012,33254066500012,O,1985-04-29,NN,,,2014-07-08T00:37:44,true,4,,102,,,GRANDE RUE,10270,MONTAULIN,,,10245,,,,,,,,,,,,,,,,,,,2009-06-30,F,,,,,43.22A,NAFRev2,N,4.194619,48.253331,0.96,housenumber,102 Grande Rue 10270 Montaulin,10245_0050_00102,G,102 GRANDE RUE,
337944557,00012,33794455700012,O,,NN,,,,true,1,,2,,RUE,MONTABERT,10270,MONTAULIN,,,10245,,,,,,,,,,,,,,,,,,,1988-06-13,F,,,,,55.60,NAP,N,4.185425,48.246765,0.94,housenumber,2 Rue de Montabert 10270 Montaulin,10245_0080_00002,G,2 RUE DE MONTABERT,
343282505,00027,34328250500027,O,1989-03-01,NN,,,2008-11-08T00:17:30,false,4,DAUDES,16,,RUE,LIBERATION,10270,MONTAULIN,,,10245,,,,,,,,,,,,,,,,,,,1995-01-01,F,,,,,50.1Z,NAF1993,N,4.178384,48.243998,0.94,housenumber,16 Rue de la Liberation 10270 Montaulin,10245_0070_00016,G,16 RUE DE LA LIBERATION,
343282505,00035,34328250500035,O,1995-01-01,NN,,4520AB,2020-08-25T10:41:13,true,6,DAUDES,1,,RUE,DE LA RANCE,10270,MONTAULIN,,,10245,,,,,,,,,,,,,,,,,,,2018-12-30,F,,,,,45.20A,NAFRev2,O,4.178028,48.244414,0.94,housenumber,1 Rue de la Rance 10270 Montaulin,10245_0019_00001,G,1 RUE DE LA RANCE,
349138750,00022,34913875000022,O,1990-09-29,NN,,,,true,4,HAMEAU DAUDES,10,,RUE,DU CHATEAU,10270,MONTAULIN,,,10245,,,,,,,,,,,,,,,,,,,1994-12-25,F,,,,,74.1J,NAF1993,N,4.182914,48.253336,0.95,housenumber,10 Rue du Château 10270 Montaulin,10245_0001_00010,G,10 RUE DU CHATEAU,
349688549,00014,34968854900014,O,1989-02-01,,,,,true,3,,,,,DAUDES,10270,MONTAULIN,,,10245,,,,,,,,,,,,,,,,,,,1991-12-25,F,,,,,67.08,NAP,N,4.202348,48.254108,0.38,street,Chemin des Hatelles 10270 Montaulin,10245_0060,G,CHEMIN DES HATELLES,
349762211,00010,34976221100010,O,1989-02-01,,,,2008-11-08T00:24:57,false,3,DAUDES,2,,RUE,SAINT JEAN,10270,MONTAULIN,,,10245,,,,,,,,,,,,,,,,,,,2005-07-01,F,,,,,74.2A,NAFRev1,O,4.179861,48.247406,0.95,housenumber,2 Rue Saint Jean 10270 Montaulin,10245_0105_00002,G,2 RUE SAINT JEAN,
349762211,00036,34976221100036,O,2005-07-01,NN,,4332CZ,2015-03-17T00:29:00,true,3,,14,,RUE,SAINT JEAN,10270,MONTAULIN,,,10245,,,,,,,,,,,,,,,,,,,2008-01-01,F,,,,,71.11Z,NAFRev2,O,4.178628,48.246484,0.95,housenumber,14 Rue Saint Jean 10270 Montaulin,10245_0105_00014,G,14 RUE SAINT JEAN,
351194980,00014,35119498000014,O,1989-06-01,NN,,,,false,4,,10,,RUE,DE LA GARE,10270,MONTAULIN,,,10245,,,,,,,,,,,,,,,,,,,1999-10-01,F,,,,,70.1D,NAF1993,N,4.195243,48.257489,0.95,housenumber,10 Rue de la Gare 10270 Montaulin,10245_0040_00010,G,10 RUE DE LA GARE,
352319990,00029,35231999000029,O,1999-09-01,NN,,,2010-01-29T11:57:54,true,3,,74,,,GRANDE RUE,10270,MONTAULIN,,,10245,,,,,,,,,,,,,,,,,,,2008-01-01,A,,,,,68.20B,NAFRev2,N,4.193724,48.25152,0.96,street,Grande Rue 10270 Montaulin,10245_0050,G,GRANDE RUE,
352943823,00018,35294382300018,O,,NN,,,,true,1,,,,,,10270,MONTAULIN,,,10245,,,,,,,,,,,,,,,,,,,1992-03-31,F,,,,,51.6G,NAF1993,N,,,0,,,,,,
377954052,00017,37795405200017,O,1990-04-23,,,,,false,3,,64,,RUE,GRANDE RUE,10270,MONTAULIN,,,10245,,,,,,,,,,,,,,,,,,,1997-04-18,F,,,,,70.1D,NAF1993,N,4.190165,48.248283,0.84,housenumber,64 Grande Rue 10270 Montaulin,10245_0050_00064,G,64 GRANDE RUE,
379082712,00025,37908271200025,O,,NN,,,,true,1,,,,,,10270,MONTAULIN,,,10245,,,,,,,,,,,,,,,,,,,1994-01-19,F,,,,,55.3A,NAF1993,N,,,0,,,,,,
379142003,00027,37914200300027,O,2000-04-04,NN,,1812ZB,2015-03-17T00:32:56,true,3,DAUDES,6,,RUE,DU MONTOT,10270,MONTAULIN,,,10245,,,,,,,,,,,,,,,,,,,2008-01-01,A,,,,,18.12Z,NAFRev2,N,4.182652,48.243553,0.95,housenumber,6 Rue du Montot 10270 Montaulin,10245_0085_00006,G,6 RUE DU MONTOT,
379918105,00014,37991810500014,O,1990-11-12,,,,,false,3,,4,B,RUE,DES HATELLES,10270,MONTAULIN,,,10245,,,,,,,,,,,,,,,,,,,1998-01-31,F,,,,,60.2L,NAF1993,N,4.20178,48.2541,0.85,housenumber,4bis Rue des Hatelles 10270 Montaulin,10245_0062_00004_bis,G,4BIS RUE DES HATELLES,
380397802,00014,38039780200014,O,1991-01-04,NN,,,2023-10-21T03:36:15,true,3,,7,,RUE,HAIE DE LA PELLE,10270,MONTAULIN,,,10245,,,,,,,,,,,,,,,,,,,2008-01-01,A,,,,,41.10D,NAFRev2,N,4.189577,48.25466,0.91,housenumber,7 Rue de la Haie de la Pelle 10270 Montaulin,10245_0055_00007,G,7 RUE DE LA HAIE DE LA PELLE,
381773324,00011,38177332400011,O,1991-04-15,NN,,,2008-04-26T11:48:38,true,4,,17,,RUE,DU CHATEAU,10270,MONTAULIN,,,10245,,,,,,,,,,,,,,,,,,,2007-03-08,F,,,,,60.2M,NAFRev1,O,4.182789,48.252371,0.95,housenumber,17 Rue du Château 10270 Montaulin,10245_0001_00017,G,17 RUE DU CHATEAU,
381939552,00042,38193955200042,O,2019-09-23,,,,2019-10-01T15:16:13,true,1,,129,,RUE,GRANDE RUE,10270,MONTAULIN,,,10245,,,,,,,,,,,,,,,,,,,2019-09-23,A,,,,,90.02Z,NAFRev2,N,4.197072,48.25595,0.85,housenumber,129 Grande Rue 10270 Montaulin,10245_0050_00129,G,129 GRANDE RUE,
383151586,00013,38315158600013,O,1991-10-02,NN,,,,false,4,,10,,RUE,DE LA GARE,10270,MONTAULIN,,,10245,,,,,,,,,,,,,,,,,,,2000-05-22,F,,,,,70.2C,NAF1993,N,4.195243,48.257489,0.95,housenumber,10 Rue de la Gare 10270 Montaulin,10245_0040_00010,G,10 RUE DE LA GARE,
383314440,00017,38331444000017,O,,NN,,,,true,1,,1,,RUE,DE LA LIBERATION,10270,MONTAULIN,,,10245,,,,,,,,,,,,,,,,,,,1992-06-30,F,,,,,55.3A,NAF1993,N,4.186061,48.243285,0.95,housenumber,1 Rue de la Liberation 10270 Montaulin,10245_0070_00001,G,1 RUE DE LA LIBERATION,
384405478,00015,38440547800015,O,1992-01-01,NN,,,2014-07-08T01:11:12,true,5,,79,,,GRANDE RUE,10270,MONTAULIN,,,10245,,,,,,,,,,,,,,,,,,,2010-02-15,F,,,,,43.99B,NAFRev2,O,4.193495,48.251406,0.96,housenumber,79 Grande Rue 10270 Montaulin,10245_0050_00079,G,79 GRANDE RUE,
384835732,00023,38483573200023,O,2015-06-04,,,,2018-05-17T10:12:00,true,2,,81,,,GRANDE RUE,10270,MONTAULIN,,,10245,,,,,,,,,,,,,,,,,,,2017-12-31,F,,,,CHARLY LE BOSS,47.81Z,NAFRev2,N,4.193661,48.251703,0.96,housenumber,81 Grande Rue 10270 Montaulin,10245_0050_00081,G,81 GRANDE RUE,
388593113,00011,38859311300011,O,1992-08-03,NN,,,2016-06-08T09:24:51,true,5,DAUDES,1,,RUE,DE LA LIBERATION,10270,MONTAULIN,,,10245,,,,,,,,,,,,,,,,,,,2016-01-16,A,,,,,47.99A,NAFRev2,N,4.186061,48.243285,0.95,housenumber,1 Rue de la Liberation 10270 Montaulin,10245_0070_00001,G,1 RUE DE LA LIBERATION,
391169687,00012,39116968700012,O,1993-01-01,NN,,,2017-10-05T10:17:08,true,4,,,,,,10270,MONTAULIN,,,10245,,,,,,,,,,,,,,,,,,,2016-09-04,F,,,,,01.11Z,NAFRev2,N,,,0,,,,,,
393312483,00026,39331248300026,P,1995-09-01,NN,,,2016-07-11T07:50:13,false,4,[ND],[ND],[ND],[ND],[ND],[ND],MONTAULIN,,[ND],10245,[ND],[ND],,,[ND],[ND],[ND],[ND],[ND],[ND],,,[ND],,[ND],[ND],,,2001-06-25,F,[ND],[ND],[ND],[ND],52.6D,NAF1993,N,,,0,,,,,,
393564448,00016,39356444800016,O,,NN,,,,true,1,,13,,RUE,DE LA LIBERATION,10270,MONTAULIN,,,10245,,,,,,,,,,,,,,,,,,,1996-12-30,F,,,,,01.3Z,NAF1993,N,4.181689,48.244202,0.95,housenumber,13 Rue de la Liberation 10270 Montaulin,10245_0070_00013,G,13 RUE DE LA LIBERATION,
397501768,00014,39750176800014,O,1994-06-15,NN,,,,false,3,,19,,,GRANDE RUE,10270,MONTAULIN,,,10245,,,,,,,,,,,,,,,,,,,1994-12-25,F,,,,,51.2A,NAF1993,O,4.186235,48.246795,0.96,interpolation,19 Grande Rue 10270 Montaulin,,G,17 GRANDE RUE,
397872813,00027,39787281300027,O,2005-03-01,NN,,4399CZ,2015-03-17T00:42:08,true,3,DAUDES,7,,RUE,SAINT JEAN,10270,MONTAULIN,,,10245,,,,,,,,,,,,,,,,,,,2010-01-19,F,,,,,43.99C,NAFRev2,O,4.178877,48.246442,0.95,housenumber,7 Rue Saint Jean 10270 Montaulin,10245_0105_00007,G,7 RUE SAINT JEAN,
399434315,00012,39943431500012,O,1994-12-23,NN,,,2008-01-05T20:14:22,true,3,,79,,,GRANDE RUE,10270,MONTAULIN,,,10245,,,,,,,,,,,,,,,,,,,2008-01-01,A,,,,,68.20B,NAFRev2,N,4.193495,48.251406,0.96,housenumber,79 Grande Rue 10270 Montaulin,10245_0050_00079,G,79 GRANDE RUE,
399483767,00022,39948376700022,O,2006-04-01,,,,2018-11-22T14:22:15,false,2,,119,,,GRANDE RUE,10270,MONTAULIN,,,10245,,,,,,,,,,,,,,,,,,,2007-03-31,F,JPP,,,,52.7C,NAFRev1,N,4.196112,48.254988,0.96,housenumber,119 Grande Rue 10270 Montaulin,10245_0050_00119,G,119 GRANDE RUE,
400418257,00038,40041825700038,O,2001-01-01,NN,,,2006-11-25T13:20:45,true,3,,1,,RUE,DE LA BORDE,10270,MONTAULIN,,,10245,,,,,,,,,,,,,,,,,,,2006-06-30,F,,,,,52.3E,NAFRev1,N,4.185238,48.246073,0.94,housenumber,1 Rue de la Borde 10270 Montaulin,10245_5vf8aj_00001,G,1 RUE DE LA BORDE,
400847091,00016,40084709100016,O,1995-04-13,,,,2008-01-04T19:36:15,true,4,MR JEAN SIMONET,13,,RUE,DU CHATEAU,10270,MONTAULIN,,,10245,,,,,,,,,,,,,,,,,,,2008-01-01,A,,,,,94.99Z,NAFRev2,N,4.183166,48.254554,0.95,housenumber,13 Rue du Château 10270 Montaulin,10245_0001_00013,G,13 RUE DU CHATEAU,
403277247,00017,40327724700017,O,,NN,,,,true,1,,,,,,10270,MONTAULIN,,,10245,,,,,,,,,,,,,,,,,,,1995-08-01,F,,,,,70.2B,NAF1993,N,,,0,,,,,,
403804750,00012,40380475000012,O,1996-02-01,NN,,,2011-05-03T00:24:48,false,4,,2,,RUE,ST JEAN,10270,MONTAULIN,,,10245,,,,,,,,,,,,,,,,,,,2001-01-22,F,,,,,45.2V,NAF1993,O,4.179861,48.247406,0.82,housenumber,2 Rue Saint Jean 10270 Montaulin,10245_0105_00002,G,2 RUE SAINT JEAN,
408806313,00016,40880631300016,O,1980-12-31,NN,,,,true,4,,6,,RUE,DE MERMEVILLE,10270,MONTAULIN,,,10245,,,,,,,,,,,,,,,,,,,2000-07-31,F,,,,,01.1A,NAF1993,N,4.180651,48.247474,0.76,housenumber,6 Rue de Menneville 10270 Montaulin,10245_0017_00006,G,6 RUE DE MENNEVILLE,
408806321,00019,40880632100019,O,1980-12-31,NN,,,2023-01-21T03:34:49,true,4,,,,,,10270,MONTAULIN,,,10245,,,,,,,,,,,,,,,,,,,2022-12-31,F,,,,,01.11Z,NAFRev2,N,,,0,,,,,,
408806339,00011,40880633900011,O,1995-01-01,NN,,,,true,1,,47,,GR,RUE,10270,MONTAULIN,,,10245,,,,,,,,,,,,,,,,,,,2000-04-24,F,,,,,01.1A,NAF1993,N,4.190005,48.248304,0.76,interpolation,47 Grande Rue 10270 Montaulin,,G,45 GRANDE RUE,
409251931,00013,40925193100013,O,1996-09-21,NN,,,2013-02-04T09:24:31,true,3,,29,,,GRANDE RUE,10270,MONTAULIN,,,10245,,,,,,,,,,,,,,,,,,,2008-01-01,A,,,,,68.20B,NAFRev2,N,4.187645,48.247301,0.96,housenumber,29 Grande Rue 10270 Montaulin,10245_0050_00029,G,29 GRANDE RUE,
409557402,00024,40955740200024,P,2002-11-05,NN,,,2006-11-25T15:21:32,false,3,[ND],[ND],[ND],[ND],[ND],[ND],MONTAULIN,,[ND],10245,[ND],[ND],,,[ND],[ND],[ND],[ND],[ND],[ND],,,[ND],,[ND],[ND],,,2005-08-01,F,[ND],[ND],[ND],[ND],74.1J,NAFRev1,N,,,0,,,,,,
410024269,00012,41002426900012,O,1994-01-01,NN,,,2008-01-04T21:36:01,true,3,,3,,RUE,DE MONTABERT,10270,MONTAULIN,,,10245,,,,,,,,,,,,,,,,,,,2008-01-01,A,,,,,01.11Z,NAFRev2,N,4.183892,48.248846,0.95,housenumber,3 Rue de Montabert 10270 Montaulin,10245_0080_00003,G,3 RUE DE MONTABERT,
411439847,00012,41143984700012,O,1997-04-07,,,,,true,1,,1,,RUE,DE MONTABERT,10270,MONTAULIN,,,10245,,,,,,,,,,,,,,,,,,,1999-07-19,F,,,,,45.2V,NAF1993,N,4.185268,48.246815,0.95,housenumber,1 Rue de Montabert 10270 Montaulin,10245_0080_00001,G,1 RUE DE MONTABERT,
411697519,00014,41169751900014,O,1997-04-02,,,,,true,1,,61,,,GRANDE RUE,10270,MONTAULIN,,,10245,,,,,,,,,,,,,,,,,,,2000-12-31,F,,,,,55.3A,NAF1993,N,4.193724,48.25152,0.96,street,Grande Rue 10270 Montaulin,10245_0050,G,GRANDE RUE,
415107648,00016,41510764800016,O,1998-01-13,NN,,,2008-01-05T20:32:49,true,3,DAUDES,3,,RUE,DE LA RANCE,10270,MONTAULIN,,,10245,,,,,,,,,,,,,,,,,,,2008-01-01,A,,,,,68.20B,NAFRev2,N,4.177993,48.244653,0.94,housenumber,3 Rue de la Rance 10270 Montaulin,10245_0019_00003,G,3 RUE DE LA RANCE,
419380027,00021,41938002700021,O,2001-10-29,NN,,4391BZ,2015-03-17T00:53:37,true,5,DAUDES,19,,RUE,DE LA LIBERATION,10270,MONTAULIN,,,10245,,,,,,,,,,,,,,,,,,,2007-09-18,F,,,,,45.2J,NAFRev1,O,4.179696,48.244282,0.95,housenumber,19 Rue de la Liberation 10270 Montaulin,10245_0070_00019,G,19 RUE DE LA LIBERATION,
420414914,00010,42041491400010,O,1998-09-09,NN,,,2010-04-18T08:02:43,true,6,CHEZ MME GOUSSARD,11,,LOT,LA CUMINE,10270,MONTAULIN,,,10245,,,,,,,,,,,,,,,,,,,2008-06-30,A,,,,,93.12Z,NAFRev2,N,4.196533,48.257764,0.67,housenumber,11 Rue de la Cumine 10270 Montaulin,10245_0035_00011,G,11 RUE DE LA CUMINE,
422394940,00015,42239494000015,O,1999-04-01,NN,,,2008-01-05T20:42:43,true,3,DAUDES,1,,RUE,DE LA LIBERATION,10270,MONTAULIN,,,10245,,,,,,,,,,,,,,,,,,,2008-01-01,A,,,,,68.20B,NAFRev2,N,4.186061,48.243285,0.95,housenumber,1 Rue de la Liberation 10270 Montaulin,10245_0070_00001,G,1 RUE DE LA LIBERATION,
423859248,00019,42385924800019,O,1999-05-26,,,,2008-01-05T00:44:34,true,3,,1,,RUE,DE MONTABERT,10270,MONTAULIN,,,10245,,,,,,,,,,,,,,,,,,,2008-01-01,A,,,,,94.99Z,NAFRev2,N,4.185268,48.246815,0.95,housenumber,1 Rue de Montabert 10270 Montaulin,10245_0080_00001,G,1 RUE DE MONTABERT,
423888452,00012,42388845200012,O,1999-08-06,NN,,,2008-01-05T20:45:49,true,3,,,,,GRANDE RUE,10270,MONTAULIN,,,10245,,,,,,,,,,,,,,,,,,,2008-01-01,A,,,,,68.20B,NAFRev2,N,4.193724,48.25152,0.96,street,Grande Rue 10270 Montaulin,10245_0050,G,GRANDE RUE,
424796092,00015,42479609200015,O,1999-09-20,NN,,,2014-07-08T02:03:00,true,4,,17,,RUE,DE LA GARE,10270,MONTAULIN,,,10245,,,,,,,,,,,,,,,,,,,2009-11-30,F,,,,,43.99C,NAFRev2,O,4.194402,48.258984,0.95,housenumber,17 Rue de la Gare 10270 Montaulin,10245_0040_00017,G,17 RUE DE LA GARE,
428558035,00013,42855803500013,O,1989-01-01,NN,,,,true,3,,,,,,10270,MONTAULIN,,,10245,,,,,,,,,,,,,,,,,,,2003-12-31,F,,,,,70.2B,NAFRev1,N,,,0,,,,,,
428571277,00014,42857127700014,O,1986-01-01,NN,,,2008-01-05T01:28:09,true,3,,,,,,10270,MONTAULIN,,,10245,,,,,,,,,,,,,,,,,,,2008-01-01,A,,,,,01.11Z,NAFRev2,N,,,0,,,,,,
428706998,00013,42870699800013,O,1999-11-18,NN,,,,true,1,,1,,RUE,DE LA LIBERATION,10270,MONTAULIN,,,10245,,,,,,,,,,,,,,,,,,,2002-04-04,F,,,,,70.1D,NAF1993,N,4.186061,48.243285,0.95,housenumber,1 Rue de la Liberation 10270 Montaulin,10245_0070_00001,G,1 RUE DE LA LIBERATION,
430056838,00021,43005683800021,O,2001-01-22,NN,,,2006-10-31T00:54:27,false,3,,61,,,GRANDE RUE,10270,MONTAULIN,,,10245,,,,,,,,,,,,,,,,,,,2004-06-16,F,,,,,74.1J,NAFRev1,N,4.193724,48.25152,0.96,street,Grande Rue 10270 Montaulin,10245_0050,G,GRANDE RUE,
430336792,00014,43033679200014,O,2000-04-11,NN,,,2019-12-12T03:47:37,true,3,,2,,RUE,SAINT JEAN,10270,MONTAULIN,,,10245,,,,,,,,,,,,,,,,,,,2008-01-01,A,,,,,68.20B,NAFRev2,N,4.179861,48.247406,0.95,housenumber,2 Rue Saint Jean 10270 Montaulin,10245_0105_00002,G,2 RUE SAINT JEAN,
431435833,00014,43143583300014,O,2000-04-25,NN,,,2023-10-10T19:39:54,true,3,,101,,,GRANDE RUE,10270,MONTAULIN,,,10245,,,,,,,,,,,,,,,,,,,2008-01-01,A,,,,,01.11Z,NAFRev2,N,4.193724,48.25152,0.96,street,Grande Rue 10270 Montaulin,10245_0050,G,GRANDE RUE,
432842425,00014,43284242500014,O,2000-09-15,NN,,,2008-01-05T20:56:33,true,3,,4,,CHE,DE MONTABERT,10270,MONTAULIN,,,10245,,,,,,,,,,,,,,,,,,,2008-01-01,A,,,,,68.20B,NAFRev2,N,4.1852,48.247059,0.76,housenumber,4 Rue de Montabert 10270 Montaulin,10245_0080_00004,G,4 RUE DE MONTABERT,
433439882,00013,43343988200013,O,2000-10-17,NN,,,,false,3,,12,,RUE,DE MONTABERT,10270,MONTAULIN,,,10245,,,,,,,,,,,,,,,,,,,2003-08-26,F,,,,,92.3A,NAFRev1,N,4.183458,48.249573,0.95,housenumber,12 Rue de Montabert 10270 Montaulin,10245_0080_00012,G,12 RUE DE MONTABERT,
433495678,00024,43349567800024,O,2006-12-08,NN,,4399CZ,2015-03-17T01:02:05,true,3,,3,,RUE,DE LA RANCE,10270,MONTAULIN,,,10245,,,,,,,,,,,,,,,,,,,2010-11-23,F,,,,,43.99C,NAFRev2,O,4.177993,48.244653,0.94,housenumber,3 Rue de la Rance 10270 Montaulin,10245_0019_00003,G,3 RUE DE LA RANCE,
434078820,00025,43407882000025,O,2010-02-15,,,,2021-02-23T13:15:50,true,1,,79,,,GRANDE RUE,10270,MONTAULIN,,,10245,,,,,,,,,,,,,,,,,,,2010-02-15,A,,,,,41.20B,NAFRev2,N,4.193495,48.251406,0.96,housenumber,79 Grande Rue 10270 Montaulin,10245_0050_00079,G,79 GRANDE RUE,
434335071,00016,43433507100016,O,2001-01-22,NN,,,2008-11-08T02:00:44,true,3,,61,,,GRANDE RUE,10270,MONTAULIN,,,10245,,,,,,,,,,,,,,,,,,,2004-06-15,F,,,,,55.3A,NAFRev1,N,4.193724,48.25152,0.96,street,Grande Rue 10270 Montaulin,10245_0050,G,GRANDE RUE,
434520490,00054,43452049000054,P,2021-02-02,,,,2021-12-24T03:51:32,false,2,[ND],[ND],[ND],[ND],[ND],[ND],MONTAULIN,,[ND],10245,[ND],[ND],,,[ND],[ND],[ND],[ND],[ND],[ND],,,[ND],,[ND],[ND],,,2021-12-01,F,[ND],[ND],[ND],[ND],68.31Z,NAFRev2,N,,,0,,,,,,
435071923,00013,43507192300013,O,2001-01-22,,,,2022-05-12T14:07:14,false,3,,61,,,GRANDE RUE,10270,MONTAULIN,,,10245,,,,,,,,,,,,,,,,,,,2001-12-31,F,,,,,74.1J,NAF1993,N,4.193724,48.25152,0.96,street,Grande Rue 10270 Montaulin,10245_0050,G,GRANDE RUE,
439566944,00013,43956694400013,O,2001-10-29,,,,,true,1,,19,,RUE,DE LA LIBERATION,10270,MONTAULIN,,,10245,,,,,,,,,,,,,,,,,,,2001-10-29,F,,,,,45.2J,NAF1993,N,4.179696,48.244282,0.95,housenumber,19 Rue de la Liberation 10270 Montaulin,10245_0070_00019,G,19 RUE DE LA LIBERATION,
441181146,00016,44118114600016,O,2002-02-06,NN,,,2008-01-05T21:11:21,true,3,DAUDES,5,,RUE,DE LA REPUBLIQUE,10270,MONTAULIN,,,10245,,,,,,,,,,,,,,,,,,,2008-01-01,A,,,,,68.20B,NAFRev2,N,4.195768,48.256977,0.56,housenumber,5 Rue de la Gare 10270 Montaulin,10245_0040_00005,G,5 RUE DE LA GARE,