siren,nic,siret,statutDiffusionEtablissement,dateCreationEtablissement,trancheEffectifsEtablissement,anneeEffectifsEtablissement,activitePrincipaleRegistreMetiersEtablissement,dateDernierTraitementEtablissement,etablissementSiege,nombrePeriodesEtablissement,complementAdresseEtablissement,numeroVoieEtablissement,indiceRepetitionEtablissement,typeVoieEtablissement,libelleVoieEtablissement,codePostalEtablissement,libelleCommuneEtablissement,libelleCommuneEtrangerEtablissement,distributionSpecialeEtablissement,codeCommuneEtablissement,codeCedexEtablissement,libelleCedexEtablissement,codePaysEtrangerEtablissement,libellePaysEtrangerEtablissement,complementAdresse2Etablissement,numeroVoie2Etablissement,indiceRepetition2Etablissement,typeVoie2Etablissement,libelleVoie2Etablissement,codePostal2Etablissement,libelleCommune2Etablissement,libelleCommuneEtranger2Etablissement,distributionSpeciale2Etablissement,codeCommune2Etablissement,codeCedex2Etablissement,libelleCedex2Etablissement,codePaysEtranger2Etablissement,libellePaysEtranger2Etablissement,dateDebut,etatAdministratifEtablissement,enseigne1Etablissement,enseigne2Etablissement,enseigne3Etablissement,denominationUsuelleEtablissement,activitePrincipaleEtablissement,nomenclatureActivitePrincipaleEtablissement,caractereEmployeurEtablissement,longitude,latitude,geo_score,geo_type,geo_adresse,geo_id,geo_ligne,geo_l4,geo_l5
211603378,00012,21160337800012,O,1983-03-01,11,2021,,2023-11-30T10:18:04,true,4,,,,,LE BOURG,16500,SAINT-MAURICE-DES-LIONS,,,16337,,,,,,,,,,,,,,,,,,,2008-01-01,A,MAIRIE,,,,84.11Z,NAFRev2,O,0.740838,45.973736,0.83,street,Le Bourgnaud 16500 Saint-Maurice-des-Lions,16337_9xn2q7,G,LE BOURGNAUD,
211603378,00020,21160337800020,O,1983-12-21,02,2021,,2023-11-30T10:18:04,false,4,,,,,LE BOURG,16500,SAINT-MAURICE-DES-LIONS,,,16337,,,,,,,,,,,,,,,,,,,2008-01-01,A,ECOLE ELEMENTAIRE PUBLIQUE,,,,85.20Z,NAFRev2,N,0.740838,45.973736,0.83,street,Le Bourgnaud 16500 Saint-Maurice-des-Lions,16337_9xn2q7,G,LE BOURGNAUD,
211603378,00038,21160337800038,O,1995-01-01,NN,,,2019-11-14T14:00:21,false,3,MAIRIE,,,,LE BOURG,16500,SAINT-MAURICE-DES-LIONS,,,16337,,,,,,,,,,,,,,,,,,,2008-01-01,A,SERVICE ASSAINISSEMENT,,,,37.00Z,NAFRev2,N,0.740838,45.973736,0.83,street,Le Bourgnaud 16500 Saint-Maurice-des-Lions,16337_9xn2q7,G,LE BOURGNAUD,
211603378,00046,21160337800046,O,1999-02-18,NN,,,2019-11-14T14:00:21,false,4,MAIRIE,,,,LE BOURG,16500,SAINT-MAURICE-DES-LIONS,,,16337,,,,,,,,,,,,,,,,,,,2008-01-01,A,LOCATION LOCAL COMMERCIAL BOUCHERIE,,,,68.20B,NAFRev2,N,0.740838,45.973736,0.83,street,Le Bourgnaud 16500 Saint-Maurice-des-Lions,16337_9xn2q7,G,LE BOURGNAUD,
211603378,00053,21160337800053,O,1995-07-15,NN,,,2019-11-14T14:00:21,false,4,,,,,MOULIN DE LA COUR,16500,SAINT-MAURICE-DES-LIONS,,,16337,,,,,,,,,,,,,,,,,,,2008-01-01,A,CAMPING MUNICIPAL,,,,55.30Z,NAFRev2,N,0.708791,45.966372,0.94,street,Moulin de la Cour 16500 Saint-Maurice-des-Lions,16337_B275,G,MOULIN DE LA COUR,
211603378,00061,21160337800061,O,2002-06-06,NN,,,2019-11-14T14:00:21,false,4,MAIRIE,,,,LE BOURG,16500,SAINT-MAURICE-DES-LIONS,,,16337,,,,,,,,,,,,,,,,,,,2012-12-25,F,LOTISSEMENT  CHEZ FOUGERE,,,,42.99Z,NAFRev2,N,0.740838,45.973736,0.83,street,Le Bourgnaud 16500 Saint-Maurice-des-Lions,16337_9xn2q7,G,LE BOURGNAUD,
211603378,00079,21160337800079,O,2023-09-07,,,,2023-10-07T12:20:51,false,1,MAIRIE,,,,LE BOURG,16500,SAINT-MAURICE-DES-LIONS,,,16337,,,,,,,,,,,,,,,,,,,2023-09-07,A,ENERGIES RENOUVELABLES,,,,35.11Z,NAFRev2,N,0.740838,45.973736,0.83,street,Le Bourgnaud 16500 Saint-Maurice-des-Lions,16337_9xn2q7,G,LE BOURGNAUD,
251602710,00013,25160271000013,O,1998-12-18,01,2021,,2023-11-30T10:18:58,true,5,MAIRIE,7,,RTE,DE LIMOGES,16500,SAINT-MAURICE-DES-LIONS,,,16337,,,,,,,,,,,,,,,,,,,2008-01-01,A,,,,,84.12Z,NAFRev2,O,0.699031,45.964554,0.84,housenumber,7 Route de Limoges 16500 Saint-Maurice-des-Lions,16337_0030_00007,G,7 ROUTE DE LIMOGES,
261601918,00012,26160191800012,O,1995-01-01,NN,,,2019-11-14T14:00:21,true,4,MAIRIE,,,,LE BOURG,16500,SAINT-MAURICE-DES-LIONS,,,16337,,,,,,,,,,,,,,,,,,,2008-01-01,A,,,,,88.99B,NAFRev2,N,0.740838,45.973736,0.83,street,Le Bourgnaud 16500 Saint-Maurice-des-Lions,16337_9xn2q7,G,LE BOURGNAUD,
261601991,00019,26160199100019,O,1986-01-06,NN,,,2019-11-14T14:00:21,true,4,MAIRIE,,,,LE BOURG,16500,SAINT-MAURICE-DES-LIONS,,,16337,,,,,,,,,,,,,,,,,,,2008-01-01,A,,,,,88.99B,NAFRev2,N,0.740838,45.973736,0.83,street,Le Bourgnaud 16500 Saint-Maurice-des-Lions,16337_9xn2q7,G,LE BOURGNAUD,
300761202,00013,30076120200013,O,1965-01-01,NN,,,2019-11-14T14:00:21,true,3,,,,LD,LE BOURG,16500,SAINT-MAURICE-DES-LIONS,,,16337,,,,,,,,,,,,,,,,,,,2008-01-01,A,,,,,68.20B,NAFRev2,N,0.740838,45.973736,0.83,street,Le Bourgnaud 16500 Saint-Maurice-des-Lions,16337_9xn2q7,G,LE BOURGNAUD,
302266762,00012,30226676200012,O,,,,,2019-11-14T14:00:21,true,1,,,,,,16500,SAINT-MAURICE-DES-LIONS,,,16337,,,,,,,,,,,,,,,,,,,1994-12-31,F,,,,,55.3A,NAF1993,N,,,0,,,,,,
304943178,00018,30494317800018,O,1976-01-01,NN,,,2019-11-14T14:00:21,true,5,,,,,LE BOURG,16500,SAINT-MAURICE-DES-LIONS,,,16337,,,,,,,,,,,,,,,,,,,2004-12-31,F,,,,,45.2V,NAFRev1,N,0.740838,45.973736,0.83,street,Le Bourgnaud 16500 Saint-Maurice-des-Lions,16337_9xn2q7,G,LE BOURGNAUD,
306524869,00014,30652486900014,O,,NN,,,2019-11-14T14:00:21,true,1,,,,,CHEZ FOUROT,16500,SAINT-MAURICE-DES-LIONS,,,16337,,,,,,,,,,,,,,,,,,,1990-04-28,F,,,,,22.02,NAP,N,0.717029,45.995089,0.93,street,Route Chez Fourot 16500 Saint-Maurice-des-Lions,16337_pbzvhk,G,ROUTE CHEZ FOUROT,
310766324,00019,31076632400019,O,,NN,,,2019-11-14T14:00:21,true,1,,,,,,16500,SAINT-MAURICE-DES-LIONS,,,16337,,,,,,,,,,,,,,,,,,,,F,,,,,41.01,NAP,N,,,0,,,,,,
311309165,00018,31130916500018,O,1977-01-01,NN,,,2019-11-14T14:00:21,true,1,,,,,LA JUDIE,16500,SAINT-MAURICE-DES-LIONS,,,16337,,,,,,,,,,,,,,,,,,,2000-12-31,F,,,,,74.1J,NAF1993,N,0.713986,45.970407,0.92,street,Route de la Judie 16500 Saint-Maurice-des-Lions,16337_fwfqsy,G,ROUTE DE LA JUDIE,
311985725,00028,31198572500028,O,1981-06-24,NN,,,2019-11-14T14:00:21,false,3,,,,,LA PLAGNE,16500,SAINT-MAURICE-DES-LIONS,,,16337,,,,,,,,,,,,,,,,,,,1992-01-01,F,,,,,45.2V,NAF1993,N,0.72101,45.961672,0.93,street,Route de la Plagne 16500 Saint-Maurice-des-Lions,16337_hn8fbs,G,ROUTE DE LA PLAGNE,
311985725,00044,31198572500044,O,1998-01-01,NN,,,2021-02-23T10:39:24,true,3,,,,,MACON,16500,SAINT-MAURICE-DES-LIONS,,,16337,,,,,,,,,,,,,,,,,,,2008-01-01,A,,,,,01.11Z,NAFRev2,N,0.690096,45.936866,0.44,street,Le Chambon 16500 Saint-Maurice-des-Lions,16337_jfmf5q,G,LE CHAMBON,
314825100,00014,31482510000014,O,,NN,,,2019-11-14T14:00:21,true,1,,,,,LE BOURG,16500,SAINT-MAURICE-DES-LIONS,,,16337,,,,,,,,,,,,,,,,,,,1997-03-31,F,,,,,52.2C,NAF1993,N,0.740838,45.973736,0.83,street,Le Bourgnaud 16500 Saint-Maurice-des-Lions,16337_9xn2q7,G,LE BOURGNAUD,
315492546,00017,31549254600017,O,1979-01-01,NN,,,2023-05-05T03:45:54,true,6,,,,,CHEZ BONY,16500,SAINT-MAURICE-DES-LIONS,,,16337,,,,,,,,,,,,,,,,,,,2020-12-31,F,,,,,01.42Z,NAFRev2,O,0.70922,45.940066,0.94,street,Chez Bony 16500 Saint-Maurice-des-Lions,16337_B495,G,CHEZ BONY,
315955989,00027,31595598900027,O,1990-12-25,NN,,,2019-11-14T14:00:21,true,1,,,,,,16500,SAINT-MAURICE-DES-LIONS,,,16337,,,,,,,,,,,,,,,,,,,1999-03-30,F,,,,,01.2C,NAF1993,N,,,0,,,,,,
317083566,00024,31708356600024,O,2002-01-01,NN,,4333ZZ,2019-11-14T14:00:21,true,4,,,,LD,LESIGNAC,16500,SAINT-MAURICE-DES-LIONS,,,16337,,,,,,,,,,,,,,,,,,,2017-01-31,F,,,,,43.33Z,NAFRev2,O,0.737116,45.957056,0.92,street,Route de Lesignac 16500 Saint-Maurice-des-Lions,16337_u5m9n8,G,ROUTE DE LESIGNAC,
317281509,00024,31728150900024,O,2007-02-13,,,,2019-11-14T14:00:21,true,2,,,,,LE MAZOIN,16500,SAINT-MAURICE-DES-LIONS,,,16337,,,,,,,,,,,,,,,,,,,2008-01-01,A,,,,,01.13Z,NAFRev2,N,0.718305,45.957923,0.56,street,Le Moulin de Caillou 16500 Saint-Maurice-des-Lions,16337_B272,G,LE MOULIN DE CAILLOU,
317401545,00015,31740154500015,O,1979-01-01,NN,,,2019-11-14T14:00:21,false,4,,,,LD,LA PLAGNE,16500,SAINT-MAURICE-DES-LIONS,,,16337,,,,,,,,,,,,,,,,,,,1999-07-01,F,,,,,45.4A,NAF1993,N,0.72101,45.961672,0.93,street,Route de la Plagne 16500 Saint-Maurice-des-Lions,16337_hn8fbs,G,ROUTE DE LA PLAGNE,
317401545,00023,31740154500023,O,1999-07-01,NN,,4331ZB,2019-11-14T14:00:21,true,4,,,,RTE,DE BIAIS,16500,SAINT-MAURICE-DES-LIONS,,,16337,,,,,,,,,,,,,,,,,,,2017-12-31,F,,,,,43.31Z,NAFRev2,N,0.697466,45.964819,0.71,street,Chemin de Biais 16500 Saint-Maurice-des-Lions,16337_0009,G,CHEMIN DE BIAIS,
320837883,00018,32083788300018,O,,NN,,,2019-11-14T14:00:21,true,1,,,,,RHUS,16500,SAINT-MAURICE-DES-LIONS,,,16337,,,,,,,,,,,,,,,,,,,1993-01-01,F,,,,,01.1A,NAF1993,N,0.73912,45.958852,0.9,street,Route du Logis du Rhus 16500 Saint-Maurice-des-Lions,16337_p9ayni,G,ROUTE DU LOGIS DU RHUS,
321110546,00033,32111054600033,O,,,,3109BA,2019-11-14T14:00:21,true,1,,,,LD,LE BIAIS,16500,SAINT-MAURICE-DES-LIONS,,,16337,,,,,,,,,,,,,,,,,,,1984-12-25,F,,,,,49.05,NAP,N,0.697466,45.964819,0.72,street,Chemin de Biais 16500 Saint-Maurice-des-Lions,16337_0009,G,CHEMIN DE BIAIS,
321360208,00011,32136020800011,O,,NN,,,2019-11-14T14:00:21,true,1,,,,,LESTERIE,16500,SAINT-MAURICE-DES-LIONS,,,16337,,,,,,,,,,,,,,,,,,,1987-04-21,F,,,,,00.10,NAP,N,0.685617,45.975457,0.94,street,Lesterie 16500 Saint-Maurice-des-Lions,16337_dokf4g,G,LESTERIE,
321373383,00017,32137338300017,O,,NN,,,2019-11-14T14:00:21,true,1,,,,,LESTERIE,16500,SAINT-MAURICE-DES-LIONS,,,16337,,,,,,,,,,,,,,,,,,,,F,,,,,01.80,NAP,N,0.685617,45.975457,0.94,street,Lesterie 16500 Saint-Maurice-des-Lions,16337_dokf4g,G,LESTERIE,
321774218,00010,32177421800010,O,1981-04-16,01,2021,,2023-11-30T10:22:41,true,3,,,,,,16500,SAINT-MAURICE-DES-LIONS,,,16337,,,,,,,,,,,,,,,,,,,2008-01-01,A,,,,,01.41Z,NAFRev2,N,,,0,,,,,,
323740126,00020,32374012600020,O,2003-10-01,NN,,,2019-11-14T14:00:21,true,4,,,,,LE BOURG,16500,SAINT-MAURICE-DES-LIONS,,,16337,,,,,,,,,,,,,,,,,,,2006-09-30,F,,,,,55.3A,NAFRev1,N,0.740838,45.973736,0.83,street,Le Bourgnaud 16500 Saint-Maurice-des-Lions,16337_9xn2q7,G,LE BOURGNAUD,
326334802,00047,32633480200047,O,1995-10-01,NN,,,2022-09-09T04:12:30,true,4,,,,,LE BOURG,16500,SAINT-MAURICE-DES-LIONS,,,16337,,,,,,,,,,,,,,,,,,,2019-12-31,F,,,,,68.20B,NAFRev2,N,0.740838,45.973736,0.83,street,Le Bourgnaud 16500 Saint-Maurice-des-Lions,16337_9xn2q7,G,LE BOURGNAUD,
327142758,00017,32714275800017,O,1983-04-11,NN,,,2019-11-14T14:00:21,false,4,,,,LD,CHEZ VIGNAUX,16500,SAINT-MAURICE-DES-LIONS,,,16337,,,,,,,,,,,,,,,,,,,1996-12-25,F,,,,,45.2V,NAF1993,O,0.705474,45.972639,0.73,street,Chez Vignoux 16500 Saint-Maurice-des-Lions,16337_yhmr15,G,CHEZ VIGNOUX,
327142758,00025,32714275800025,O,1996-07-01,NN,,,2019-11-14T14:00:21,true,4,,,,,LA JUDIE,16500,SAINT-MAURICE-DES-LIONS,,,16337,,,,,,,,,,,,,,,,,,,2011-12-12,F,,,,,43.99C,NAFRev2,N,0.713986,45.970407,0.92,street,Route de la Judie 16500 Saint-Maurice-des-Lions,16337_fwfqsy,G,ROUTE DE LA JUDIE,
327191326,00070,32719132600070,O,2015-12-07,,,,2021-02-23T10:48:54,true,1,,4,,CHE,DE LAURERIE,16500,SAINT-MAURICE-DES-LIONS,,,16337,,,,,,,,,,,,,,,,,,,2015-12-07,A,,,,BASILIC INSTINCT,47.81Z,NAFRev2,N,0.702674,45.966487,0.78,housenumber,4 Chemin de l’Aurerie 16500 Saint-Maurice-des-Lions,16337_jmbvjv_00004,G,4 CHEMIN DE L AURERIE,
327287652,00017,32728765200017,O,1983-05-01,NN,,,2019-11-14T14:00:21,true,3,,,,,LE CHAMBON,16500,SAINT-MAURICE-DES-LIONS,,,16337,,,,,,,,,,,,,,,,,,,2008-01-01,A,,,,,68.20B,NAFRev2,N,0.690096,45.936866,0.95,street,Le Chambon 16500 Saint-Maurice-des-Lions,16337_jfmf5q,G,LE CHAMBON,
328432141,00013,32843214100013,O,1983-10-01,NN,,,2019-11-14T14:00:21,false,3,,,,LD,SELLAS,16500,SAINT-MAURICE-DES-LIONS,,,16337,,,,,,,,,,,,,,,,,,,1996-12-31,F,,,,,02.0B,NAF1993,N,0.720489,45.972505,0.92,street,Route de Sellas 16500 Saint-Maurice-des-Lions,16337_ekmdi5,G,ROUTE DE SELLAS,
328843370,00029,32884337000029,O,,NN,,,2019-11-14T14:00:21,true,1,,,,LD,CHEZ PINOT,16500,SAINT-MAURICE-DES-LIONS,,,16337,,,,,,,,,,,,,,,,,,,,F,,,,,55.70,NAP,N,0.739684,45.955637,0.92,street,Route de Chez Pinot 16500 Saint-Maurice-des-Lions,16337_s53tk9,G,ROUTE DE CHEZ PINOT,
329597942,00047,32959794200047,O,2009-10-01,,,,2021-02-23T10:50:22,true,1,,,,,LA PLAGNE,16500,SAINT-MAURICE-DES-LIONS,,,16337,,,,,,,,,,,,,,,,,,,2009-10-01,A,,,,,01.45Z,NAFRev2,N,0.72101,45.961672,0.93,street,Route de la Plagne 16500 Saint-Maurice-des-Lions,16337_hn8fbs,G,ROUTE DE LA PLAGNE,
330610742,00018,33061074200018,O,,,,,2019-11-14T14:00:21,true,1,,,,,LE BOURG,16500,SAINT-MAURICE-DES-LIONS,,,16337,,,,,,,,,,,,,,,,,,,1985-12-25,F,,,,,55.72,NAP,N,0.740838,45.973736,0.83,street,Le Bourgnaud 16500 Saint-Maurice-des-Lions,16337_9xn2q7,G,LE BOURGNAUD,
331399444,00016,33139944400016,O,1985-01-01,NN,,,2019-11-14T14:00:21,true,3,,,,LD,LE COUDERT,16500,SAINT-MAURICE-DES-LIONS,,,16337,,,,,,,,,,,,,,,,,,,1994-06-16,F,,,,,01.2C,NAF1993,N,0.723822,45.992805,0.68,street,Route du Coudert 16500 Saint-Maurice-des-Lions,16337_k05tp5,G,ROUTE DU COUDERT,
331544817,00017,33154481700017,O,1985-01-14,NN,,4322AZ,2019-11-14T14:00:21,true,4,,,,,LE BOURG,16500,SAINT-MAURICE-DES-LIONS,,,16337,,,,,,,,,,,,,,,,,,,2018-01-31,F,,,,,43.22A,NAFRev2,N,0.740838,45.973736,0.83,street,Le Bourgnaud 16500 Saint-Maurice-des-Lions,16337_9xn2q7,G,LE BOURGNAUD,
332238229,00014,33223822900014,O,1985-04-03,NN,,,2019-11-14T14:00:21,true,3,,,,,,16500,SAINT-MAURICE-DES-LIONS,,,16337,,,,,,,,,,,,,,,,,,,2006-12-31,F,,,,,45.4C,NAFRev1,N,,,0,,,,,,
332577139,00022,33257713900022,O,1987-01-01,NN,,,2019-11-14T14:00:21,true,1,,,,LD,LES CEPS,16500,SAINT-MAURICE-DES-LIONS,,,16337,,,,,,,,,,,,,,,,,,,2000-12-31,F,,,,,50.4Z,NAF1993,N,0.700631,45.959978,0.72,street,Chemin des Ceps 16500 Saint-Maurice-des-Lions,16337_0011,G,CHEMIN DES CEPS,
333699734,00013,33369973400013,O,,NN,,,2019-11-14T14:00:21,true,1,,,,,,16500,SAINT-MAURICE-DES-LIONS,,,16337,,,,,,,,,,,,,,,,,,,1992-12-08,F,,,,,55.3A,NAF1993,N,,,0,,,,,,
333847937,00013,33384793700013,O,1985-09-09,NN,,4332AA,2021-03-22T07:39:51,true,5,,6,,LD,LE PIT,16500,SAINT-MAURICE-DES-LIONS,,,16337,,,,,,,,,,,,,,,,,,,2021-02-01,A,,,,,43.32A,NAFRev2,N,0.69684,45.961212,0.78,street,Le Bost du Pit 16500 Saint-Maurice-des-Lions,16337_B045,G,LE BOST DU PIT,
333990232,00014,33399023200014,O,,NN,,,2019-11-14T14:00:21,true,1,,,,LD,MAZOIN,16500,SAINT-MAURICE-DES-LIONS,,,16337,,,,,,,,,,,,,,,,,,,1991-12-31,F,,,,,48.01,NAP,N,0.721144,45.984085,0.65,street,Route de Mazouin 16500 Saint-Maurice-des-Lions,16337_p9b835,G,ROUTE DE MAZOUIN,
334911633,00066,33491163300066,O,1990-02-01,,,,2019-11-14T14:00:21,false,3,,,,LD,LE BOURG,16500,SAINT-MAURICE-DES-LIONS,,,16337,,,,,,,,,,,,,,,,,,,1998-02-01,F,,,,,70.2C,NAF1993,N,0.740838,45.973736,0.83,street,Le Bourgnaud 16500 Saint-Maurice-des-Lions,16337_9xn2q7,G,LE BOURGNAUD,
334932340,00048,33493234000048,O,2021-04-26,,,4334ZC,2021-10-02T12:57:49,true,1,VILLECHAISE,4,,CHE,DU PETIT PRE,16500,SAINT-MAURICE-DES-LIONS,,,16337,,,,,,,,,,,,,,,,,,,2021-04-26,A,,,,,43.34Z,NAFRev2,N,0.665114,45.979339,0.87,housenumber,4 Chemin du Petit Pre 16500 Saint-Maurice-des-Lions,16337_2ft0nb_00004,G,4 CHEMIN DU PETIT PRE,
335322004,00011,33532200400011,O,,NN,,,2019-11-14T14:00:21,true,1,,,,,LE CHIRON,16500,SAINT-MAURICE-DES-LIONS,,,16337,,,,,,,,,,,,,,,,,,,1987-07-30,F,,,,,55.73,NAP,N,0.736546,46.000674,0.94,street,Le Chiron 16500 Saint-Maurice-des-Lions,16337_4iuxy2,G,LE CHIRON,
335324570,00027,33532457000027,O,2016-07-03,,,,2021-06-24T15:00:00,false,2,,,,,LABROUSSE,16500,SAINT-MAURICE-DES-LIONS,,,16337,,,,,,,,,,,,,,,,,,,2021-05-18,F,,,,,68.20B,NAFRev2,N,0.651049,45.986193,0.93,street,Route de Labrousse 16500 Saint-Maurice-des-Lions,16337_ie8emy,G,ROUTE DE LABROUSSE,
335327920,00013,33532792000013,O,,NN,,,2019-11-14T14:00:21,true,1,,,,,LE CHIRON,16500,SAINT-MAURICE-DES-LIONS,,,16337,,,,,,,,,,,,,,,,,,,1987-07-30,F,,,,,55.73,NAP,N,0.736546,46.000674,0.94,street,Le Chiron 16500 Saint-Maurice-des-Lions,16337_4iuxy2,G,LE CHIRON,
335327938,00015,33532793800015,O,,NN,,,2019-11-14T14:00:21,true,1,,,,,LE CHIRON,16500,SAINT-MAURICE-DES-LIONS,,,16337,,,,,,,,,,,,,,,,,,,1988-09-30,F,,,,,55.73,NAP,N,0.736546,46.000674,0.94,street,Le Chiron 16500 Saint-Maurice-des-Lions,16337_4iuxy2,G,LE CHIRON,
338063746,00014,33806374600014,O,1986-06-01,NN,,,2019-11-14T14:00:21,true,3,,,,LD,VILLEMIERS,16500,SAINT-MAURICE-DES-LIONS,,,16337,,,,,,,,,,,,,,,,,,,2008-01-01,A,,,,,01.42Z,NAFRev2,N,0.745967,45.964796,0.78,street,Villemier 16500 Saint-Maurice-des-Lions,16337_jhwk6e,G,VILLEMIER,
340104397,00021,34010439700021,O,2003-03-01,NN,,,2019-11-14T14:00:21,true,4,,,,,LES QUARTS,16500,SAINT-MAURICE-DES-LIONS,,,16337,,,,,,,,,,,,,,,,,,,2014-12-31,F,,,,,81.30Z,NAFRev2,N,0.702692,45.972822,0.36,street,Les Cars 16500 Saint-Maurice-des-Lions,16337_o3f8zy,G,LES CARS,
341888584,00016,34188858400016,O,1987-05-01,NN,,,2019-11-14T14:00:21,true,4,,,,LD,LA CHARPETIE,16500,SAINT-MAURICE-DES-LIONS,,,16337,,,,,,,,,,,,,,,,,,,1991-12-25,F,,,,,02.20,NAP,N,0.651252,45.977042,0.95,street,La Charpetie 16500 Saint-Maurice-des-Lions,16337_6jpe9l,G,LA CHARPETIE,
342439759,00016,34243975900016,O,1987-10-01,NN,,,2019-11-14T14:00:21,true,4,,,,LD,LOGIS DES BROSSES,16500,SAINT-MAURICE-DES-LIONS,,,16337,,,,,,,,,,,,,,,,,,,1991-12-25,F,,,,,01.00,NAP,N,0.68105,45.983727,0.94,street,Logis des Brosses 16500 Saint-Maurice-des-Lions,16337_B244,G,LOGIS DES BROSSES,
342640844,00029,34264084400029,O,1991-04-30,,,,2019-11-14T14:00:21,false,4,,,,,LE BOURG,16500,SAINT-MAURICE-DES-LIONS,,,16337,,,,,,,,,,,,,,,,,,,2013-10-01,F,,,,,86.21Z,NAFRev2,N,0.740838,45.973736,0.83,street,Le Bourgnaud 16500 Saint-Maurice-des-Lions,16337_9xn2q7,G,LE BOURGNAUD,
342640844,00037,34264084400037,O,2013-10-01,,,,2021-02-23T10:58:05,true,1,,1,,RUE,MARC LEPROUX,16500,SAINT-MAURICE-DES-LIONS,,,16337,,,,,,,,,,,,,,,,,,,2013-10-01,A,,,,,86.21Z,NAFRev2,N,0.702936,45.966161,0.95,housenumber,1 Rue Marc Leproux 16500 Saint-Maurice-des-Lions,16337_0045_00001,G,1 RUE MARC LEPROUX,
342772449,00027,34277244900027,O,2003-04-01,NN,,,2019-11-14T14:00:21,false,4,,,,,LE BOURG,16500,SAINT-MAURICE-DES-LIONS,,,16337,,,,,,,,,,,,,,,,,,,2007-03-31,F,,,,,52.1B,NAFRev1,O,0.740838,45.973736,0.83,street,Le Bourgnaud 16500 Saint-Maurice-des-Lions,16337_9xn2q7,G,LE BOURGNAUD,
342772449,00050,34277244900050,O,2019-10-03,,,4334ZC,2020-11-26T08:56:19,true,2,,1,,,JARDIN DE LA POSTE,16500,SAINT-MAURICE-DES-LIONS,,,16337,,,,,,,,,,,,,,,,,,,2020-08-31,F,,,,,43.34Z,NAFRev2,N,0.699667,45.964048,0.88,housenumber,1 Place du Jardin de la Poste 16500 Saint-Maurice-des-Lions,16337_4jn93p_00001,G,1 PLACE DU JARDIN DE LA POSTE,
343453528,00055,34345352800055,O,2000-09-20,NN,,,2019-11-14T14:00:21,false,4,,,,,LA JENADIE,16500,SAINT-MAURICE-DES-LIONS,,,16337,,,,,,,,,,,,,,,,,,,2002-12-31,F,,,,,01.2C,NAF1993,N,0.673501,45.965321,0.92,street,Route de la Jenadie 16500 Saint-Maurice-des-Lions,16337_9rl55q,G,ROUTE DE LA JENADIE,
344879325,00027,34487932500027,O,1988-01-01,NN,,,2019-11-14T14:00:21,true,4,,,,,CHEZ FOUROT,16500,SAINT-MAURICE-DES-LIONS,,,16337,,,,,,,,,,,,,,,,,,,2008-01-01,A,,,,,68.20B,NAFRev2,N,0.717029,45.995089,0.93,street,Route Chez Fourot 16500 Saint-Maurice-des-Lions,16337_pbzvhk,G,ROUTE CHEZ FOUROT,
344879325,00035,34487932500035,O,2005-03-01,,,,2019-11-14T14:00:21,false,2,,,,,CHEZ FOUROT,16500,SAINT-MAURICE-DES-LIONS,,,16337,,,,,,,,,,,,,,,,,,,2008-01-01,A,,,,,01.45Z,NAFRev2,N,0.717029,45.995089,0.93,street,Route Chez Fourot 16500 Saint-Maurice-des-Lions,16337_pbzvhk,G,ROUTE CHEZ FOUROT,
345058176,00016,34505817600016,O,1988-06-01,NN,,,2021-02-23T10:59:57,true,3,,,,,LE CHIRON,16500,SAINT-MAURICE-DES-LIONS,,,16337,,,,,,,,,,,,,,,,,,,2008-01-01,A,,,,,01.45Z,NAFRev2,N,0.736546,46.000674,0.94,street,Le Chiron 16500 Saint-Maurice-des-Lions,16337_4iuxy2,G,LE CHIRON,
348343831,00015,34834383100015,O,,NN,,,2019-11-14T14:00:21,true,1,,,,,,16500,SAINT-MAURICE-DES-LIONS,,,16337,,,,,,,,,,,,,,,,,,,1992-05-31,F,,,,,74.1G,NAF1993,N,,,0,,,,,,
348388257,00043,34838825700043,O,2013-05-01,,,2223ZZ,2023-12-18T12:56:24,true,3,SIGOULES ET FLAUGEAC,264,,,LA JENADIE,16500,SAINT-MAURICE-DES-LIONS,,,16337,,,,,,,,,,,,,,,,,,,2022-08-16,A,,,,,22.23Z,NAFRev2,N,0.673501,45.965321,0.92,street,Route de la Jenadie 16500 Saint-Maurice-des-Lions,16337_9rl55q,G,ROUTE DE LA JENADIE,
349740696,00019,34974069600019,O,,NN,,,2019-11-14T14:00:21,true,1,,,,,LE CHAMBON,16500,SAINT-MAURICE-DES-LIONS,,,16337,,,,,,,,,,,,,,,,,,,1990-09-30,F,,,,,64.49,NAP,N,0.690096,45.936866,0.95,street,Le Chambon 16500 Saint-Maurice-des-Lions,16337_jfmf5q,G,LE CHAMBON,
350130134,00017,35013013400017,O,,NN,,,2019-11-14T14:00:21,true,1,,,,LD,BIAIS,16500,SAINT-MAURICE-DES-LIONS,,,16337,,,,,,,,,,,,,,,,,,,1991-06-30,F,,,,,49.05,NAP,N,0.697466,45.964819,0.92,street,Chemin de Biais 16500 Saint-Maurice-des-Lions,16337_0009,G,CHEMIN DE BIAIS,
350922837,00025,35092283700025,O,1990-04-01,NN,,,2019-11-14T14:00:21,true,3,,,,,LA VERGNE,16500,SAINT-MAURICE-DES-LIONS,,,16337,,,,,,,,,,,,,,,,,,,2003-12-11,F,,,,,01.2C,NAFRev1,N,0.686254,45.951714,0.92,street,Impasse de la Vergne 16500 Saint-Maurice-des-Lions,16337_fy76s8,G,IMPASSE DE LA VERGNE,
351033980,00019,35103398000019,O,1989-06-01,NN,,,2019-11-14T14:00:21,true,4,,,,,LA BROUSSE,16500,SAINT-MAURICE-DES-LIONS,,,16337,,,,,,,,,,,,,,,,,,,2008-01-01,A,,,,,68.20B,NAFRev2,N,0.678367,45.980341,0.6,street,La Brouterie 16500 Saint-Maurice-des-Lions,16337_m9an0y,G,LA BROUTERIE,
351215082,00014,35121508200014,O,,,,,2019-11-14T14:00:21,true,1,,,,,LES CEPS,16500,SAINT-MAURICE-DES-LIONS,,,16337,,,,,,,,,,,,,,,,,,,1991-08-03,F,,,,,64.46,NAP,N,0.700631,45.959978,0.72,street,Chemin des Ceps 16500 Saint-Maurice-des-Lions,16337_0011,G,CHEMIN DES CEPS,
351883640,00028,35188364000028,O,1996-06-01,NN,,,2019-11-14T14:00:21,true,4,,,,LD,VILLECHAISE,16500,SAINT-MAURICE-DES-LIONS,,,16337,,,,,,,,,,,,,,,,,,,2008-06-30,A,,,,,01.42Z,NAFRev2,N,0.663447,45.979702,0.92,street,Route de Villechaise 16500 Saint-Maurice-des-Lions,16337_xv77zi,G,ROUTE DE VILLECHAISE,
353159338,00055,35315933800055,O,2016-07-01,,,7420ZQ,2019-11-14T14:00:21,true,2,,5,,,LOT CHEZ FOUGERE,16500,SAINT-MAURICE-DES-LIONS,,,16337,,,,,,,,,,,,,,,,,,,2019-03-30,F,,,,A FLEUR DE PEAU PHOTOGRAPHY,74.20Z,NAFRev2,N,0.70518,45.963709,0.89,housenumber,5 Lotissement Chez Fougere 16500 Saint-Maurice-des-Lions,16337_a020_00005,G,5 LOTISSEMENT CHEZ FOUGERE,
353206451,00018,35320645100018,O,1990-01-01,NN,,,2019-11-14T14:00:21,true,4,,,,,LES TERRIERES,16500,SAINT-MAURICE-DES-LIONS,,,16337,,,,,,,,,,,,,,,,,,,2008-01-01,F,,,,,01.45Z,NAFRev2,N,0.715373,45.966185,0.94,street,Les Terrieres 16500 Saint-Maurice-des-Lions,16337_k8v2ew,G,LES TERRIERES,
353245558,00021,35324555800021,O,2000-05-01,NN,,,2020-10-15T03:51:46,true,4,,,,,LA BROUTERIE,16500,SAINT-MAURICE-DES-LIONS,,,16337,,,,,,,,,,,,,,,,,,,2020-02-24,F,,,,,68.20A,NAFRev2,N,0.678367,45.980341,0.95,street,La Brouterie 16500 Saint-Maurice-des-Lions,16337_m9an0y,G,LA BROUTERIE,
353358880,00014,35335888000014,O,1990-01-01,NN,,,2023-08-24T03:42:18,true,4,,,,,LE CROS,16500,SAINT-MAURICE-DES-LIONS,,,16337,,,,,,,,,,,,,,,,,,,2022-07-31,F,,,,,01.45Z,NAFRev2,N,0.713963,45.957504,0.7,street,Les Cros 16500 Saint-Maurice-des-Lions,16337_cq8ixg,G,LES CROS,
353722101,00030,35372210100030,O,,NN,,,2019-11-14T14:00:21,true,1,,,,LD,LES BASSES BROSSES,16500,SAINT-MAURICE-DES-LIONS,,,16337,,,,,,,,,,,,,,,,,,,1991-12-31,F,,,,,74.8K,NAF1993,N,0.683691,45.984199,0.76,street,Les Brosses 16500 Saint-Maurice-des-Lions,16337_iniugz,G,LES BROSSES,
353982184,00023,35398218400023,O,2003-04-01,NN,,,2019-11-14T14:00:21,true,3,,,,,LES MEZERIES,16500,SAINT-MAURICE-DES-LIONS,,,16337,,,,,,,,,,,,,,,,,,,2006-12-01,F,,,,,01.1F,NAFRev1,N,0.685154,45.986528,0.62,street,Les Metairies Basses 16500 Saint-Maurice-des-Lions,16337_B260,G,LES METAIRIES BASSES,
356000547,01541,35600054701541,O,1991-01-01,NN,,,2019-11-14T14:00:21,false,3,,,,,LE BOURG,16500,SAINT-MAURICE-DES-LIONS,,,16337,,,,,,,,,,,,,,,,,,,2006-12-22,F,BUREAU DE POSTE,,,,64.1A,NAFRev1,O,0.740838,45.973736,0.83,street,Le Bourgnaud 16500 Saint-Maurice-des-Lions,16337_9xn2q7,G,LE BOURGNAUD,