siren,nic,siret,statutDiffusionEtablissement,dateCreationEtablissement,trancheEffectifsEtablissement,anneeEffectifsEtablissement,activitePrincipaleRegistreMetiersEtablissement,dateDernierTraitementEtablissement,etablissementSiege,nombrePeriodesEtablissement,complementAdresseEtablissement,numeroVoieEtablissement,indiceRepetitionEtablissement,typeVoieEtablissement,libelleVoieEtablissement,codePostalEtablissement,libelleCommuneEtablissement,libelleCommuneEtrangerEtablissement,distributionSpecialeEtablissement,codeCommuneEtablissement,codeCedexEtablissement,libelleCedexEtablissement,codePaysEtrangerEtablissement,libellePaysEtrangerEtablissement,complementAdresse2Etablissement,numeroVoie2Etablissement,indiceRepetition2Etablissement,typeVoie2Etablissement,libelleVoie2Etablissement,codePostal2Etablissement,libelleCommune2Etablissement,libelleCommuneEtranger2Etablissement,distributionSpeciale2Etablissement,codeCommune2Etablissement,codeCedex2Etablissement,libelleCedex2Etablissement,codePaysEtranger2Etablissement,libellePaysEtranger2Etablissement,dateDebut,etatAdministratifEtablissement,enseigne1Etablissement,enseigne2Etablissement,enseigne3Etablissement,denominationUsuelleEtablissement,activitePrincipaleEtablissement,nomenclatureActivitePrincipaleEtablissement,caractereEmployeurEtablissement,longitude,latitude,geo_score,geo_type,geo_adresse,geo_id,geo_ligne,geo_l4,geo_l5
212504187,00015,21250418700015,O,1983-03-01,03,2021,,2023-11-30T10:18:09,true,4,,,,PL,MAIRIE,25360,NANCRAY,,,25418,,,,,,,,,,,,,,,,,,,2008-01-01,A,MAIRIE,,,,84.11Z,NAFRev2,O,6.183225,47.2461,0.74,street,Place de la Mairie 25360 Nancray,25418_0211,G,PLACE DE LA MAIRIE,
212504187,00023,21250418700023,O,1983-12-21,03,2020,,2023-03-23T13:58:11,false,4,,1,,PL,DE LA MAIRIE,25360,NANCRAY,,,25418,,,,,,,,,,,,,,,,,,,2008-01-01,F,ECOLE PRIMAIRE PUBLIQUE,,,,85.20Z,NAFRev2,N,6.183225,47.2461,0.73,street,Place de la Mairie 25360 Nancray,25418_0211,G,PLACE DE LA MAIRIE,
212504187,00031,21250418700031,O,1996-01-01,NN,,,2023-10-03T14:51:19,false,4,,,,,,25360,NANCRAY,,,25418,,,,,,,,,,,,,,,,,,,2017-12-31,F,SERVICE D ASSAINISSEMENT,,,,84.11Z,NAFRev2,N,,,0,,,,,,
212504187,00049,21250418700049,O,1997-01-01,NN,,,,false,4,MAIRIE,,,,,25360,NANCRAY,,,25418,,,,,,,,,,,,,,,,,,,2002-12-31,F,SERVICE LOTISSEMENT,,,,70.1C,NAF1993,N,6.183225,47.2461,0.91,street,Place de la Mairie 25360 Nancray,25418_0211,D,PLACE DE LA MAIRIE,
212504187,00056,21250418700056,O,1998-01-01,NN,,,2016-01-12T00:10:26,false,3,MAIRIE,,,,,25360,NANCRAY,,,25418,,,,,,,,,,,,,,,,,,,2008-01-01,A,SERVICE FORET,,,,02.20Z,NAFRev2,N,6.183225,47.2461,0.91,street,Place de la Mairie 25360 Nancray,25418_0211,D,PLACE DE LA MAIRIE,
212504187,00064,21250418700064,O,2001-12-25,NN,,,,false,3,MAIRIE,,,,,25360,NANCRAY,,,25418,,,,,,,,,,,,,,,,,,,2002-12-31,F,BA SERVICE LOTISSEMENT CHATEAU D EAU,,,,70.1C,NAF1993,N,6.183225,47.2461,0.91,street,Place de la Mairie 25360 Nancray,25418_0211,D,PLACE DE LA MAIRIE,
212504187,00072,21250418700072,O,2003-12-10,NN,,,2013-10-05T12:12:05,false,4,,,,PL,DE LA MAIRIE,25360,NANCRAY,,,25418,,,,,,,,,,,,,,,,,,,2012-12-25,F,BA LOTISSEMENT CHAMPS TOUT PRES NANCRAY,,,,42.99Z,NAFRev2,N,6.183225,47.2461,0.83,street,Place de la Mairie 25360 Nancray,25418_0211,G,PLACE DE LA MAIRIE,
212504187,00080,21250418700080,O,2004-03-19,NN,,,2008-01-04T18:29:13,false,3,,,,,MAIRIE,25360,NANCRAY,,,25418,,,,,,,,,,,,,,,,,,,2008-01-01,A,LOTISSEMENT LE PEU NANCRAY,,,,42.99Z,NAFRev2,N,6.183225,47.2461,0.91,street,Place de la Mairie 25360 Nancray,25418_0211,G,PLACE DE LA MAIRIE,
212504187,00098,21250418700098,O,2007-09-01,,,,2023-03-23T13:58:11,false,1,,7,C,RUE,DE VAIRE,25360,NANCRAY,,,25418,,,,,,,,,,,,,,,,,,,2007-09-01,A,ECOLE PRIMAIRE,,,,85.20Z,NAFRev2,N,6.182065,47.24765,0.95,interpolation,7 Rue de Vaire 25360 Nancray,,G,5 RUE DE VAIRE,
242504231,00018,24250423100018,O,1999-06-16,NN,,,,false,4,,,,,MAIRIE,25360,NANCRAY,,,25418,,,,,,,,,,,,,,,,,,,2000-04-06,F,,,,,75.1A,NAF1993,N,6.183225,47.2461,0.91,street,Place de la Mairie 25360 Nancray,25418_0211,G,PLACE DE LA MAIRIE,
252500046,00021,25250004600021,O,1992-05-21,NN,,,2006-01-16T16:02:05,false,4,,,,,MAIRIE,25360,NANCRAY,,,25418,,,,,,,,,,,,,,,,,,,2003-01-01,F,SIPSCO,,,,75.1C,NAF1993,O,6.183225,47.2461,0.91,street,Place de la Mairie 25360 Nancray,25418_0211,G,PLACE DE LA MAIRIE,
252500046,00039,25250004600039,O,1998-01-01,NN,,,2006-01-16T16:02:05,false,4,,,,,MAIRIE,25360,NANCRAY,,,25418,,,,,,,,,,,,,,,,,,,2003-01-01,F,SCE VENTE CONTAINERS ORDURES MENAGERES,,,,34.2A,NAF1993,N,6.183225,47.2461,0.91,street,Place de la Mairie 25360 Nancray,25418_0211,G,PLACE DE LA MAIRIE,
252503362,00011,25250336200011,O,1989-09-28,NN,,,,true,1,,,,,MAIRIE,25360,NANCRAY,,,25418,,,,,,,,,,,,,,,,,,,1999-06-16,F,,,,,75.1E,NAF1993,O,6.183225,47.2461,0.91,street,Place de la Mairie 25360 Nancray,25418_0211,G,PLACE DE LA MAIRIE,
252508015,00010,25250801500010,O,1997-07-09,12,2021,,2023-11-30T10:18:59,true,3,MUSEE DE PLEIN AIR DES MAISONS COMTOIS,,,RUE,DU MUSEE,25360,NANCRAY,,,25418,,,,,,,,,,,,,,,,,,,2008-01-01,A,,,,,91.03Z,NAFRev2,O,6.19016,47.2435,0.95,street,Rue du Musee 25360 Nancray,25418_0212,G,RUE DU MUSEE,
252508015,00028,25250801500028,O,1998-01-01,NN,,,2008-01-04T18:51:32,false,3,,,,,MAIRIE,25360,NANCRAY,,,25418,,,,,,,,,,,,,,,,,,,2008-01-01,A,SERVICE CAFETARIA LIBRAIRIE,,,,56.30Z,NAFRev2,N,6.183225,47.2461,0.91,street,Place de la Mairie 25360 Nancray,25418_0211,G,PLACE DE LA MAIRIE,
262504707,00015,26250470700015,O,1986-01-01,NN,,,2010-06-26T03:07:06,true,3,MAIRIE,,,,,25360,NANCRAY,,,25418,,,,,,,,,,,,,,,,,,,2008-01-01,A,CCAS,,,,88.99B,NAFRev2,N,6.183225,47.2461,0.91,street,Place de la Mairie 25360 Nancray,25418_0211,D,PLACE DE LA MAIRIE,
292504180,00012,29250418000012,O,1983-08-10,NN,,,2008-01-04T19:06:15,true,3,,,,,MAIRIE,25360,NANCRAY,,,25418,,,,,,,,,,,,,,,,,,,2008-01-01,A,,,,,42.99Z,NAFRev2,N,6.183225,47.2461,0.91,street,Place de la Mairie 25360 Nancray,25418_0211,G,PLACE DE LA MAIRIE,
301793717,00010,30179371700010,O,,,,,,true,1,,,,,,25360,NANCRAY,,,25418,,,,,,,,,,,,,,,,,,,1990-01-01,F,,,,,48.01,NAP,N,,,0,,,,,,
302476098,00025,30247609800025,O,1994-01-01,01,2021,,2023-11-30T10:19:38,true,4,MUSEE DE PLEIN AIR,,,,,25360,NANCRAY,,,25418,,,,,,,,,,,,,,,,,,,2008-01-01,A,,,,,94.99Z,NAFRev2,O,,,0,,,,,,
304521123,00022,30452112300022,O,2005-01-01,,,,2016-01-12T00:10:39,true,2,,,,RTE,DE LA CHEVILLOTTE,25360,NANCRAY,,,25418,,,,,,,,,,,,,,,,,,,2008-01-01,A,,,,,01.11Z,NAFRev2,N,6.17517,47.2418,0.86,street,Route de la Chevillotte 25360 Nancray,25418_0201,G,ROUTE DE LA CHEVILLOTTE,
304902455,00027,30490245500027,O,2021-01-01,,,,2022-05-07T12:07:16,true,1,,,,,0001   GRANDE RUE,25360,NANCRAY,,,25418,,,,,,,,,,,,,,,,,,,2021-01-01,A,,,,,86.21Z,NAFRev2,N,6.1715,47.244,0.75,housenumber,1 Grande Rue 25360 Nancray,25418_0208_00001,G,1 GRANDE RUE,
309475838,00038,30947583800038,O,2017-05-09,,,,2021-02-23T10:38:17,true,3,,29,,,GRANDE RUE,25360,NANCRAY,,,25418,,,,,,,,,,,,,,,,,,,2019-12-31,A,,,,ARTINTERIEUR,47.89Z,NAFRev2,N,6.1812,47.2448,0.96,housenumber,29 Grande Rue 25360 Nancray,25418_0208_00029,G,29 GRANDE RUE,
309581056,00038,30958105600038,O,,NN,,,,true,1,,,,,CHAMP LAMBERT,25360,NANCRAY,,,25418,,,,,,,,,,,,,,,,,,,1988-10-30,F,,,,,21.15,NAP,N,6.18902,47.2436,0.94,street,Champ Lambert 25360 Nancray,25418_B017,G,CHAMP LAMBERT,
309697225,00014,30969722500014,O,,,,,,true,1,,,,,,25360,NANCRAY,,,25418,,,,,,,,,,,,,,,,,,,1984-12-25,F,,,,,55.60,NAP,N,,,0,,,,,,
310918313,00019,31091831300019,O,,NN,,,,true,1,,1,,,GRANDE RUE,25360,NANCRAY,,,25418,,,,,,,,,,,,,,,,,,,1992-12-31,F,,,,,74.1A,NAF1993,N,6.1715,47.244,0.96,housenumber,1 Grande Rue 25360 Nancray,25418_0208_00001,G,1 GRANDE RUE,
311418669,00017,31141866900017,O,,NN,,,,true,1,,30,,,GRANDE RUE,25360,NANCRAY,,,25418,,,,,,,,,,,,,,,,,,,,F,,,,,87.03,NAP,N,6.18184,47.2448,0.96,housenumber,30 Grande Rue 25360 Nancray,25418_0208_00030,G,30 GRANDE RUE,
311431662,00015,31143166200015,O,,NN,,,,true,1,,5,,RUE,VAUCENET,25360,NANCRAY,,,25418,,,,,,,,,,,,,,,,,,,,F,,,,,64.49,NAP,N,6.17796,47.2433,0.94,housenumber,5 Rue de Vaucenet 25360 Nancray,25418_0235_00005,G,5 RUE DE VAUCENET,
312765977,00011,31276597700011,O,1978-01-01,NN,,4334ZC,2016-04-26T02:07:31,true,4,,51,,,GRANDE RUE,25360,NANCRAY,,,25418,,,,,,,,,,,,,,,,,,,2008-01-01,A,,,,,43.31Z,NAFRev2,N,6.18657,47.2455,0.96,housenumber,51 Grande Rue 25360 Nancray,25418_0208_00051,G,51 GRANDE RUE,
313432239,00025,31343223900025,O,,NN,,,,true,1,,,,RUE,DE VAIRES,25360,NANCRAY,,,25418,,,,,,,,,,,,,,,,,,,,F,,,,,55.73,NAP,N,6.18181,47.2492,0.83,street,Rue de Vaire 25360 Nancray,25418_0230,G,RUE DE VAIRE,
313520116,00010,31352011600010,O,,NN,,,,true,1,,,,,,25360,NANCRAY,,,25418,,,,,,,,,,,,,,,,,,,1990-06-30,F,,,,,01.50,NAP,N,,,0,,,,,,
314524869,00018,31452486900018,O,1978-01-01,NN,,,2014-07-08T00:18:28,false,5,,,,,GRANDE RUE,25360,NANCRAY,,,25418,,,,,,,,,,,,,,,,,,,2010-06-01,F,,,,,45.20A,NAFRev2,O,6.183245,47.24495,0.96,street,Grande Rue 25360 Nancray,25418_0208,G,GRANDE RUE,
314524869,00026,31452486900026,O,2010-08-01,,,4520BB,2021-02-23T10:40:41,true,1,,32,,RUE,DE ROCHE,25360,NANCRAY,,,25418,,,,,,,,,,,,,,,,,,,2010-08-01,A,,,,GILLES SAINT-HILLIER (GSH),45.20A,NAFRev2,N,6.18296,47.2421,0.95,housenumber,32 Rue de Roche 25360 Nancray,25418_0222_00032,G,32 RUE DE ROCHE,
315262105,00010,31526210500010,O,,,,,,true,1,,2,,RUE,DE VAIVRE,25360,NANCRAY,,,25418,,,,,,,,,,,,,,,,,,,1991-06-15,F,,,,,64.45,NAP,N,6.18181,47.2492,0.69,street,Rue de Vaire 25360 Nancray,25418_0230,G,RUE DE VAIRE,
315495523,00013,31549552300013,O,,,,,,true,1,,3,,RUE,DE LA CORVEE,25360,NANCRAY,,,25418,,,,,,,,,,,,,,,,,,,,F,,,,,55.71,NAP,N,6.17807,47.2472,0.87,street,Rue de la Corvée 25360 Nancray,25418_0203,G,RUE DE LA CORVEE,
316949262,00109,31694926200109,O,2003-01-01,,,,2009-11-24T15:14:43,false,3,,4,,RUE,DES GROSEILLIERS,25360,NANCRAY,,,25418,,,,,,,,,,,,,,,,,,,2008-12-31,F,,,,,68.10Z,NAFRev2,N,6.18446,47.2461,0.95,housenumber,4 Rue des Groseilliers 25360 Nancray,25418_0210_00004,G,4 RUE DES GROSEILLIERS,
316949262,00133,31694926200133,O,2015-09-01,,,,2021-02-23T10:42:05,true,1,,24,,RUE,DE LA CORVEE,25360,NANCRAY,,,25418,,,,,,,,,,,,,,,,,,,2015-09-01,A,,,,,46.19B,NAFRev2,N,6.17956,47.2481,0.95,housenumber,24 Rue de la Corvée 25360 Nancray,25418_0203_00024,G,24 RUE DE LA CORVEE,
317181345,00065,31718134500065,O,2006-05-15,NN,,,2009-06-27T04:09:53,true,2,,,,,MUSEE DES MAISONS COMTOISES,25360,NANCRAY,,,25418,,,,,,,,,,,,,,,,,,,2007-09-21,F,MAISON LE MEROUX,,,,55.3A,NAFRev1,O,6.1845437,47.2373115,0.9,poi.museum,Musée des Maisons comtoises de Nancray Nancray,https://osm.org/way/33921375,G,,
317414332,00021,31741433200021,O,1991-10-15,NN,,,2008-11-07T00:33:00,false,4,,15,,,GRANDE RUE,25360,NANCRAY,,,25418,,,,,,,,,,,,,,,,,,,1999-02-27,F,,,,,52.4X,NAF1993,N,6.17843,47.2443,0.96,housenumber,15 Grande Rue 25360 Nancray,25418_0208_00015,G,15 GRANDE RUE,
318576014,00027,31857601400027,O,,NN,,,,true,1,,,,,LE JARDYS,25360,NANCRAY,,,25418,,,,,,,,,,,,,,,,,,,1990-09-26,F,,,,,55.73,NAP,N,6.17612,47.2488,0.66,street,Rue des Jardys 25360 Nancray,25418_0241,G,RUE DES JARDYS,
321425399,00011,32142539900011,O,1981-04-02,NN,,,,true,3,,1,,RUE,DES CARRIERES,25360,NANCRAY,,,25418,,,,,,,,,,,,,,,,,,,2003-12-31,F,,,,,02.0B,NAFRev1,N,6.17864,47.2492,0.95,housenumber,1 Rue des Carrieres 25360 Nancray,25418_0200_00001,G,1 RUE DES CARRIERES,
322137142,00038,32213714200038,O,1900-01-01,,,,2011-04-28T00:19:30,false,3,,23,,,GRANDE RUE,25360,NANCRAY,,,25418,,,,,,,,,,,,,,,,,,,1997-04-30,F,,,,,52.4C,NAF1993,N,6.18028,47.2448,0.96,housenumber,23 Grande Rue 25360 Nancray,25418_0208_00023,G,23 GRANDE RUE,
322137142,00046,32213714200046,O,2006-07-04,,,4331ZB,2018-04-07T03:57:56,true,3,,6,,RUE,CHAMP LAMBERT,25360,NANCRAY,,,25418,,,,,,,,,,,,,,,,,,,2018-03-01,F,,,,,43.31Z,NAFRev2,N,6.18883,47.2442,0.95,housenumber,6 Rue Champ Lambert 25360 Nancray,25418_0237_00006,G,6 RUE CHAMP LAMBERT,
322762899,00019,32276289900019,P,1900-01-01,,,,2023-11-10T07:34:18,true,3,[ND],[ND],[ND],[ND],[ND],[ND],NANCRAY,,[ND],25418,[ND],[ND],,,[ND],[ND],[ND],[ND],[ND],[ND],,,[ND],,[ND],[ND],,,2023-08-13,A,[ND],[ND],[ND],[ND],01.29Z,NAFRev2,N,,,0,,,,,,
322865247,00017,32286524700017,O,,,,,,true,1,,23,,,GRANDE RUE,25360,NANCRAY,,,25418,,,,,,,,,,,,,,,,,,,1990-01-08,F,,,,,55.70,NAP,N,6.18028,47.2448,0.96,housenumber,23 Grande Rue 25360 Nancray,25418_0208_00023,G,23 GRANDE RUE,
323519959,00015,32351995900015,O,1982-01-01,NN,,,2008-11-07T00:40:12,false,4,,12,,RUE,DE LA CORVEE,25360,NANCRAY,,,25418,,,,,,,,,,,,,,,,,,,1994-06-23,F,,,,,60.2E,NAF1993,N,6.17788,47.2457,0.95,housenumber,12 Rue de la Corvée 25360 Nancray,25418_0203_00012,G,12 RUE DE LA CORVEE,
323519959,00023,32351995900023,O,1994-06-23,NN,,4932ZA,2016-04-26T02:40:07,true,5,,20,,RUE,DE LA CORVEE,25360,NANCRAY,,,25418,,,,,,,,,,,,,,,,,,,2014-02-28,F,,,,,49.32Z,NAFRev2,O,6.1786,47.2478,0.95,housenumber,20 Rue de la Corvée 25360 Nancray,25418_0203_00020,G,20 RUE DE LA CORVEE,
323574046,00013,32357404600013,O,1982-01-01,NN,,,2011-03-02T10:10:35,true,3,,,,,MAIRIE,25360,NANCRAY,,,25418,,,,,,,,,,,,,,,,,,,2008-01-01,A,,,,,94.99Z,NAFRev2,N,6.183225,47.2461,0.91,street,Place de la Mairie 25360 Nancray,25418_0211,G,PLACE DE LA MAIRIE,
323616284,00028,32361628400028,P,2000-07-01,NN,,,2008-11-07T00:40:21,false,2,[ND],[ND],[ND],[ND],[ND],[ND],NANCRAY,,[ND],25418,[ND],[ND],,,[ND],[ND],[ND],[ND],[ND],[ND],,,[ND],,[ND],[ND],,,2000-12-25,F,[ND],[ND],[ND],[ND],45.4J,NAF1993,N,,,0,,,,,,
323805507,00023,32380550700023,O,1987-01-01,NN,,,2015-11-25T09:50:30,true,6,,15,,,GRANDE RUE,25360,NANCRAY,,,25418,,,,,,,,,,,,,,,,,,,2016-03-31,F,,,,,86.21Z,NAFRev2,N,6.17843,47.2443,0.96,housenumber,15 Grande Rue 25360 Nancray,25418_0208_00015,G,15 GRANDE RUE,
325005015,00087,32500501500087,O,2018-04-13,,,,2020-12-19T03:35:03,false,2,,8,,,GRANDE RUE,25360,NANCRAY,,,25418,,,,,,,,,,,,,,,,,,,2020-09-04,F,MONTRES ET BIJOUX,,,DESTOCK MONTRES ET BIJOUX,47.77Z,NAFRev2,N,6.17638,47.2441,0.96,housenumber,8 Grande Rue 25360 Nancray,25418_0208_00008,G,8 GRANDE RUE,
325572345,00016,32557234500016,O,,,,,,true,1,,14,,RUE,DES PINS,25360,NANCRAY,,,25418,,,,,,,,,,,,,,,,,,,1985-12-25,F,,,,,55.40,NAP,N,6.1933,47.2454,0.95,housenumber,14 Rue des Pins 25360 Nancray,25418_0215_00014,G,14 RUE DES PINS,
326689817,00012,32668981700012,O,,,,,,true,1,,10,,RUE,DES CARRIERES,25360,NANCRAY,,,25418,,,,,,,,,,,,,,,,,,,1985-12-25,F,,,,,77.10,NAP,N,6.17631,47.2485,0.95,housenumber,10 Rue des Carrieres 25360 Nancray,25418_0200_00010,G,10 RUE DES CARRIERES,
327062808,00040,32706280800040,O,1995-01-01,NN,,,2007-05-19T09:24:19,false,5,,,,RUE,GRANDE RUE,25360,NANCRAY,,,25418,,,,,,,,,,,,,,,,,,,2005-07-01,F,,,,,51.5F,NAFRev1,N,6.183245,47.24495,0.89,street,Grande Rue 25360 Nancray,25418_0208,G,GRANDE RUE,
328268578,00015,32826857800015,O,1983-10-02,NN,,,2006-10-27T01:49:08,false,3,,3,B,RUE,DE VAUCENET,25360,NANCRAY,,,25418,,,,,,,,,,,,,,,,,,,2005-01-20,F,,,,,85.1G,NAFRev1,N,6.178015,47.24345,0.95,interpolation,3 Rue de Vaucenet 25360 Nancray,,G,1 RUE DE VAUCENET,
328268578,00023,32826857800023,O,1999-04-01,NN,,,2006-11-25T10:07:30,false,3,,5,,RUE,CHAMP LAMBERT,25360,NANCRAY,,,25418,,,,,,,,,,,,,,,,,,,2005-01-20,F,,,,,85.1G,NAFRev1,N,6.18894,47.2441,0.95,housenumber,5 Rue Champ Lambert 25360 Nancray,25418_0237_00005,G,5 RUE CHAMP LAMBERT,
329190250,00053,32919025000053,O,2002-01-01,NN,,,,false,2,,8,,RUE,DES MARNES,25360,NANCRAY,,,25418,,,,,,,,,,,,,,,,,,,2002-05-02,F,,,,,,,,6.17452,47.2425,0.95,housenumber,8 Rue des Marnes 25360 Nancray,25418_0238_00008,G,8 RUE DES MARNES,
330796723,00022,33079672300022,O,1986-07-01,NN,,,,false,4,,4,,RUE,DE LA CORVEE,25360,NANCRAY,,,25418,,,,,,,,,,,,,,,,,,,1997-12-31,F,,,,,92.3A,NAF1993,N,6.17764,47.2446,0.95,housenumber,4 Rue de la Corvée 25360 Nancray,25418_0203_00004,G,4 RUE DE LA CORVEE,
330796723,00048,33079672300048,O,2005-01-15,,,,2021-02-23T10:51:07,true,2,,,,RUE,DES CHASEAUX,25360,NANCRAY,,,25418,,,,,,,,,,,,,,,,,,,2008-01-01,A,,,,,90.03A,NAFRev2,N,6.18549,47.2481,0.95,street,Rue des Chaseaux 25360 Nancray,25418_0239,G,RUE DES CHASEAUX,
331118042,00018,33111804200018,O,,NN,,,,true,1,,15,,,GRANDE RUE,25360,NANCRAY,,,25418,,,,,,,,,,,,,,,,,,,1991-12-27,F,,,,,67.06,NAP,N,6.17843,47.2443,0.96,housenumber,15 Grande Rue 25360 Nancray,25418_0208_00015,G,15 GRANDE RUE,
331806000,00013,33180600000013,O,1985-01-01,NN,,,2008-11-07T00:50:43,false,4,,1,,RUE,DE L EGLISE,25360,NANCRAY,,,25418,,,,,,,,,,,,,,,,,,,1995-12-25,F,,,,,15.8C,NAF1993,O,6.18364,47.2461,0.68,street,Place de l’Eglise 25360 Nancray,25418_0205,G,PLACE DE L EGLISE,
332228196,00066,33222819600066,O,2015-05-15,,,,2018-08-30T03:48:18,true,2,,24,,RUE,DE LA CORVEE,25360,NANCRAY,,,25418,,,,,,,,,,,,,,,,,,,2017-04-30,F,,,,,46.19B,NAFRev2,N,6.17956,47.2481,0.95,housenumber,24 Rue de la Corvée 25360 Nancray,25418_0203_00024,G,24 RUE DE LA CORVEE,
333328342,00501,33332834200501,O,1994-08-03,NN,,,,false,3,,8,,,GRANDE RUE,25360,NANCRAY,,,25418,,,,,,,,,,,,,,,,,,,1996-06-08,F,COCCINELLE,,,,52.2C,NAF1993,O,6.17638,47.2441,0.96,housenumber,8 Grande Rue 25360 Nancray,25418_0208_00008,G,8 GRANDE RUE,
334123809,00017,33412380900017,O,1985-10-01,NN,,,2014-07-08T00:39:47,true,5,,30,,,GRANDE RUE,25360,NANCRAY,,,25418,,,,,,,,,,,,,,,,,,,2009-03-31,F,,,,,96.02A,NAFRev2,O,6.18184,47.2448,0.96,housenumber,30 Grande Rue 25360 Nancray,25418_0208_00030,G,30 GRANDE RUE,
334542016,00020,33454201600020,O,2008-12-09,01,2021,9603ZP,2023-11-30T10:26:15,true,4,,57,,,GRANDE RUE,25360,NANCRAY,,,25418,,,,,,,,,,,,,,,,,,,2015-04-01,A,POMPES FUNEBRES MARBRERIE BIDAL,,,,96.03Z,NAFRev2,O,6.18807,47.2453,0.96,housenumber,57 Grande Rue 25360 Nancray,25418_0208_00057,G,57 GRANDE RUE,
334841079,00018,33484107900018,O,1986-02-01,NN,,,2015-05-14T06:53:16,true,4,,39,,,GRANDE RUE,25360,NANCRAY,,,25418,,,,,,,,,,,,,,,,,,,2013-01-31,F,,,,,47.52A,NAFRev2,O,6.18357,47.2455,0.96,housenumber,39 Grande Rue 25360 Nancray,25418_0208_00039,G,39 GRANDE RUE,
334978319,00013,33497831900013,O,1983-12-07,NN,,,2008-01-04T20:57:00,true,3,,,,,MAIRIE,25360,NANCRAY,,,25418,,,,,,,,,,,,,,,,,,,2008-01-01,A,,,,,94.99Z,NAFRev2,N,6.183225,47.2461,0.91,street,Place de la Mairie 25360 Nancray,25418_0211,G,PLACE DE LA MAIRIE,
337498265,00020,33749826500020,O,1992-08-15,NN,,,,false,4,,30,B,,GRANDE RUE,25360,NANCRAY,,,25418,,,,,,,,,,,,,,,,,,,1998-04-01,F,,,,,71.4B,NAF1993,O,6.18182,47.2447,0.96,interpolation,30 Grande Rue 25360 Nancray,,G,28 GRANDE RUE,
337653661,00047,33765366100047,O,2012-01-30,,,,2021-07-09T03:45:22,false,2,,4,B,RUE,DES CARRIERES,25360,NANCRAY,,,25418,,,,,,,,,,,,,,,,,,,2020-12-31,F,,,,,68.20A,NAFRev2,N,6.17822,47.2495,0.95,housenumber,4b Rue des Carrieres 25360 Nancray,25418_0200_00004_b,G,4B RUE DES CARRIERES,
339893687,00030,33989368700030,O,2001-03-01,NN,,,2006-10-27T02:59:16,false,5,,5,,RUE,DES GROSEILLIERS,25360,NANCRAY,,,25418,,,,,,,,,,,,,,,,,,,2004-09-20,F,,,,,74.1J,NAFRev1,N,6.18378,47.2464,0.95,housenumber,5 Rue des Groseilliers 25360 Nancray,25418_0210_00005,G,5 RUE DES GROSEILLIERS,
340235712,00015,34023571200015,O,1987-01-01,01,2021,,2023-11-30T10:27:27,true,4,SALLE  POLYVALENTE,,,,,25360,NANCRAY,,,25418,,,,,,,,,,,,,,,,,,,2008-01-01,A,,,,,93.12Z,NAFRev2,O,,,0,,,,,,
340770775,00054,34077077500054,O,2009-12-01,,,,2016-05-02T08:35:45,false,2,,11,,RUE,DE LA CORVEE,25360,NANCRAY,,,25418,,,,,,,,,,,,,,,,,,,2011-09-30,F,,,,,43.29B,NAFRev2,N,6.1778,47.2458,0.95,housenumber,11 Rue de la Corvée 25360 Nancray,25418_0203_00011,G,11 RUE DE LA CORVEE,
343448098,00057,34344809800057,O,2001-11-01,NN,,,2008-11-08T00:17:49,false,3,,,,RUE,DES CARRIERES,25360,NANCRAY,,,25418,,,,,,,,,,,,,,,,,,,2003-03-01,F,,,,,,,N,6.17698,47.2488,0.95,street,Rue des Carrieres 25360 Nancray,25418_0200,G,RUE DES CARRIERES,
348673435,00015,34867343500015,O,1988-10-03,NN,,,2017-06-26T02:39:41,true,4,,77,,,GRANDE RUE,25360,NANCRAY,,,25418,,,,,,,,,,,,,,,,,,,2017-06-30,F,,,,,85.51Z,NAFRev2,N,6.19242,47.2459,0.96,housenumber,77 Grande Rue 25360 Nancray,25418_0208_00077,G,77 GRANDE RUE,
349914051,00025,34991405100025,O,2012-03-31,,,,2014-01-09T03:15:16,false,2,,1,,RUE,DU STADE,25360,NANCRAY,,,25418,,,,,,,,,,,,,,,,,,,2013-11-01,F,MOTOCULTURE DU PLATEAU,,,,46.61Z,NAFRev2,N,6.17705,47.2436,0.95,housenumber,1 Rue du Stade 25360 Nancray,25418_0226_00001,G,1 RUE DU STADE,
352155295,00020,35215529500020,O,1991-10-01,NN,,4332BB,2022-06-05T20:20:10,true,4,,6,,RTE,D OSSE,25360,NANCRAY,,,25418,,,,,,,,,,,,,,,,,,,2008-01-01,A,,,,,43.32B,NAFRev2,O,6.18619,47.2462,0.81,housenumber,6 Route d’Osse 25360 Nancray,25418_0213_00006,G,6 ROUTE D OSSE,
352587505,00020,35258750500020,O,,NN,,,,true,1,,,,,GRANDE RUE,25360,NANCRAY,,,25418,,,,,,,,,,,,,,,,,,,1996-12-21,F,,,,,51.5E,NAF1993,O,6.183245,47.24495,0.96,street,Grande Rue 25360 Nancray,25418_0208,G,GRANDE RUE,
353993892,00010,35399389200010,O,1987-01-19,,,,,true,3,,12,,RUE,DE LA CORVEE,25360,NANCRAY,,,25418,,,,,,,,,,,,,,,,,,,1994-12-05,F,,,,,45.2V,NAF1993,N,6.17788,47.2457,0.95,housenumber,12 Rue de la Corvée 25360 Nancray,25418_0203_00012,G,12 RUE DE LA CORVEE,
377812037,00028,37781203700028,O,1990-05-15,,,,,true,3,,12,,RUE,DE LA CORVEE,25360,NANCRAY,,,25418,,,,,,,,,,,,,,,,,,,1992-12-25,F,,,,,74.8K,NAF1993,N,6.17788,47.2457,0.95,housenumber,12 Rue de la Corvée 25360 Nancray,25418_0203_00012,G,12 RUE DE LA CORVEE,
380785915,00014,38078591500014,O,1991-02-15,NN,,,2013-02-24T04:55:08,true,4,,11,,RUE,DES PINS,25360,NANCRAY,,,25418,,,,,,,,,,,,,,,,,,,2012-12-31,F,,,,,82.99Z,NAFRev2,N,6.19282,47.2454,0.95,housenumber,11 Rue des Pins 25360 Nancray,25418_0215_00011,G,11 RUE DES PINS,
382213247,00010,38221324700010,O,1991-05-01,,,,,true,4,,24,,RUE,DE LA CORVEE,25360,NANCRAY,,,25418,,,,,,,,,,,,,,,,,,,1992-12-25,F,,,,,74.8K,NAF1993,N,6.17956,47.2481,0.95,housenumber,24 Rue de la Corvée 25360 Nancray,25418_0203_00024,G,24 RUE DE LA CORVEE,
382353118,00013,38235311800013,O,1991-07-01,NN,,,,true,4,,1,,RUE,DU PEU,25360,NANCRAY,,,25418,,,,,,,,,,,,,,,,,,,2002-09-17,F,,,,,02.0B,NAF1993,N,6.18578,47.2453,0.95,housenumber,1 Rue du Peu 25360 Nancray,25418_0214_00001,G,1 RUE DU PEU,
382353209,00010,38235320900010,O,1991-07-01,NN,,,,false,3,,10,,RUE,DU STADE,25360,NANCRAY,,,25418,,,,,,,,,,,,,,,,,,,1996-08-01,F,,,,,02.0B,NAF1993,N,6.17695,47.2425,0.95,housenumber,10 Rue du Stade 25360 Nancray,25418_0226_00010,G,10 RUE DU STADE,
382353209,00028,38235320900028,O,1996-08-01,NN,,,2006-06-13T10:35:40,false,3,,16,,,GRANDE RUE,25360,NANCRAY,,,25418,,,,,,,,,,,,,,,,,,,1999-08-15,F,,,,,02.0B,NAF1993,N,6.17855,47.2442,0.96,housenumber,16 Grande Rue 25360 Nancray,25418_0208_00016,G,16 GRANDE RUE,
382353209,00036,38235320900036,O,1999-08-15,,,,2019-05-27T03:34:27,true,6,,6,B,RTE,D OSSE,25360,NANCRAY,,,25418,,,,,,,,,,,,,,,,,,,2019-04-01,F,,,,,81.21Z,NAFRev2,N,6.18662,47.2467,0.82,housenumber,6b Route d’Osse 25360 Nancray,25418_0213_00006_b,G,6B ROUTE D OSSE,
382353290,00010,38235329000010,O,,NN,,,,true,1,,10,,RUE,DU STADE,25360,NANCRAY,,,25418,,,,,,,,,,,,,,,,,,,1996-07-31,F,,,,,02.0B,NAF1993,N,6.17695,47.2425,0.95,housenumber,10 Rue du Stade 25360 Nancray,25418_0226_00010,G,10 RUE DU STADE,
383110947,00017,38311094700017,P,1988-08-01,NN,,,,false,3,[ND],[ND],[ND],[ND],[ND],[ND],NANCRAY,,[ND],25418,[ND],[ND],,,[ND],[ND],[ND],[ND],[ND],[ND],,,[ND],,[ND],[ND],,,1992-11-02,F,[ND],[ND],[ND],[ND],85.1C,NAF1993,N,,,0,,,,,,
383302429,00014,38330242900014,O,1991-10-15,,,,,true,3,,18,,RUE,DU STADE,25360,NANCRAY,,,25418,,,,,,,,,,,,,,,,,,,2000-02-14,F,,,,,02.0B,NAF1993,N,6.17625,47.2411,0.95,housenumber,18 Rue du Stade 25360 Nancray,25418_0226_00018,G,18 RUE DU STADE,
387496854,00028,38749685400028,O,1999-01-13,,,,2011-04-28T00:51:52,false,3,,30,,,GRANDE RUE,25360,NANCRAY,,,25418,,,,,,,,,,,,,,,,,,,2000-09-11,F,,,,,74.1J,NAF1993,N,6.18184,47.2448,0.96,housenumber,30 Grande Rue 25360 Nancray,25418_0208_00030,G,30 GRANDE RUE,
387680960,00011,38768096000011,O,1992-08-01,NN,,,2019-06-25T04:06:43,true,3,,10,,RUE,DES PINS,25360,NANCRAY,,,25418,,,,,,,,,,,,,,,,,,,2008-01-01,A,,,,,68.20A,NAFRev2,N,6.19247,47.2453,0.95,housenumber,10 Rue des Pins 25360 Nancray,25418_0215_00010,G,10 RUE DES PINS,