siren,nic,siret,statutDiffusionEtablissement,dateCreationEtablissement,trancheEffectifsEtablissement,anneeEffectifsEtablissement,activitePrincipaleRegistreMetiersEtablissement,dateDernierTraitementEtablissement,etablissementSiege,nombrePeriodesEtablissement,complementAdresseEtablissement,numeroVoieEtablissement,indiceRepetitionEtablissement,typeVoieEtablissement,libelleVoieEtablissement,codePostalEtablissement,libelleCommuneEtablissement,libelleCommuneEtrangerEtablissement,distributionSpecialeEtablissement,codeCommuneEtablissement,codeCedexEtablissement,libelleCedexEtablissement,codePaysEtrangerEtablissement,libellePaysEtrangerEtablissement,complementAdresse2Etablissement,numeroVoie2Etablissement,indiceRepetition2Etablissement,typeVoie2Etablissement,libelleVoie2Etablissement,codePostal2Etablissement,libelleCommune2Etablissement,libelleCommuneEtranger2Etablissement,distributionSpeciale2Etablissement,codeCommune2Etablissement,codeCedex2Etablissement,libelleCedex2Etablissement,codePaysEtranger2Etablissement,libellePaysEtranger2Etablissement,dateDebut,etatAdministratifEtablissement,enseigne1Etablissement,enseigne2Etablissement,enseigne3Etablissement,denominationUsuelleEtablissement,activitePrincipaleEtablissement,nomenclatureActivitePrincipaleEtablissement,caractereEmployeurEtablissement,longitude,latitude,geo_score,geo_type,geo_adresse,geo_id,geo_ligne,geo_l4,geo_l5
213402852,00015,21340285200015,O,1983-03-01,03,2021,,2023-11-30T10:18:14,true,4,HOTEL DE VILLE,56,,RUE,DE LA GARENNE,34230,SAINT-PONS-DE-MAUCHIENS,,,34285,,,,,,,,,,,,,,,,,,,2008-01-01,A,MAIRIE,,,,84.11Z,NAFRev2,O,3.514487,43.513897,0.95,housenumber,56 Rue de la Garenne 34230 Saint-Pons-de-Mauchiens,34285_0030_00056,G,56 RUE DE LA GARENNE,
213402852,00023,21340285200023,O,1983-12-21,02,2021,,2023-11-30T10:18:14,false,5,,24,,RUE,DES GARRIGUES,34230,SAINT-PONS-DE-MAUCHIENS,,,34285,,,,,,,,,,,,,,,,,,,2023-09-01,F,ECOLE PRIMAIRE,,,,85.20Z,NAFRev2,N,3.515209,43.510711,0.95,housenumber,24 Rue des Garrigues 34230 Saint-Pons-de-Mauchiens,34285_0033_00024,G,24 RUE DES GARRIGUES,
213402852,00031,21340285200031,O,1997-01-01,NN,,,2019-11-14T14:00:34,false,5,MAIRIE,56,,RUE,DE LA GARENNE,34230,SAINT-PONS-DE-MAUCHIENS,,,34285,,,,,,,,,,,,,,,,,,,2017-01-01,F,SERVICE D'EAU ET D'ASSAINISSEMENT,,,,36.00Z,NAFRev2,N,3.514487,43.513897,0.95,housenumber,56 Rue de la Garenne 34230 Saint-Pons-de-Mauchiens,34285_0030_00056,G,56 RUE DE LA GARENNE,
213402852,00056,21340285200056,O,2023-09-01,,,,2023-11-07T10:58:31,false,1,,,,,LE PARC,34230,SAINT-PONS-DE-MAUCHIENS,,,34285,,,,,,,,,,,,,,,,,,,2023-09-01,A,ECOLE PRIMAIRE MARIE SAGNIER,,,,85.20Z,NAFRev2,N,3.510532,43.514611,0.58,street,Lotissement du Parc 34230 Saint-Pons-de-Mauchiens,34285_A001,G,LOTISSEMENT DU PARC,
263402232,00015,26340223200015,O,1995-12-25,NN,,,2019-11-14T14:00:34,true,2,MAIRIE,56,,RUE,DE LA GARENNE,34230,SAINT-PONS-DE-MAUCHIENS,,,34285,,,,,,,,,,,,,,,,,,,2008-01-01,A,CCAS,,,,88.99B,NAFRev2,N,3.514487,43.513897,0.95,housenumber,56 Rue de la Garenne 34230 Saint-Pons-de-Mauchiens,34285_0030_00056,G,56 RUE DE LA GARENNE,
293401501,00011,29340150100011,O,1991-12-11,NN,,,2019-11-14T14:00:34,true,3,MAIRIE,56,,RUE,DE LA GARENNE,34230,SAINT-PONS-DE-MAUCHIENS,,,34285,,,,,,,,,,,,,,,,,,,2008-01-01,A,,,,,42.99Z,NAFRev2,N,3.514487,43.513897,0.95,housenumber,56 Rue de la Garenne 34230 Saint-Pons-de-Mauchiens,34285_0030_00056,G,56 RUE DE LA GARENNE,
293401519,00013,29340151900013,O,1989-04-17,NN,,,2019-11-14T14:00:34,true,3,MAIRIE,56,,RUE,DE LA GARENNE,34230,SAINT-PONS-DE-MAUCHIENS,,,34285,,,,,,,,,,,,,,,,,,,2008-01-01,A,,,,,42.99Z,NAFRev2,N,3.514487,43.513897,0.95,housenumber,56 Rue de la Garenne 34230 Saint-Pons-de-Mauchiens,34285_0030_00056,G,56 RUE DE LA GARENNE,
293401725,00016,29340172500016,O,1989-04-18,NN,,,2019-11-14T14:00:34,true,3,HOTEL DE VILLE,56,,RUE,GARENNE,34230,SAINT-PONS-DE-MAUCHIENS,,,34285,,,,,,,,,,,,,,,,,,,2008-01-01,A,,,,,42.99Z,NAFRev2,N,3.514487,43.513897,0.88,housenumber,56 Rue de la Garenne 34230 Saint-Pons-de-Mauchiens,34285_0030_00056,G,56 RUE DE LA GARENNE,
293401857,00017,29340185700017,O,1985-02-04,NN,,,2019-11-14T14:00:34,true,3,MAIRIE,56,,RUE,DE LA GARENNE,34230,SAINT-PONS-DE-MAUCHIENS,,,34285,,,,,,,,,,,,,,,,,,,2008-01-01,A,,,,,42.99Z,NAFRev2,N,3.514487,43.513897,0.95,housenumber,56 Rue de la Garenne 34230 Saint-Pons-de-Mauchiens,34285_0030_00056,G,56 RUE DE LA GARENNE,
300869906,00036,30086990600036,O,2014-10-08,,,,2021-02-23T10:35:48,true,1,,,,CHE,DU MAS D'ASTRUC,34230,SAINT-PONS-DE-MAUCHIENS,,,34285,,,,,,,,,,,,,,,,,,,2014-10-08,A,,,,,47.89Z,NAFRev2,N,3.520402,43.50081,0.65,locality,Mas d'Astruc 34230 Saint-Pons-de-Mauchiens,34285_B095,G,MAS D ASTRUC,
307214957,00036,30721495700036,O,,,,,2019-11-14T14:00:34,true,1,,,,,LES PRADINES ST PIERRE,34230,SAINT-PONS-DE-MAUCHIENS,,,34285,,,,,,,,,,,,,,,,,,,1984-12-25,F,,,,,55.72,NAP,N,3.501473,43.511515,0.4,locality,Saint Pierre 34230 Saint-Pons-de-Mauchiens,34285_B163,G,SAINT PIERRE,
309114080,00026,30911408000026,O,2022-09-06,,,,2022-10-22T04:14:01,true,1,,24,,RUE,DE LA GARENNE,34230,SAINT-PONS-DE-MAUCHIENS,,,34285,,,,,,,,,,,,,,,,,,,2022-09-06,A,,,,,68.20A,NAFRev2,N,3.514396,43.514131,0.95,housenumber,24 Rue de la Garenne 34230 Saint-Pons-de-Mauchiens,34285_0030_00024,G,24 RUE DE LA GARENNE,
310383781,00013,31038378100013,O,,,,,2019-11-14T14:00:34,true,1,,,,LD,LES SEPT FONTS,34230,SAINT-PONS-DE-MAUCHIENS,,,34285,,,,,,,,,,,,,,,,,,,1988-06-13,F,,,,,55.60,NAP,N,3.536271,43.493141,0.94,street,les Sept Fonts 34230 Saint-Pons-de-Mauchiens,34285_B169,G,LES SEPT FONTS,
311429567,00010,31142956700010,O,,NN,,,2019-11-14T14:00:34,true,1,,,,,LES SEPT FONTS,34230,SAINT-PONS-DE-MAUCHIENS,,,34285,,,,,,,,,,,,,,,,,,,1987-12-31,F,,,,,64.40,NAP,N,3.536271,43.493141,0.94,street,les Sept Fonts 34230 Saint-Pons-de-Mauchiens,34285_B169,G,LES SEPT FONTS,
313702284,00016,31370228400016,O,1978-01-01,NN,,,2019-11-14T14:00:34,true,3,,11,,RTE,DE PEZENAS,34230,SAINT-PONS-DE-MAUCHIENS,,,34285,,,,,,,,,,,,,,,,,,,2008-01-01,A,,,,,01.21Z,NAFRev2,N,3.51314,43.512891,0.85,housenumber,11 Route de Pezenas 34230 Saint-Pons-de-Mauchiens,34285_0050_00011,G,11 ROUTE DE PEZENAS,
313873994,00013,31387399400013,O,,,,,2019-11-14T14:00:34,true,1,,,,,,34230,SAINT-PONS-DE-MAUCHIENS,,,34285,,,,,,,,,,,,,,,,,,,,F,,,,,58.08,NAP,N,,,0,,,,,,
314111071,00028,31411107100028,O,2001-11-18,NN,,,2019-11-14T14:00:34,false,5,,4,,PL,DE LA MAIRIE,34230,SAINT-PONS-DE-MAUCHIENS,,,34285,,,,,,,,,,,,,,,,,,,2005-08-28,F,,,,,55.3A,NAFRev1,N,3.514577,43.513512,0.45,housenumber,4 Rue de la Garenne 34230 Saint-Pons-de-Mauchiens,34285_0030_00004,G,4 RUE DE LA GARENNE,
314153842,00013,31415384200013,O,1978-01-01,NN,,,2019-11-14T14:00:34,true,3,,,,,,34230,SAINT-PONS-DE-MAUCHIENS,,,34285,,,,,,,,,,,,,,,,,,,2008-01-01,A,,,,,01.21Z,NAFRev2,N,,,0,,,,,,
315345116,00026,31534511600026,O,,NN,,,2019-11-14T14:00:34,true,1,,,,CHE,DES BOUFFIES,34230,SAINT-PONS-DE-MAUCHIENS,,,34285,,,,,,,,,,,,,,,,,,,1999-08-30,F,,,,,70.2C,NAF1993,N,3.486563,43.515477,0.82,locality,Chemin des Bouffies 34230 Saint-Pons-de-Mauchiens,34285_0009,G,CHEMIN DES BOUFFIES,
315570309,00015,31557030900015,O,,,,,2019-11-14T14:00:34,true,1,,,,,,34230,SAINT-PONS-DE-MAUCHIENS,,,34285,,,,,,,,,,,,,,,,,,,1984-12-25,F,,,,,38.40,NAP,N,,,0,,,,,,
316170844,00013,31617084400013,O,,,,,2019-11-14T14:00:34,true,1,,,,,,34230,SAINT-PONS-DE-MAUCHIENS,,,34285,,,,,,,,,,,,,,,,,,,1985-12-25,F,,,,,67.04,NAP,N,,,0,,,,,,
316261940,00035,31626194000035,O,2001-01-01,NN,,,2019-11-14T14:00:34,true,3,,,,,MAS DE MAURY,34230,SAINT-PONS-DE-MAUCHIENS,,,34285,,,,,,,,,,,,,,,,,,,2008-01-01,A,,,,,01.21Z,NAFRev2,N,3.526091,43.494836,0.94,locality,Mas de Maury 34230 Saint-Pons-de-Mauchiens,34285_B101,G,MAS DE MAURY,
316670090,00018,31667009000018,O,,NN,,,2019-11-14T14:00:34,true,1,,,,,,34230,SAINT-PONS-DE-MAUCHIENS,,,34285,,,,,,,,,,,,,,,,,,,1993-05-21,F,,,,,52.1B,NAF1993,N,,,0,,,,,,
317170629,00016,31717062900016,O,,,,,2019-11-14T14:00:34,true,1,,,,,,34230,SAINT-PONS-DE-MAUCHIENS,,,34285,,,,,,,,,,,,,,,,,,,1984-12-25,F,,,,,67.08,NAP,N,,,0,,,,,,
318436524,00017,31843652400017,O,,NN,,,2019-11-14T14:00:34,true,1,,,,,,34230,SAINT-PONS-DE-MAUCHIENS,,,34285,,,,,,,,,,,,,,,,,,,1990-12-25,F,,,,,01.4A,NAF1993,N,,,0,,,,,,
320721491,00019,32072149100019,O,1981-01-12,NN,,,2021-07-23T14:46:29,true,4,,,,,,34230,SAINT-PONS-DE-MAUCHIENS,,,34285,,,,,,,,,,,,,,,,,,,2021-07-12,F,,,,,68.20B,NAFRev2,N,,,0,,,,,,
321408148,00013,32140814800013,O,,NN,,,2019-11-14T14:00:34,true,1,,,,,,34230,SAINT-PONS-DE-MAUCHIENS,,,34285,,,,,,,,,,,,,,,,,,,1989-06-02,F,,,,,89.03,NAP,N,,,0,,,,,,
321426876,00025,32142687600025,O,1985-10-01,,,,2019-11-14T14:00:34,true,2,,,,CHE,DE LA VICTOIRE,34230,SAINT-PONS-DE-MAUCHIENS,,,34285,,,,,,,,,,,,,,,,,,,1991-12-25,F,,,,,77.05,NAP,N,3.540094,43.49791,0.84,street,Chemin de la Victoire 34230 Saint-Pons-de-Mauchiens,34285_0075,G,CHEMIN DE LA VICTOIRE,
322276494,00026,32227649400026,O,2004-08-31,NN,,,2021-12-31T14:28:32,false,3,MAS PRADINES,,,RTE,DE PEZENAS,34230,SAINT-PONS-DE-MAUCHIENS,,,34285,,,,,,,,,,,,,,,,,,,2008-01-01,A,,,,,68.20A,NAFRev2,N,3.512568,43.513069,0.83,street,Route de Pezenas 34230 Saint-Pons-de-Mauchiens,34285_0050,G,ROUTE DE PEZENAS,
322276494,00042,32227649400042,O,2015-11-28,,,,2021-12-31T14:28:56,true,1,,,,,MAS PRADINES,34230,SAINT-PONS-DE-MAUCHIENS,,,34285,,,,,,,,,,,,,,,,,,,2015-11-28,A,,,,,35.11Z,NAFRev2,N,3.534578,43.498822,0.31,locality,Mas de Razaire 34230 Saint-Pons-de-Mauchiens,34285_B107,G,MAS DE RAZAIRE,
322390394,00029,32239039400029,O,2000-10-30,,,,2019-11-14T14:00:34,true,1,,,,,SEPT FONTS MAS DE MAURY,34230,SAINT-PONS-DE-MAUCHIENS,,,34285,,,,,,,,,,,,,,,,,,,2000-10-30,A,,,,,01.21Z,NAFRev2,N,3.526091,43.494836,0.55,locality,Mas de Maury 34230 Saint-Pons-de-Mauchiens,34285_B101,G,MAS DE MAURY,
322493867,00012,32249386700012,O,,NN,,,2019-11-14T14:00:34,true,1,,,,,,34230,SAINT-PONS-DE-MAUCHIENS,,,34285,,,,,,,,,,,,,,,,,,,1987-12-25,F,,,,,84.10,NAP,N,,,0,,,,,,
322616095,00020,32261609500020,O,,,,,2019-11-14T14:00:34,true,1,,1,,CHE,DE BOUQUE,34230,SAINT-PONS-DE-MAUCHIENS,,,34285,,,,,,,,,,,,,,,,,,,1993-12-31,F,,,,,45.1A,NAF1993,N,3.51462,43.514448,0.83,housenumber,1 Chemin de Bouque 34230 Saint-Pons-de-Mauchiens,34285_0012_00001,G,1 CHEMIN DE BOUQUE,
323124958,00030,32312495800030,O,2005-06-01,NN,,,2020-08-25T03:43:55,true,6,,2,,RUE,DU ROC,34230,SAINT-PONS-DE-MAUCHIENS,,,34285,,,,,,,,,,,,,,,,,,,2020-08-24,F,,,,,43.99C,NAFRev2,N,3.5133,43.513497,0.94,housenumber,2 Rue du Roc 34230 Saint-Pons-de-Mauchiens,34285_0059_00002,G,2 RUE DU ROC,
326247210,00015,32624721000015,O,1983-01-01,NN,,,2019-11-14T14:00:34,true,4,,8,,RUE,DES HORTS,34230,SAINT-PONS-DE-MAUCHIENS,,,34285,,,,,,,,,,,,,,,,,,,2013-12-31,F,,,,,01.21Z,NAFRev2,N,3.513846,43.515285,0.95,housenumber,8 Rue des Horts 34230 Saint-Pons-de-Mauchiens,34285_0037_00008,G,8 RUE DES HORTS,
326387198,00012,32638719800012,O,1983-01-27,NN,,,2019-11-14T14:00:34,false,4,,47,,RUE,DE LA GARRIGUE,34230,SAINT-PONS-DE-MAUCHIENS,,,34285,,,,,,,,,,,,,,,,,,,2013-01-01,F,,,,,01.21Z,NAFRev2,N,3.515156,43.510913,0.76,housenumber,47 Rue des Garrigues 34230 Saint-Pons-de-Mauchiens,34285_0033_00047,G,47 RUE DES GARRIGUES,
326387198,00020,32638719800020,O,1997-09-01,,,,2019-11-14T14:00:34,false,4,,47,,RUE,DES GARRIGUES,34230,SAINT-PONS-DE-MAUCHIENS,,,34285,,,,,,,,,,,,,,,,,,,2012-01-01,F,,,,,01.61Z,NAFRev2,N,3.515156,43.510913,0.95,housenumber,47 Rue des Garrigues 34230 Saint-Pons-de-Mauchiens,34285_0033_00047,G,47 RUE DES GARRIGUES,
326387198,00046,32638719800046,O,2012-01-01,,,,2019-11-14T14:00:34,false,2,,,,RTE,DE SAINT PARGOIRE,34230,SAINT-PONS-DE-MAUCHIENS,,,34285,,,,,,,,,,,,,,,,,,,2013-08-28,F,,,,,01.61Z,NAFRev2,N,3.512442,43.516052,0.86,street,Route de Saint Pargoire 34230 Saint-Pons-de-Mauchiens,34285_0061,G,ROUTE DE SAINT PARGOIRE,
326387198,00053,32638719800053,O,2013-01-01,,,,2021-02-23T10:48:27,true,1,,1,,RTE,DE SAINT PARGOIRE,34230,SAINT-PONS-DE-MAUCHIENS,,,34285,,,,,,,,,,,,,,,,,,,2013-01-01,A,,,,,01.21Z,NAFRev2,N,3.512442,43.516052,0.86,housenumber,1 Route de Saint Pargoire 34230 Saint-Pons-de-Mauchiens,34285_0061_00001,G,1 ROUTE DE SAINT PARGOIRE,
326431921,00013,32643192100013,O,1983-01-01,01,2021,,2023-11-30T10:23:50,true,4,,,,,DOMAINE DE LA PRADE,34230,SAINT-PONS-DE-MAUCHIENS,,,34285,,,,,,,,,,,,,,,,,,,2000-09-30,A,,,,,01.21Z,NAFRev2,N,3.493838,43.522326,0.55,locality,Domaine de Montmau 34230 Saint-Pons-de-Mauchiens,34285_B185,G,DOMAINE DE MONTMAU,
327453221,00019,32745322100019,O,1983-01-01,NN,,,2019-11-14T14:00:34,true,3,,2,,RUE,DE LA GARRIGUE,34230,SAINT-PONS-DE-MAUCHIENS,,,34285,,,,,,,,,,,,,,,,,,,1993-12-25,F,,,,,01.1A,NAF1993,N,3.513527,43.512558,0.75,housenumber,2 Rue des Garrigues 34230 Saint-Pons-de-Mauchiens,34285_0033_00002,G,2 RUE DES GARRIGUES,
327761722,00013,32776172200013,O,1983-06-01,NN,,,2019-11-14T14:00:34,true,3,,2,,RUE,DES GARRIGUES,34230,SAINT-PONS-DE-MAUCHIENS,,,34285,,,,,,,,,,,,,,,,,,,2008-01-01,A,,,,,68.20B,NAFRev2,N,3.513527,43.512558,0.95,housenumber,2 Rue des Garrigues 34230 Saint-Pons-de-Mauchiens,34285_0033_00002,G,2 RUE DES GARRIGUES,
327795092,00029,32779509200029,O,2001-11-01,NN,,,2019-11-14T14:00:34,true,4,,,,,,34230,SAINT-PONS-DE-MAUCHIENS,,,34285,,,,,,,,,,,,,,,,,,,2017-12-31,F,,,,,58.11Z,NAFRev2,N,,,0,,,,,,
327818282,00045,32781828200045,O,1995-07-01,NN,,,2019-11-14T14:00:34,false,4,,,,CHE,DE LA ROUZE,34230,SAINT-PONS-DE-MAUCHIENS,,,34285,,,,,,,,,,,,,,,,,,,2001-09-30,F,,,,,45.2V,NAF1993,O,3.516318,43.512122,0.66,street,Chemin de la Ronze 34230 Saint-Pons-de-Mauchiens,34285_0060,G,CHEMIN DE LA RONZE,
327818282,00052,32781828200052,O,2002-01-07,NN,,,2019-11-14T14:00:34,false,3,,,,CHE,DE LA RONZE,34230,SAINT-PONS-DE-MAUCHIENS,,,34285,,,,,,,,,,,,,,,,,,,2007-04-26,F,,,,,01.4B,NAFRev1,N,3.516318,43.512122,0.83,street,Chemin de la Ronze 34230 Saint-Pons-de-Mauchiens,34285_0060,G,CHEMIN DE LA RONZE,
329615595,00017,32961559500017,O,1984-04-16,NN,,,2019-11-14T14:00:34,true,1,,27,,PL,DE LA MAIRIE,34230,SAINT-PONS-DE-MAUCHIENS,,,34285,,,,,,,,,,,,,,,,,,,1996-05-20,F,,,,,01.1A,NAF1993,N,3.514471,43.512995,0.47,housenumber,27 Rue de la Travesette 34230 Saint-Pons-de-Mauchiens,34285_0065_00027,G,27 RUE DE LA TRAVESETTE,
329628937,00016,32962893700016,O,,NN,,,2019-11-14T14:00:34,true,1,,1,,RTE,DE PEZENAS,34230,SAINT-PONS-DE-MAUCHIENS,,,34285,,,,,,,,,,,,,,,,,,,1984-12-25,F,,,,,01.1A,NAF1993,N,3.513625,43.51274,0.84,housenumber,1 Route de Pezenas 34230 Saint-Pons-de-Mauchiens,34285_0050_00001,G,1 ROUTE DE PEZENAS,
329771760,00017,32977176000017,O,1984-05-09,NN,,,2019-11-14T14:00:34,true,3,,2,,RUE,DES GARRIGUES,34230,SAINT-PONS-DE-MAUCHIENS,,,34285,,,,,,,,,,,,,,,,,,,2008-01-01,A,,,,,01.21Z,NAFRev2,N,3.513527,43.512558,0.95,housenumber,2 Rue des Garrigues 34230 Saint-Pons-de-Mauchiens,34285_0033_00002,G,2 RUE DES GARRIGUES,
331304717,00019,33130471700019,O,,,,,2019-11-14T14:00:34,true,1,,4,,PL,DE LA MAIRIE,34230,SAINT-PONS-DE-MAUCHIENS,,,34285,,,,,,,,,,,,,,,,,,,1997-09-30,F,,,,,55.4B,NAF1993,N,3.514577,43.513512,0.45,housenumber,4 Rue de la Garenne 34230 Saint-Pons-de-Mauchiens,34285_0030_00004,G,4 RUE DE LA GARENNE,
331508531,00026,33150853100026,O,,NN,,,2019-11-14T14:00:34,true,1,,,,CHE,DE LA VICTOIRE,34230,SAINT-PONS-DE-MAUCHIENS,,,34285,,,,,,,,,,,,,,,,,,,1997-12-31,F,,,,,20.5A,NAF1993,N,3.540094,43.49791,0.84,street,Chemin de la Victoire 34230 Saint-Pons-de-Mauchiens,34285_0075,G,CHEMIN DE LA VICTOIRE,
331739524,00014,33173952400014,O,1985-02-11,NN,,,2019-11-14T14:00:34,true,4,,,,RTE,DE PEZENAS,34230,SAINT-PONS-DE-MAUCHIENS,,,34285,,,,,,,,,,,,,,,,,,,1993-12-25,F,,,,,01.1A,NAF1993,N,3.512568,43.513069,0.83,street,Route de Pezenas 34230 Saint-Pons-de-Mauchiens,34285_0050,G,ROUTE DE PEZENAS,
334195435,00014,33419543500014,O,,NN,,,2019-11-14T14:00:34,true,1,,,,RTE,LA PERRIERE DE ST PARGOIRE,34230,SAINT-PONS-DE-MAUCHIENS,,,34285,,,,,,,,,,,,,,,,,,,,F,,,,,62.11,NAP,N,3.512442,43.516052,0.49,street,Route de Saint Pargoire 34230 Saint-Pons-de-Mauchiens,34285_0061,G,ROUTE DE SAINT PARGOIRE,
337661326,00013,33766132600013,O,1986-05-06,NN,,,2019-11-14T14:00:34,true,4,,,,,,34230,SAINT-PONS-DE-MAUCHIENS,,,34285,,,,,,,,,,,,,,,,,,,2014-05-01,F,,,,,01.21Z,NAFRev2,N,,,0,,,,,,
337853253,00025,33785325300025,O,2006-05-15,,,,2019-11-14T14:00:34,false,4,LE MAS DES ROSIERS,,,CHE,DU MAS D'ASTRUC,34230,SAINT-PONS-DE-MAUCHIENS,,,34285,,,,,,,,,,,,,,,,,,,2015-10-04,F,LE MAS DES ROSIERS,,,,01.30Z,NAFRev2,N,3.520402,43.50081,0.65,locality,Mas d'Astruc 34230 Saint-Pons-de-Mauchiens,34285_B095,G,MAS D ASTRUC,
337853253,00033,33785325300033,O,2011-09-13,,,,2019-11-14T14:00:34,false,4,,,,,LE MAS DES ROSIERS,34230,SAINT-PONS-DE-MAUCHIENS,,,34285,,,,,,,,,,,,,,,,,,,2019-04-01,F,,,,,86.90F,NAFRev2,N,3.526091,43.494836,0.38,locality,Mas de Maury 34230 Saint-Pons-de-Mauchiens,34285_B101,G,MAS DE MAURY,
337853253,00066,33785325300066,O,2016-07-04,,,,2023-01-09T11:00:17,true,2,,,,,LE MAS DES ROSIERS,34230,SAINT-PONS-DE-MAUCHIENS,,,34285,,,,,,,,,,,,,,,,,,,2019-02-02,A,,,,,01.49Z,NAFRev2,N,3.526091,43.494836,0.38,locality,Mas de Maury 34230 Saint-Pons-de-Mauchiens,34285_B101,G,MAS DE MAURY,
338168735,00045,33816873500045,O,2004-06-25,NN,,,2019-11-14T14:00:34,false,3,,12,,RUE,DES HORTS,34230,SAINT-PONS-DE-MAUCHIENS,,,34285,,,,,,,,,,,,,,,,,,,2005-03-31,F,,,,,55.3B,NAFRev1,N,3.513767,43.515789,0.95,housenumber,12 Rue des Horts 34230 Saint-Pons-de-Mauchiens,34285_0037_00012,G,12 RUE DES HORTS,
340287572,00010,34028757200010,O,1986-12-31,NN,,,2019-11-14T14:00:34,true,1,,,,,,34230,SAINT-PONS-DE-MAUCHIENS,,,34285,,,,,,,,,,,,,,,,,,,1991-02-05,F,,,,,01.1A,NAF1993,N,,,0,,,,,,
340314285,00016,34031428500016,O,1968-01-01,NN,,,2019-11-14T14:00:34,true,3,,,,,DOMAINE DE MONTREDON,34230,SAINT-PONS-DE-MAUCHIENS,,,34285,,,,,,,,,,,,,,,,,,,2001-12-31,F,,,,,01.1G,NAF1993,N,3.505,43.50117,0.94,locality,Domaine de Montredon 34230 Saint-Pons-de-Mauchiens,34285_B191,G,DOMAINE DE MONTREDON,
340321199,00010,34032119900010,O,1977-01-01,NN,,,2019-11-14T14:00:34,false,4,MAS DE LA VICTOIRE,,,,,34230,SAINT-PONS-DE-MAUCHIENS,,,34285,,,,,,,,,,,,,,,,,,,2001-12-25,F,,,,,01.1G,NAF1993,N,3.533679,43.494478,0.94,locality,Mas de la Victoire 34230 Saint-Pons-de-Mauchiens,34285_B100,D,MAS DE LA VICTOIRE,
340321199,00028,34032119900028,O,1984-06-01,NN,,,2019-11-14T14:00:34,true,4,,,,,MAS DE LA VICTOIRE,34230,SAINT-PONS-DE-MAUCHIENS,,,34285,,,,,,,,,,,,,,,,,,,2016-05-02,A,,,,,68.20A,NAFRev2,N,3.533679,43.494478,0.94,locality,Mas de la Victoire 34230 Saint-Pons-de-Mauchiens,34285_B100,G,MAS DE LA VICTOIRE,
341084416,00021,34108441600021,O,1989-05-01,NN,,,2019-11-14T14:00:34,true,4,,,,,MAS CRISTOL,34230,SAINT-PONS-DE-MAUCHIENS,,,34285,,,,,,,,,,,,,,,,,,,2003-03-31,F,,,,,13.2Z,NAFRev1,O,3.533679,43.494478,0.33,locality,Mas de la Victoire 34230 Saint-Pons-de-Mauchiens,34285_B100,G,MAS DE LA VICTOIRE,
342509833,00014,34250983300014,O,1987-10-01,NN,,,2019-11-14T14:00:34,true,7,,,,,,34230,SAINT-PONS-DE-MAUCHIENS,,,34285,,,,,,,,,,,,,,,,,,,2011-12-31,F,,,,,01.21Z,NAFRev2,N,,,0,,,,,,
343104501,00014,34310450100014,O,,NN,,,2019-11-14T14:00:34,true,1,,,,RUE,VICTOIRE,34230,SAINT-PONS-DE-MAUCHIENS,,,34285,,,,,,,,,,,,,,,,,,,1988-11-08,F,,,,,79.06,NAP,N,3.540094,43.49791,0.64,street,Chemin de la Victoire 34230 Saint-Pons-de-Mauchiens,34285_0075,G,CHEMIN DE LA VICTOIRE,
344360227,00013,34436022700013,O,1988-03-25,NN,,,2019-11-14T14:00:34,true,4,,17,,RUE,DE PEZENAS,34230,SAINT-PONS-DE-MAUCHIENS,,,34285,,,,,,,,,,,,,,,,,,,2001-12-31,F,,,,,01.1A,NAF1993,N,3.512642,43.51303,0.8,housenumber,17 Route de Pezenas 34230 Saint-Pons-de-Mauchiens,34285_0050_00017,G,17 ROUTE DE PEZENAS,
344428370,00011,34442837000011,O,1988-03-30,NN,,,2019-11-14T14:00:34,true,3,,1,,RUE,DU FOURNAS,34230,SAINT-PONS-DE-MAUCHIENS,,,34285,,,,,,,,,,,,,,,,,,,1998-12-25,F,,,,,01.1G,NAF1993,N,3.514406,43.511648,0.95,housenumber,1 Rue du Fournas 34230 Saint-Pons-de-Mauchiens,34285_0026_00001,G,1 RUE DU FOURNAS,
344464110,00040,34446411000040,O,2005-04-01,NN,,,2019-11-14T14:00:34,false,2,CHEZ MME FOURNIER AGNES,8,,CHE,DE LA RONZE,34230,SAINT-PONS-DE-MAUCHIENS,,,34285,,,,,,,,,,,,,,,,,,,2007-12-04,F,,,,,45.1A,NAFRev1,O,3.516122,43.51216,0.85,housenumber,8 Chemin de la Ronze 34230 Saint-Pons-de-Mauchiens,34285_0060_00008,G,8 CHEMIN DE LA RONZE,
348116575,00039,34811657500039,O,1994-12-23,NN,,,2019-11-14T14:00:34,false,4,,11,,PL,DE LA MAIRIE,34230,SAINT-PONS-DE-MAUCHIENS,,,34285,,,,,,,,,,,,,,,,,,,1999-06-30,F,,,,,92.3A,NAF1993,N,3.514267,43.513915,0.48,housenumber,11 Rue de la Garenne 34230 Saint-Pons-de-Mauchiens,34285_0030_00011,G,11 RUE DE LA GARENNE,
348693342,00027,34869334200027,O,1990-04-11,NN,,,2019-11-14T14:00:34,true,4,,,,DOM,DE ST MICHEL LE NOIR,34230,SAINT-PONS-DE-MAUCHIENS,,,34285,,,,,,,,,,,,,,,,,,,1992-12-25,F,,,,,64.14,NAP,N,3.488167,43.508747,0.84,locality,Dom St Michel le Noir 34230 Saint-Pons-de-Mauchiens,34285_B193,G,DOM ST MICHEL LE NOIR,
350719647,00017,35071964700017,O,1989-04-19,NN,,,2019-11-14T14:00:34,true,3,,,,,MAS DE RAZAIRE,34230,SAINT-PONS-DE-MAUCHIENS,,,34285,,,,,,,,,,,,,,,,,,,2008-01-01,A,,,,,68.20B,NAFRev2,N,3.534578,43.498822,0.94,locality,Mas de Razaire 34230 Saint-Pons-de-Mauchiens,34285_B107,G,MAS DE RAZAIRE,
352987432,00031,35298743200031,O,2010-06-03,,,4334ZC,2021-02-23T11:05:21,true,1,,38,,RUE,DE LA GARENNE,34230,SAINT-PONS-DE-MAUCHIENS,,,34285,,,,,,,,,,,,,,,,,,,2010-06-03,A,,,,,43.34Z,NAFRev2,N,3.51366,43.514109,0.95,housenumber,38 Rue de la Garenne 34230 Saint-Pons-de-Mauchiens,34285_0030_00038,G,38 RUE DE LA GARENNE,
353215122,00014,35321512200014,O,1989-07-01,NN,,,2019-11-14T14:00:34,true,3,,8,,RUE,DES HORTS,34230,SAINT-PONS-DE-MAUCHIENS,,,34285,,,,,,,,,,,,,,,,,,,2008-01-01,A,,,,,01.21Z,NAFRev2,N,3.513846,43.515285,0.95,housenumber,8 Rue des Horts 34230 Saint-Pons-de-Mauchiens,34285_0037_00008,G,8 RUE DES HORTS,
353242027,00012,35324202700012,O,1990-01-23,NN,,,2019-11-14T14:00:34,false,4,,8,,RUE,DES HORTS,34230,SAINT-PONS-DE-MAUCHIENS,,,34285,,,,,,,,,,,,,,,,,,,2012-07-10,F,,,,,01.21Z,NAFRev2,N,3.513846,43.515285,0.95,housenumber,8 Rue des Horts 34230 Saint-Pons-de-Mauchiens,34285_0037_00008,G,8 RUE DES HORTS,
353242027,00020,35324202700020,O,2012-07-10,01,2021,,2023-11-30T10:17:57,true,2,SAINT-PONS-DE-MAUCHIENS,40,,RUE,DES GARRIGUES,34230,SAINT-PONS-DE-MAUCHIENS,,,34285,,,,,,,,,,,,,,,,,,,2013-12-31,A,,,,,01.21Z,NAFRev2,O,3.516041,43.509749,0.95,housenumber,40 Rue des Garrigues 34230 Saint-Pons-de-Mauchiens,34285_0033_00040,G,40 RUE DES GARRIGUES,
353820194,00010,35382019400010,O,1990-02-10,NN,,,2019-11-14T14:00:34,false,4,,,,RUE,DES GARRIGUES,34230,SAINT-PONS-DE-MAUCHIENS,,,34285,,,,,,,,,,,,,,,,,,,2003-01-01,F,,,,,01.1G,NAF1993,N,3.515059,43.510896,0.95,street,Rue des Garrigues 34230 Saint-Pons-de-Mauchiens,34285_0033,G,RUE DES GARRIGUES,
353820194,00028,35382019400028,O,2003-01-01,NN,,,2019-11-14T14:00:34,true,3,,17,,RTE,DE PEZENAS,34230,SAINT-PONS-DE-MAUCHIENS,,,34285,,,,,,,,,,,,,,,,,,,2008-01-01,A,,,,,01.21Z,NAFRev2,N,3.512642,43.51303,0.85,housenumber,17 Route de Pezenas 34230 Saint-Pons-de-Mauchiens,34285_0050_00017,G,17 ROUTE DE PEZENAS,
378711121,00012,37871112100012,O,1990-07-01,NN,,,2019-11-14T14:00:34,true,1,,,,CHE,DES BOUFFIES,34230,SAINT-PONS-DE-MAUCHIENS,,,34285,,,,,,,,,,,,,,,,,,,1999-08-30,F,,,,,45.2T,NAF1993,O,3.486563,43.515477,0.82,locality,Chemin des Bouffies 34230 Saint-Pons-de-Mauchiens,34285_0009,G,CHEMIN DES BOUFFIES,
378990352,00015,37899035200015,O,1990-07-13,NN,,,2019-11-14T14:00:34,true,3,RES CYRANO,24,,RTE,PEZENAS,34230,SAINT-PONS-DE-MAUCHIENS,,,34285,,,,,,,,,,,,,,,,,,,2008-01-01,A,,,,,68.20A,NAFRev2,N,3.512593,43.513327,0.82,housenumber,24 Route de Pezenas 34230 Saint-Pons-de-Mauchiens,34285_0050_00024,G,24 ROUTE DE PEZENAS,
379037310,00024,37903731000024,O,2019-04-03,,,,2021-02-23T11:07:41,true,1,LES PARADEOUS OUEST,,,CHE,DU MAS D ASTRUC,34230,SAINT-PONS-DE-MAUCHIENS,,,34285,,,,,,,,,,,,,,,,,,,2019-04-03,A,PETIT FRERE,,,,01.49Z,NAFRev2,N,3.520402,43.50081,0.65,locality,Mas d'Astruc 34230 Saint-Pons-de-Mauchiens,34285_B095,G,MAS D ASTRUC,