siren,nic,siret,statutDiffusionEtablissement,dateCreationEtablissement,trancheEffectifsEtablissement,anneeEffectifsEtablissement,activitePrincipaleRegistreMetiersEtablissement,dateDernierTraitementEtablissement,etablissementSiege,nombrePeriodesEtablissement,complementAdresseEtablissement,numeroVoieEtablissement,indiceRepetitionEtablissement,typeVoieEtablissement,libelleVoieEtablissement,codePostalEtablissement,libelleCommuneEtablissement,libelleCommuneEtrangerEtablissement,distributionSpecialeEtablissement,codeCommuneEtablissement,codeCedexEtablissement,libelleCedexEtablissement,codePaysEtrangerEtablissement,libellePaysEtrangerEtablissement,complementAdresse2Etablissement,numeroVoie2Etablissement,indiceRepetition2Etablissement,typeVoie2Etablissement,libelleVoie2Etablissement,codePostal2Etablissement,libelleCommune2Etablissement,libelleCommuneEtranger2Etablissement,distributionSpeciale2Etablissement,codeCommune2Etablissement,codeCedex2Etablissement,libelleCedex2Etablissement,codePaysEtranger2Etablissement,libellePaysEtranger2Etablissement,dateDebut,etatAdministratifEtablissement,enseigne1Etablissement,enseigne2Etablissement,enseigne3Etablissement,denominationUsuelleEtablissement,activitePrincipaleEtablissement,nomenclatureActivitePrincipaleEtablissement,caractereEmployeurEtablissement,longitude,latitude,geo_score,geo_type,geo_adresse,geo_id,geo_ligne,geo_l4,geo_l5
214801151,00017,21480115100017,O,1983-03-01,03,2021,,2023-11-30T10:18:20,true,4,,,,,LE VILLAGE,48110,LE POMPIDOU,,,48115,,,,,,,,,,,,,,,,,,,2008-01-01,A,MAIRIE,,,,84.11Z,NAFRev2,O,3.654308,44.19524,0.83,locality,Le Pompidou Village 48110 Le Pompidou,48115_B651,G,LE POMPIDOU VILLAGE,
214801151,00025,21480115100025,O,1983-03-16,NN,,,2008-01-04T18:34:45,false,3,,,,RTE,CORNICHE,48110,LE POMPIDOU,,,48115,,,,,,,,,,,,,,,,,,,2008-01-01,A,CAMPING MUNICIPAL BEL AIR,,,,55.30Z,NAFRev2,N,2.6934243,43.5070306,0.75,poi.track,Route Forestière de la Corniche (Chemin) Courniou,https://osm.org/way/178593136,G,,
214801151,00033,21480115100033,O,1983-12-21,NN,,,2007-10-10T15:52:06,false,3,,,,,,48110,LE POMPIDOU,,,48115,,,,,,,,,,,,,,,,,,,2007-09-18,F,ECOLE PRIMAIRE PUBLIQUE,,,,80.1Z,NAFRev1,N,,,0,,,,,,
214801151,00041,21480115100041,O,1995-12-25,NN,,,2008-01-04T18:34:45,false,2,MAIRIE,,,,,48110,LE POMPIDOU,,,48115,,,,,,,,,,,,,,,,,,,2008-01-01,A,SERVICE DES EAUX,,,,36.00Z,NAFRev2,N,3.68338,44.198347,0.37,locality,Mas Soutairo 48110 Le Pompidou,48115_B574,D,MAS SOUTAIRO,
214801151,00058,21480115100058,O,2003-03-29,NN,,,2008-08-25T15:00:00,false,4,,,,,HOTEL DE VILLE,48110,LE POMPIDOU,,,48115,,,,,,,,,,,,,,,,,,,2008-04-07,F,LOGEMENTS SOCIAUX,,,,68.20A,NAFRev2,N,3.654308,44.19524,0.32,locality,Le Pompidou Village 48110 Le Pompidou,48115_B651,G,LE POMPIDOU VILLAGE,
264800673,00016,26480067300016,O,1993-09-15,NN,,,2007-05-16T10:59:33,true,3,,,,,HOTEL DE VILLE,48110,LE POMPIDOU,,,48115,,,,,,,,,,,,,,,,,,,2006-02-11,F,CDE,,,,85.3K,NAFRev1,N,3.654308,44.19524,0.32,locality,Le Pompidou Village 48110 Le Pompidou,48115_B651,G,LE POMPIDOU VILLAGE,
264801127,00012,26480112700012,O,1986-01-06,NN,,,2022-08-11T09:49:44,true,4,,,,,HOTEL DE VILLE,48110,LE POMPIDOU,,,48115,,,,,,,,,,,,,,,,,,,2020-01-01,F,CCAS DU POMPIDOU,,,,88.99B,NAFRev2,N,3.654308,44.19524,0.32,locality,Le Pompidou Village 48110 Le Pompidou,48115_B651,G,LE POMPIDOU VILLAGE,
274800580,00012,27480058000012,O,,NN,,,,true,1,,,,,HOTEL DE VILLE,48110,LE POMPIDOU,,,48115,,,,,,,,,,,,,,,,,,,1995-12-25,F,,,,,41.0Z,NAF1993,N,3.654308,44.19524,0.32,locality,Le Pompidou Village 48110 Le Pompidou,48115_B651,G,LE POMPIDOU VILLAGE,
304666902,00016,30466690200016,O,1963-01-01,NN,,,2006-10-27T00:04:56,true,3,,,,,,48110,LE POMPIDOU,,,48115,,,,,,,,,,,,,,,,,,,2004-12-31,F,,,,,70.2C,NAFRev1,N,,,0,,,,,,
312696503,00019,31269650300019,O,1978-01-01,,,,,true,3,,,,,,48110,LE POMPIDOU,,,48115,,,,,,,,,,,,,,,,,,,1997-12-25,F,,,,,91.3E,NAF1993,N,,,0,,,,,,
314437740,00025,31443774000025,O,2010-01-01,,,,2022-06-16T03:45:48,true,2,,,,,LE MAS AOUT,48110,LE POMPIDOU,,,48115,,,,,,,,,,,,,,,,,,,2021-08-16,F,,,,,01.11Z,NAFRev2,N,3.670749,44.200879,0.81,locality,Mas Aout 48110 Le Pompidou,48115_B570,G,MAS AOUT,
315026880,00031,31502688000031,O,2011-01-01,,,,2021-02-23T10:40:59,true,1,,,,,LE MASBONNET,48110,LE POMPIDOU,,,48115,,,,,,,,,,,,,,,,,,,2011-01-01,A,,,,,01.49Z,NAFRev2,N,3.650816,44.221636,0.69,locality,Mas Bonnet 48110 Le Pompidou,48115_B571,G,MAS BONNET,
316122431,00018,31612243100018,O,1979-01-01,NN,,4399CZ,2016-11-08T04:56:12,true,6,,,,,LA MOLINE,48110,LE POMPIDOU,,,48115,,,,,,,,,,,,,,,,,,,2016-10-31,F,,,,,43.99C,NAFRev2,N,5.4237804,43.3129018,0.89,poi.park,Parc de la Moline Marseille,https://osm.org/way/42867081,G,,
327685699,00016,32768569900016,O,1983-04-04,NN,,,2006-11-25T10:05:34,true,1,,,,,,48110,LE POMPIDOU,,,48115,,,,,,,,,,,,,,,,,,,1998-07-01,F,,,,,55.2E,NAF1993,O,,,0,,,,,,
328919519,00012,32891951900012,O,,NN,,,,true,1,,,,,,48110,LE POMPIDOU,,,48115,,,,,,,,,,,,,,,,,,,1991-12-31,F,,,,,45.2V,NAF1993,O,,,0,,,,,,
329190664,00022,32919066400022,O,,NN,,,,true,1,,,,,,48110,LE POMPIDOU,,,48115,,,,,,,,,,,,,,,,,,,1990-12-31,F,,,,,70.2A,NAF1993,N,,,0,,,,,,
332496538,00023,33249653800023,O,1990-10-01,NN,,,2021-12-07T04:15:00,true,6,,,,LD,LA LOUBIERE,48110,LE POMPIDOU,,,48115,,,,,,,,,,,,,,,,,,,2021-12-31,F,,,,,01.61Z,NAFRev2,N,3.65606,44.196991,0.46,locality,La Blaquiere Haute 48110 Le Pompidou,48115_B043,G,LA BLAQUIERE HAUTE,
343048757,00029,34304875700029,O,,NN,,,,true,1,,,,,ANCIENNE GENDARMERIE,48110,LE POMPIDOU,,,48115,,,,,,,,,,,,,,,,,,,1993-03-31,F,,,,,20.1A,NAF1993,N,4.4459578,43.8650313,0.9,poi.police,Ancienne Gendarmerie (Police) Marguerittes,https://osm.org/way/47704712,G,,
347513723,00036,34751372300036,O,,NN,,,,true,1,,,,,,48110,LE POMPIDOU,,,48115,,,,,,,,,,,,,,,,,,,1994-03-20,F,,,,,92.3A,NAF1993,N,,,0,,,,,,
349377705,00018,34937770500018,O,1989-01-01,NN,,,2008-01-04T23:03:17,true,3,,,,,LE CRENAT,48110,LE POMPIDOU,,,48115,,,,,,,,,,,,,,,,,,,2008-01-01,A,,,,,01.45Z,NAFRev2,N,3.655618,44.195749,0.45,locality,Prat de la Croux 48110 Le Pompidou,48115_B661,G,PRAT DE LA CROUX,
352170484,00013,35217048400013,O,1984-01-01,NN,,,2006-01-18T04:16:31,false,3,,,,,,48110,LE POMPIDOU,,,48115,,,,,,,,,,,,,,,,,,,1992-01-06,F,GERANT DE SARL TINEL GILBERT ET HENRI,,,,45.2V,NAF1993,N,,,0,,,,,,
352170518,00018,35217051800018,O,1992-01-01,NN,,,2008-11-08T00:28:56,true,4,,,,,,48110,LE POMPIDOU,,,48115,,,,,,,,,,,,,,,,,,,2003-09-30,F,,,,,45.2V,NAFRev1,O,,,0,,,,,,
353197957,00015,35319795700015,O,1989-12-31,NN,,,2008-01-04T23:51:33,true,3,,,,,LE CREMAL,48110,LE POMPIDOU,,,48115,,,,,,,,,,,,,,,,,,,2008-01-01,A,,,,,01.45Z,NAFRev2,N,3.655618,44.195749,0.37,locality,Prat de la Croux 48110 Le Pompidou,48115_B661,G,PRAT DE LA CROUX,
356000919,05725,35600091905725,O,1991-01-01,NN,,,2006-10-28T00:12:31,false,3,,,,LD,LE CHATEAU,48110,LE POMPIDOU,,,48115,,,,,,,,,,,,,,,,,,,2004-01-01,F,BUREAU DE POSTE LE POMPIDOU,,,,64.1A,NAFRev1,O,2.263777,42.927921,0.89,poi.castle,Château Rennes-le-Château,https://osm.org/way/287034824,G,,
378547095,00018,37854709500018,O,1990-01-01,NN,,,2014-06-02T10:02:59,false,3,,,,,LE MASAOU,48110,LE POMPIDOU,,,48115,,,,,,,,,,,,,,,,,,,1991-09-30,F,,,,,85.1G,NAF1993,N,3.670749,44.200879,0.63,locality,Mas Aout 48110 Le Pompidou,48115_B570,G,MAS AOUT,
378615553,00062,37861555300062,O,2000-11-15,NN,,,2006-10-28T00:22:05,false,3,,,,,LE MAZELET,48110,LE POMPIDOU,,,48115,,,,,,,,,,,,,,,,,,,2006-04-15,F,,,,,01.1F,NAFRev1,N,3.650816,44.221636,0.41,locality,Mas Bonnet 48110 Le Pompidou,48115_B571,G,MAS BONNET,
378992135,00020,37899213500020,O,1994-10-03,NN,,,2014-07-08T01:02:31,false,4,,,,,LOU TOUREL,48110,LE POMPIDOU,,,48115,,,,,,,,,,,,,,,,,,,2009-03-04,F,,,,,43.32C,NAFRev2,N,3.670213,44.195062,0.93,locality,Lou Tourel 48110 Le Pompidou,48115_B498,G,LOU TOUREL,
380080366,00012,38008036600012,O,1990-11-01,NN,,,2014-07-08T01:03:59,false,7,,,,,,48110,LE POMPIDOU,,,48115,,,,,,,,,,,,,,,,,,,2010-12-20,F,,,,,47.11B,NAFRev2,O,,,0,,,,,,
380235739,00014,38023573900014,O,1900-01-01,NN,,,2011-09-26T15:13:04,false,6,,,,,,48110,LE POMPIDOU,,,48115,,,,,,,,,,,,,,,,,,,2011-08-08,F,,,,,68.20B,NAFRev2,N,,,0,,,,,,
381914928,00027,38191492800027,O,2011-02-01,,,,2020-11-14T03:56:12,true,2,,,,,LA MOLINE,48110,LE POMPIDOU,,,48115,,,,,,,,,,,,,,,,,,,2020-04-17,F,,,,,47.99B,NAFRev2,N,5.4237804,43.3129018,0.89,poi.park,Parc de la Moline Marseille,https://osm.org/way/42867081,G,,
382642031,00019,38264203100019,O,,NN,,,,true,1,,,,,LE MASAOUT,48110,LE POMPIDOU,,,48115,,,,,,,,,,,,,,,,,,,1991-09-30,F,,,,,84.12,NAP,N,3.670749,44.200879,0.65,locality,Mas Aout 48110 Le Pompidou,48115_B570,G,MAS AOUT,
384097689,00010,38409768900010,O,1991-08-12,NN,,,2008-01-04T22:33:52,true,3,,,,,,48110,LE POMPIDOU,,,48115,,,,,,,,,,,,,,,,,,,2008-01-01,A,,,,,94.99Z,NAFRev2,N,,,0,,,,,,
390634798,00016,39063479800016,O,1993-03-20,NN,,,,true,3,,,,,LA COSTE,48110,LE POMPIDOU,,,48115,,,,,,,,,,,,,,,,,,,1999-12-25,F,,,,,01.4A,NAF1993,N,3.655618,44.195749,0.4,locality,Prat de la Croux 48110 Le Pompidou,48115_B661,G,PRAT DE LA CROUX,
390634889,00013,39063488900013,O,1992-09-01,NN,,,2017-11-17T08:30:38,true,4,,,,,,48110,LE POMPIDOU,,,48115,,,,,,,,,,,,,,,,,,,2017-12-31,F,,,,,01.45Z,NAFRev2,N,,,0,,,,,,
390880219,00014,39088021900014,O,1993-03-18,NN,,,2010-07-20T04:54:15,true,3,,,,,LE MAZELET,48110,LE POMPIDOU,,,48115,,,,,,,,,,,,,,,,,,,2008-01-01,A,,,,,68.32A,NAFRev2,N,3.650816,44.221636,0.41,locality,Mas Bonnet 48110 Le Pompidou,48115_B571,G,MAS BONNET,
391163151,00098,39116315100098,O,2005-10-01,,,,2008-11-08T00:53:55,false,2,,,,,LE VILLAGE,48110,LE POMPIDOU,,,48115,,,,,,,,,,,,,,,,,,,2006-07-01,F,,,,,45.4J,NAFRev1,N,3.654308,44.19524,0.83,locality,Le Pompidou Village 48110 Le Pompidou,48115_B651,G,LE POMPIDOU VILLAGE,
391580719,00030,39158071900030,O,2002-02-01,NN,,,2006-10-28T01:45:54,false,3,,,,LD,LE MAS ARIBAL,48110,LE POMPIDOU,,,48115,,,,,,,,,,,,,,,,,,,2005-10-12,F,,,,,01.2J,NAFRev1,N,3.670749,44.200879,0.44,locality,Mas Aout 48110 Le Pompidou,48115_B570,G,MAS AOUT,
391580719,00048,39158071900048,O,2005-10-12,,,,2018-09-27T03:58:28,true,4,,,,,LE TOUREL,48110,LE POMPIDOU,,,48115,,,,,,,,,,,,,,,,,,,2017-10-18,F,,,,,68.20B,NAFRev2,N,3.670213,44.195062,0.81,locality,Lou Tourel 48110 Le Pompidou,48115_B498,G,LOU TOUREL,
392530515,00023,39253051500023,O,2015-01-01,,,,2021-02-23T11:18:19,true,1,,,,,LE VALAT,48110,LE POMPIDOU,,,48115,,,,,,,,,,,,,,,,,,,2015-01-01,A,,,,,86.90D,NAFRev2,N,3.646767,44.206216,0.8,locality,Lou Valat 48110 Le Pompidou,48115_B505,G,LOU VALAT,
393779889,00012,39377988900012,O,1994-01-01,NN,,,2018-09-29T12:21:45,true,3,,,,,,48110,LE POMPIDOU,,,48115,,,,,,,,,,,,,,,,,,,2008-01-01,A,,,,,01.46Z,NAFRev2,N,,,0,,,,,,
393779889,00020,39377988900020,O,1996-01-01,NN,,,2016-01-12T00:15:11,false,3,,,,,LE VILLAGE,48110,LE POMPIDOU,,,48115,,,,,,,,,,,,,,,,,,,2008-01-01,A,,,,,56.10A,NAFRev2,N,3.654308,44.19524,0.83,locality,Le Pompidou Village 48110 Le Pompidou,48115_B651,G,LE POMPIDOU VILLAGE,
393779889,00038,39377988900038,O,2014-04-15,,,,2014-05-07T03:30:50,false,1,,,,,,48110,LE POMPIDOU,,,48115,,,,,,,,,,,,,,,,,,,2014-04-15,A,,,,,68.20B,NAFRev2,N,,,0,,,,,,
394584353,00012,39458435300012,O,1994-04-11,NN,,4399CZ,2015-03-17T00:41:15,true,4,,,,,LA ROCHELLE,48110,LE POMPIDOU,,,48115,,,,,,,,,,,,,,,,,,,2013-01-01,A,,,,,43.99C,NAFRev2,N,3.659311,44.194094,0.46,locality,Serre de la Capelle 48110 Le Pompidou,48115_B746,G,SERRE DE LA CAPELLE,
400034112,00013,40003411200013,O,1978-01-01,NN,,,2006-10-28T02:47:15,true,3,,,,,,48110,LE POMPIDOU,,,48115,,,,,,,,,,,,,,,,,,,2005-12-31,F,,,,,01.1A,NAFRev1,N,,,0,,,,,,
402052534,00011,40205253400011,O,1995-08-07,NN,,,2008-01-04T19:57:34,true,4,,,,,MAISON FAMILIALE,48110,LE POMPIDOU,,,48115,,,,,,,,,,,,,,,,,,,2008-01-01,A,,,,,94.99Z,NAFRev2,N,-1.0490668,46.6835414,0.9,poi.school,Maison familiale (École) Chantonnay,https://osm.org/node/1801910810,G,,
402282842,00010,40228284200010,O,1995-07-08,,,,2008-01-04T20:01:30,true,3,,,,,LE MAS ROGER,48110,LE POMPIDOU,,,48115,,,,,,,,,,,,,,,,,,,2008-01-01,A,,,,,18.12Z,NAFRev2,N,3.69731,44.19683,0.69,locality,Mas Rotger 48110 Le Pompidou,48115_B573,G,MAS ROTGER,
403642523,00050,40364252300050,O,2013-01-02,,,4932ZB,2015-11-26T09:21:50,true,2,,,,,LE VILLAGE,48110,LE POMPIDOU,,,48115,,,,,,,,,,,,,,,,,,,2015-10-31,F,,,,,49.32Z,NAFRev2,N,3.654308,44.19524,0.83,locality,Le Pompidou Village 48110 Le Pompidou,48115_B651,G,LE POMPIDOU VILLAGE,
404737025,00019,40473702500019,O,1980-01-01,NN,,,2017-02-19T04:26:26,true,4,,,,,,48110,LE POMPIDOU,,,48115,,,,,,,,,,,,,,,,,,,2017-01-10,F,,,,,01.45Z,NAFRev2,N,,,0,,,,,,
404737025,00027,40473702500027,O,1999-01-01,NN,,,2016-12-08T08:17:28,false,4,,,,,,48110,LE POMPIDOU,,,48115,,,,,,,,,,,,,,,,,,,2015-12-31,F,,,,,43.12A,NAFRev2,N,,,0,,,,,,
404899700,00011,40489970000011,O,1976-05-25,NN,,,2009-06-27T08:05:27,true,4,,,,,LA BORIE,48110,LE POMPIDOU,,,48115,,,,,,,,,,,,,,,,,,,2008-03-31,F,,,,,01.45Z,NAFRev2,N,3.65606,44.196991,0.4,locality,La Blaquiere Haute 48110 Le Pompidou,48115_B043,G,LA BLAQUIERE HAUTE,
405139080,00015,40513908000015,O,1995-01-01,NN,,,2008-01-04T20:51:03,true,3,,,,,LA MOLINE,48110,LE POMPIDOU,,,48115,,,,,,,,,,,,,,,,,,,2008-01-01,A,,,,,01.43Z,NAFRev2,N,5.4237804,43.3129018,0.89,poi.park,Parc de la Moline Marseille,https://osm.org/way/42867081,G,,
414680686,00014,41468068600014,O,1997-12-22,NN,,1610AQ,2015-03-17T00:51:44,true,3,,,,,LE MASBONNET,48110,LE POMPIDOU,,,48115,,,,,,,,,,,,,,,,,,,2008-01-01,A,,,,,02.40Z,NAFRev2,N,3.650816,44.221636,0.69,locality,Mas Bonnet 48110 Le Pompidou,48115_B571,G,MAS BONNET,
418194015,00024,41819401500024,O,2009-09-17,,,,2021-02-23T11:38:47,true,1,LE MAZELET,,,,,48110,LE POMPIDOU,,,48115,,,,,,,,,,,,,,,,,,,2009-09-17,A,,,,,68.20B,NAFRev2,N,3.650816,44.221636,0.41,locality,Mas Bonnet 48110 Le Pompidou,48115_B571,D,MAS BONNET,
418478020,00021,41847802000021,O,2006-01-25,01,2021,4321AB,2023-11-30T10:32:15,true,3,BELLE VUE,,,,VILLAGE,48110,LE POMPIDOU,,,48115,,,,,,,,,,,,,,,,,,,2008-01-01,A,,,,,43.99C,NAFRev2,O,3.654308,44.19524,0.9,locality,Le Pompidou Village 48110 Le Pompidou,48115_B651,G,LE POMPIDOU VILLAGE,
418800678,00017,41880067800017,O,1982-12-31,NN,,,2006-12-17T06:44:52,true,3,,,,,LA FONTANELLE,48110,LE POMPIDOU,,,48115,,,,,,,,,,,,,,,,,,,2006-08-20,F,,,,,01.1A,NAFRev1,N,3.659311,44.194094,0.4,locality,Serre de la Capelle 48110 Le Pompidou,48115_B746,G,SERRE DE LA CAPELLE,
418800686,00010,41880068600010,O,1983-12-31,NN,,,2008-01-04T23:26:49,true,3,,,,,LE MAS AOUT,48110,LE POMPIDOU,,,48115,,,,,,,,,,,,,,,,,,,2008-01-01,A,,,,,01.42Z,NAFRev2,N,3.670749,44.200879,0.81,locality,Mas Aout 48110 Le Pompidou,48115_B570,G,MAS AOUT,
420885899,00013,42088589900013,O,1997-06-01,NN,,,2019-01-19T04:06:06,true,4,,,,LD,LE SOULEYROL,48110,LE POMPIDOU,,,48115,,,,,,,,,,,,,,,,,,,2017-12-31,F,,,,,01.45Z,NAFRev2,N,3.68338,44.198347,0.36,locality,Mas Soutairo 48110 Le Pompidou,48115_B574,G,MAS SOUTAIRO,
420885907,00014,42088590700014,O,1985-12-31,NN,,,2006-10-28T04:56:59,true,3,,,,,,48110,LE POMPIDOU,,,48115,,,,,,,,,,,,,,,,,,,2004-12-31,F,,,,,01.1F,NAFRev1,N,,,0,,,,,,
421518309,00040,42151830900040,O,2020-07-01,,,,2021-02-23T11:42:51,true,1,,,,,LE MAZELET,48110,LE POMPIDOU,,,48115,,,,,,,,,,,,,,,,,,,2020-07-01,A,,,,,47.89Z,NAFRev2,N,3.650816,44.221636,0.41,locality,Mas Bonnet 48110 Le Pompidou,48115_B571,G,MAS BONNET,
427647771,00026,42764777100026,O,2019-07-01,,,,2022-06-23T11:39:22,false,2,,,,,LE CROUZET - LE POMPIDOU,48110,LE POMPIDOU,,,48115,,,,,,,,,,,,,,,,,,,2021-09-30,F,,,,,68.20A,NAFRev2,N,3.656542,44.180028,0.71,locality,Lou Clauzet 48110 Le Pompidou,48115_B425,G,LOU CLAUZET,
428644066,00014,42864406600014,O,1999-10-01,NN,,,2008-01-05T01:29:07,true,5,MME AFFORTIT COLETTE,,,,,48110,LE POMPIDOU,,,48115,,,,,,,,,,,,,,,,,,,2008-01-01,A,,,,,90.02Z,NAFRev2,N,,,0,,,,,,
430087932,00041,43008793200041,O,2019-11-01,,,,2021-12-14T08:37:41,false,2,MAISON TRUEL,,,,,48110,LE POMPIDOU,,,48115,,,,,,,,,,,,,,,,,,,2020-01-06,F,,,,,86.90D,NAFRev2,N,,,0,,,,,,
432973667,00012,43297366700012,O,2000-09-01,NN,,,2008-01-05T20:56:49,true,3,,,,,,48110,LE POMPIDOU,,,48115,,,,,,,,,,,,,,,,,,,2008-01-01,A,,,,,68.20B,NAFRev2,N,,,0,,,,,,
434084570,00010,43408457000010,O,2001-01-02,NN,,,2008-11-08T02:00:03,true,3,,,,,LA CASTAGNADE,48110,LE POMPIDOU,,,48115,,,,,,,,,,,,,,,,,,,2003-12-31,F,,,,,24.1J,NAFRev1,O,3.659311,44.194094,0.4,locality,Serre de la Capelle 48110 Le Pompidou,48115_B746,G,SERRE DE LA CAPELLE,
438759318,00019,43875931800019,O,2001-08-01,NN,,1072ZZ,2015-03-17T01:05:11,true,3,,,,,LA CASTAGNADE,48110,LE POMPIDOU,,,48115,,,,,,,,,,,,,,,,,,,2008-01-01,A,,,,,70.22Z,NAFRev2,N,3.659311,44.194094,0.4,locality,Serre de la Capelle 48110 Le Pompidou,48115_B746,G,SERRE DE LA CAPELLE,
441912326,00010,44191232600010,O,2002-03-03,NN,,,2008-01-04T21:30:35,true,3,,,,,,48110,LE POMPIDOU,,,48115,,,,,,,,,,,,,,,,,,,2008-01-01,A,,,,,56.10A,NAFRev2,N,,,0,,,,,,
442643516,00028,44264351600028,O,2017-09-15,,,,2017-09-19T07:51:52,true,1,,,,,LA BORIA,48110,LE POMPIDOU,,,48115,,,,,,,,,,,,,,,,,,,2017-09-15,A,FERME DE LA BORIA,,,,01.11Z,NAFRev2,N,3.65606,44.196991,0.4,locality,La Blaquiere Haute 48110 Le Pompidou,48115_B043,G,LA BLAQUIERE HAUTE,
445187628,00018,44518762800018,O,2003-02-01,NN,,,2015-08-26T03:37:44,false,4,,,,,LE MAS ROGER,48110,LE POMPIDOU,,,48115,,,,,,,,,,,,,,,,,,,2015-08-03,F,,,,,01.25Z,NAFRev2,N,3.69731,44.19683,0.69,locality,Mas Rotger 48110 Le Pompidou,48115_B573,G,MAS ROTGER,
447733833,00019,44773383300019,O,2003-03-07,NN,,,2009-12-27T05:47:57,true,4,,,,LD,LA CASTAGNADE,48110,LE POMPIDOU,,,48115,,,,,,,,,,,,,,,,,,,2009-12-22,F,,,,,01.49Z,NAFRev2,N,3.659311,44.194094,0.4,locality,Serre de la Capelle 48110 Le Pompidou,48115_B746,G,SERRE DE LA CAPELLE,
447733833,00027,44773383300027,O,2003-03-07,,,,,false,3,RESSOURCES ETHNOBOTANIQUE,,,,LA CASTAGNADE,48110,LE POMPIDOU,,,48115,,,,,,,,,,,,,,,,,,,2003-12-31,F,,,,,74.1J,NAFRev1,N,3.659311,44.194094,0.4,locality,Serre de la Capelle 48110 Le Pompidou,48115_B746,G,SERRE DE LA CAPELLE,
450203385,00015,45020338500015,O,2003-09-22,NN,,,2016-02-29T19:22:35,true,5,,,,,,48110,LE POMPIDOU,,,48115,,,,,,,,,,,,,,,,,,,2015-12-15,F,,,,,43.99C,NAFRev2,O,,,0,,,,,,
450574850,00019,45057485000019,O,2004-01-01,NN,,,2008-01-05T02:08:11,true,3,,,,LD,POMPIDOU VILLAGE,48110,LE POMPIDOU,,,48115,,,,,,,,,,,,,,,,,,,2008-01-01,A,,,,,02.10Z,NAFRev2,N,3.654308,44.19524,0.92,locality,Le Pompidou Village 48110 Le Pompidou,48115_B651,G,LE POMPIDOU VILLAGE,
452645153,00019,45264515300019,O,1996-02-29,NN,,,2008-01-05T02:47:57,true,3,SALLE POLYVALENTE,,,,MAIRIE,48110,LE POMPIDOU,,,48115,,,,,,,,,,,,,,,,,,,2008-01-01,A,,,,,93.12Z,NAFRev2,N,3.68338,44.198347,0.37,locality,Mas Soutairo 48110 Le Pompidou,48115_B574,G,MAS SOUTAIRO,
453051955,00012,45305195500012,O,2004-05-03,NN,,,2015-05-14T05:11:08,false,5,,,,,LE MAZARIBAL,48110,LE POMPIDOU,,,48115,,,,,,,,,,,,,,,,,,,2013-10-01,F,,,,,43.99C,NAFRev2,O,,,0,,,,,,
453051955,00038,45305195500038,O,2013-10-01,02,2021,4399CZ,2023-11-30T10:20:52,true,1,,,,,LE SERRE,48110,LE POMPIDOU,,,48115,,,,,,,,,,,,,,,,,,,2013-10-01,A,,,,ALVES JOSE,43.99C,NAFRev2,O,3.659311,44.194094,0.79,locality,Serre de la Capelle 48110 Le Pompidou,48115_B746,G,SERRE DE LA CAPELLE,
473700896,00029,47370089600029,O,2010-01-01,,,,2010-05-28T08:30:37,true,1,,,,,POMPIDOU VILLAGE,48110,LE POMPIDOU,,,48115,,,,,,,,,,,,,,,,,,,2010-01-01,A,,,,,01.61Z,NAFRev2,N,3.654308,44.19524,0.92,locality,Le Pompidou Village 48110 Le Pompidou,48115_B651,G,LE POMPIDOU VILLAGE,
477512677,00014,47751267700014,O,2004-04-20,NN,,,2008-01-05T21:38:26,true,3,,,,,,48110,LE POMPIDOU,,,48115,,,,,,,,,,,,,,,,,,,2008-01-01,A,,,,,68.20B,NAFRev2,N,,,0,,,,,,
479240681,00037,47924068100037,P,2022-01-01,,,,2023-08-25T08:24:24,true,1,[ND],[ND],[ND],[ND],[ND],[ND],LE POMPIDOU,,[ND],48115,[ND],[ND],,,[ND],[ND],[ND],[ND],[ND],[ND],,,[ND],,[ND],[ND],,,2022-01-01,A,[ND],[ND],[ND],[ND],01.28Z,NAFRev2,N,,,0,,,,,,
479240681,00045,47924068100045,P,2023-08-24,,,,2023-09-15T10:09:56,false,1,[ND],[ND],[ND],[ND],[ND],[ND],LE POMPIDOU,,[ND],48115,[ND],[ND],,,[ND],[ND],[ND],[ND],[ND],[ND],,,[ND],,[ND],[ND],,,2023-08-24,A,[ND],[ND],[ND],[ND],23.41Z,NAFRev2,N,,,0,,,,,,
479635120,00039,47963512000039,O,2014-01-13,,,,2015-12-20T03:42:52,true,2,,,,,LE CROUZET,48110,LE POMPIDOU,,,48115,,,,,,,,,,,,,,,,,,,2015-04-30,F,,,,,01.13Z,NAFRev2,N,3.656542,44.180028,0.5,locality,Lou Clauzet 48110 Le Pompidou,48115_B425,G,LOU CLAUZET,
480397454,00012,48039745400012,O,2005-01-01,,,,2018-06-28T04:12:46,true,3,,,,,LE MAS BONNET,48110,LE POMPIDOU,,,48115,,,,,,,,,,,,,,,,,,,2017-01-01,F,,,,,01.13Z,NAFRev2,N,3.650816,44.221636,0.83,locality,Mas Bonnet 48110 Le Pompidou,48115_B571,G,MAS BONNET,
481343622,00017,48134362200017,O,2005-01-01,,,,2016-01-12T00:25:59,true,2,,,,,LA LOUBIERE,48110,LE POMPIDOU,,,48115,,,,,,,,,,,,,,,,,,,2008-01-01,A,,,,,01.61Z,NAFRev2,N,3.65606,44.196991,0.46,locality,La Blaquiere Haute 48110 Le Pompidou,48115_B043,G,LA BLAQUIERE HAUTE,
481684793,00013,48168479300013,O,2005-01-01,,,,2018-12-19T11:01:37,true,3,,,,,MAS BONNET,48110,LE POMPIDOU,,,48115,,,,,,,,,,,,,,,,,,,2012-03-08,F,,,,,01.61Z,NAFRev2,N,3.650816,44.221636,0.93,locality,Mas Bonnet 48110 Le Pompidou,48115_B571,G,MAS BONNET,
484615331,00010,48461533100010,O,2004-01-01,NN,,,2008-01-05T01:37:29,true,3,,,,,LA MAS BONNET,48110,LE POMPIDOU,,,48115,,,,,,,,,,,,,,,,,,,2008-01-01,A,,,,,01.49Z,NAFRev2,N,3.650816,44.221636,0.75,locality,Mas Bonnet 48110 Le Pompidou,48115_B571,G,MAS BONNET,
487870065,00017,48787006500017,O,2006-01-01,,,,2016-12-22T11:36:06,true,3,,,,,VILLAGE,48110,LE POMPIDOU,,,48115,,,,,,,,,,,,,,,,,,,2016-01-01,A,,,,,01.49Z,NAFRev2,N,3.654308,44.19524,0.9,locality,Le Pompidou Village 48110 Le Pompidou,48115_B651,G,LE POMPIDOU VILLAGE,
493307268,00018,49330726800018,O,2006-08-21,,,,2007-05-21T09:38:53,true,2,,,,,LA FONTANELLE,48110,LE POMPIDOU,,,48115,,,,,,,,,,,,,,,,,,,2007-05-31,F,,,,,01.2C,NAFRev1,N,3.659311,44.194094,0.4,locality,Serre de la Capelle 48110 Le Pompidou,48115_B746,G,SERRE DE LA CAPELLE,
497840678,00013,49784067800013,O,1989-10-24,,,,2008-01-05T00:41:22,true,2,CLUB DES AINES RURAUX DU POMPIDOU,,,,MAIRIE,48110,LE POMPIDOU,,,48115,,,,,,,,,,,,,,,,,,,2008-01-01,A,,,,,94.99Z,NAFRev2,N,3.68338,44.198347,0.37,locality,Mas Soutairo 48110 Le Pompidou,48115_B574,G,MAS SOUTAIRO,
498062231,00010,49806223100010,O,2007-06-01,NN,,,2012-05-05T12:43:30,true,2,,,,,LA FONTANELLE,48110,LE POMPIDOU,,,48115,,,,,,,,,,,,,,,,,,,2008-01-01,A,,,,,01.45Z,NAFRev2,N,3.659311,44.194094,0.4,locality,Serre de la Capelle 48110 Le Pompidou,48115_B746,G,SERRE DE LA CAPELLE,
501008759,00018,50100875900018,O,2003-10-28,,,,2008-01-05T01:56:44,true,2,MAIRIE,,,,LE VILLAGE,48110,LE POMPIDOU,,,48115,,,,,,,,,,,,,,,,,,,2008-01-01,A,,,,,93.19Z,NAFRev2,N,3.654308,44.19524,0.83,locality,Le Pompidou Village 48110 Le Pompidou,48115_B651,G,LE POMPIDOU VILLAGE,
503610081,00013,50361008100013,O,2008-04-01,,,,2013-12-23T08:29:33,true,2,,,,,LA BORIE,48110,LE POMPIDOU,,,48115,,,,,,,,,,,,,,,,,,,2013-12-17,F,,,,,01.45Z,NAFRev2,N,3.65606,44.196991,0.4,locality,La Blaquiere Haute 48110 Le Pompidou,48115_B043,G,LA BLAQUIERE HAUTE,
510839665,00054,51083966500054,P,2017-06-01,,,,2018-12-03T19:35:20,true,2,[ND],[ND],[ND],[ND],[ND],[ND],LE POMPIDOU,,[ND],48115,[ND],[ND],,,[ND],[ND],[ND],[ND],[ND],[ND],,,[ND],,[ND],[ND],,,2018-10-31,F,[ND],[ND],[ND],[ND],45.11Z,NAFRev2,N,,,0,,,,,,
513684076,00039,51368407600039,O,2011-11-15,,,,2016-08-10T08:25:03,false,2,,,,,MAISON DE L EGLISE,48110,LE POMPIDOU,,,48115,,,,,,,,,,,,,,,,,,,2016-07-30,F,,,,,86.90F,NAFRev2,N,3.971866,47.332028,0.88,poi.guest_house,gite de la Chaume aux renards (Maison d'hôte) Marigny-l'Église,https://osm.org/way/199723478,G,,
514450238,00019,51445023800019,O,2009-08-21,,,,2016-04-21T14:48:54,true,1,,,,,LE MAZARIBAL,48110,LE POMPIDOU,,,48115,,,,,,,,,,,,,,,,,,,2009-08-21,A,,,,,70.22Z,NAFRev2,N,,,0,,,,,,
517769139,00026,51776913900026,P,2023-06-28,,,,2023-07-01T12:10:02,true,1,[ND],[ND],[ND],[ND],[ND],[ND],LE POMPIDOU,,[ND],48115,[ND],[ND],,,[ND],[ND],[ND],[ND],[ND],[ND],,,[ND],,[ND],[ND],,,2023-06-28,A,[ND],[ND],[ND],[ND],47.89Z,NAFRev2,N,,,0,,,,,,