siren,nic,siret,statutDiffusionEtablissement,dateCreationEtablissement,trancheEffectifsEtablissement,anneeEffectifsEtablissement,activitePrincipaleRegistreMetiersEtablissement,dateDernierTraitementEtablissement,etablissementSiege,nombrePeriodesEtablissement,complementAdresseEtablissement,numeroVoieEtablissement,indiceRepetitionEtablissement,typeVoieEtablissement,libelleVoieEtablissement,codePostalEtablissement,libelleCommuneEtablissement,libelleCommuneEtrangerEtablissement,distributionSpecialeEtablissement,codeCommuneEtablissement,codeCedexEtablissement,libelleCedexEtablissement,codePaysEtrangerEtablissement,libellePaysEtrangerEtablissement,complementAdresse2Etablissement,numeroVoie2Etablissement,indiceRepetition2Etablissement,typeVoie2Etablissement,libelleVoie2Etablissement,codePostal2Etablissement,libelleCommune2Etablissement,libelleCommuneEtranger2Etablissement,distributionSpeciale2Etablissement,codeCommune2Etablissement,codeCedex2Etablissement,libelleCedex2Etablissement,codePaysEtranger2Etablissement,libellePaysEtranger2Etablissement,dateDebut,etatAdministratifEtablissement,enseigne1Etablissement,enseigne2Etablissement,enseigne3Etablissement,denominationUsuelleEtablissement,activitePrincipaleEtablissement,nomenclatureActivitePrincipaleEtablissement,caractereEmployeurEtablissement,longitude,latitude,geo_score,geo_type,geo_adresse,geo_id,geo_ligne,geo_l4,geo_l5
215601469,00012,21560146900012,O,1983-03-01,11,2021,,2023-11-30T10:18:24,true,3,,,,RUE,DE LA MAIRIE,56300,NEULLIAC,,,56146,,,,,,,,,,,,,,,,,,,2008-01-01,A,MAIRIE,,,,84.11Z,NAFRev2,O,-2.983296,48.128533,0.95,street,Rue de la Mairie 56300 Neulliac,56146_0080,G,RUE DE LA MAIRIE,
215601469,00038,21560146900038,O,1983-12-21,01,2021,,2023-11-30T10:18:24,false,3,,11,,LD,KERBAH,56300,NEULLIAC,,,56146,,,,,,,,,,,,,,,,,,,2008-01-01,A,ECOLE PRIMAIRE PUBLIQUE,,,,85.20Z,NAFRev2,N,-2.985548,48.127808,0.95,housenumber,11 Kerbah 56300 Neulliac,56146_0fos8b_00011,G,11 KERBAH,
215601469,00046,21560146900046,O,1994-12-25,NN,,,2013-08-26T15:29:40,false,3,MAIRIE,,,RUE,DE LA MAIRIE,56300,NEULLIAC,,,56146,,,,,,,,,,,,,,,,,,,2012-09-24,F,SERVICE D'ASSAINISSEMENT,,,,37.00Z,NAFRev2,N,-2.983296,48.128533,0.95,street,Rue de la Mairie 56300 Neulliac,56146_0080,G,RUE DE LA MAIRIE,
215601469,00053,21560146900053,O,2000-12-04,NN,,,2013-10-05T12:40:06,false,4,,,,RUE,DE LA MAIRIE,56300,NEULLIAC,,,56146,,,,,,,,,,,,,,,,,,,2012-12-25,F,LOTISSEMENT COMMUNAL,,,,42.99Z,NAFRev2,N,-2.983296,48.128533,0.95,street,Rue de la Mairie 56300 Neulliac,56146_0080,G,RUE DE LA MAIRIE,
215601469,00087,21560146900087,O,2015-11-01,,,,2023-07-04T15:21:47,false,1,,,,RUE,DE LA MAIRIE,56300,NEULLIAC,,,56146,,,,,,,,,,,,,,,,,,,2015-11-01,A,LOTISSEMENT LES JARDINS DU BOCAGE,,,,42.99Z,NAFRev2,N,-2.983296,48.128533,0.95,street,Rue de la Mairie 56300 Neulliac,56146_0080,G,RUE DE LA MAIRIE,
215601469,00095,21560146900095,O,2016-11-01,,,,2023-07-04T15:22:49,false,1,,,,RUE,DE LA MAIRIE,56300,NEULLIAC,,,56146,,,,,,,,,,,,,,,,,,,2016-11-01,A,LOTISSEMENT ESPACE AMEDEE,,,,42.99Z,NAFRev2,N,-2.983296,48.128533,0.95,street,Rue de la Mairie 56300 Neulliac,56146_0080,G,RUE DE LA MAIRIE,
265601476,00012,26560147600012,O,1983-03-01,NN,,,2012-05-05T00:38:38,true,5,MAIRIE,,,RUE,DE LA MAIRIE,56300,NEULLIAC,,,56146,,,,,,,,,,,,,,,,,,,2008-01-01,A,,,,,88.99B,NAFRev2,O,-2.983296,48.128533,0.95,street,Rue de la Mairie 56300 Neulliac,56146_0080,G,RUE DE LA MAIRIE,
265601476,00020,26560147600020,O,1996-07-08,NN,,,2012-08-22T10:12:07,false,5,MAIRIE,,,RUE,DE LA MAIRIE,56300,NEULLIAC,,,56146,,,,,,,,,,,,,,,,,,,2012-04-11,F,SERVICE AIDE MENAGERE A DOMICILE,,,,88.10A,NAFRev2,O,-2.983296,48.128533,0.95,street,Rue de la Mairie 56300 Neulliac,56146_0080,G,RUE DE LA MAIRIE,
295601140,00011,29560114000011,O,1983-08-10,NN,,,2008-01-04T19:07:13,true,3,MAIRIE,,,RUE,DE LA MAIRIE,56300,NEULLIAC,,,56146,,,,,,,,,,,,,,,,,,,2008-01-01,A,,,,,42.99Z,NAFRev2,N,-2.983296,48.128533,0.95,street,Rue de la Mairie 56300 Neulliac,56146_0080,G,RUE DE LA MAIRIE,
300204716,00017,30020471600017,O,,NN,,,,true,1,,,,,LE TY NEHUE,56300,NEULLIAC,,,56146,,,,,,,,,,,,,,,,,,,1987-09-24,F,,,,,01.63,NAP,N,-2.932946,48.117726,0.73,street,Ty Nehué 56300 Neulliac,56146_B077,G,TY NEHUE,
302625405,00022,30262540500022,O,1981-07-01,NN,,,2014-07-08T00:11:49,true,5,,4,,RUE,PAUL IHUEL,56300,NEULLIAC,,,56146,,,,,,,,,,,,,,,,,,,2010-03-31,F,,,,,43.34Z,NAFRev2,O,-2.984076,48.123673,0.95,housenumber,4 Rue Paul Ihuel 56300 Neulliac,56146_0100_00004,G,4 RUE PAUL IHUEL,
303855522,00015,30385552200015,O,,NN,,,,true,1,,,,,RESTERIARD,56300,NEULLIAC,,,56146,,,,,,,,,,,,,,,,,,,1988-07-01,F,,,,,55.73,NAP,N,-2.931886,48.112462,0.95,street,Resteriard 56300 Neulliac,56146_603ih2,G,RESTERIARD,
305668196,00028,30566819600028,O,,,,,,true,1,,,,,LA LANDE PERZO,56300,NEULLIAC,,,56146,,,,,,,,,,,,,,,,,,,1984-12-25,F,,,,,55.73,NAP,N,-2.982475,48.142042,0.72,street,Lande du Perzo 56300 Neulliac,56146_B041,G,LANDE DU PERZO,
306696584,00011,30669658400011,O,,NN,,,,true,1,,,,,AUQUIGNAN,56300,NEULLIAC,,,56146,,,,,,,,,,,,,,,,,,,,F,,,,,22.02,NAP,N,-3.00128,48.131143,0.95,street,Auquignan 56300 Neulliac,56146_d2i0lz,G,AUQUIGNAN,
309629699,00013,30962969900013,O,,NN,,,,true,1,,,,,BOURG,56300,NEULLIAC,,,56146,,,,,,,,,,,,,,,,,,,,F,,,,,55.71,NAP,N,-2.950997,48.118609,0.44,street,Rue des Bouviers 56300 Neulliac,56146_0021,G,RUE DES BOUVIERS,
312350903,00018,31235090300018,O,1978-01-01,NN,,,2008-10-07T09:17:32,true,6,,12,,RUE,DU STADE,56300,NEULLIAC,,,56146,,,,,,,,,,,,,,,,,,,2008-09-08,F,,,,,56.30Z,NAFRev2,N,-2.982674,48.129587,0.95,housenumber,12 Rue du Stade 56300 Neulliac,56146_0157_00012,G,12 RUE DU STADE,
312819550,00012,31281955000012,O,1900-01-01,NN,,,,false,4,,7,,,LANN TREMELER,56300,NEULLIAC,,,56146,,,,,,,,,,,,,,,,,,,1999-02-02,F,,,,,60.2P,NAF1993,N,-2.994467,48.123429,0.95,housenumber,7 Lann Tremeler 56300 Neulliac,56146_b095_00007,G,7 LANN TREMELER,
312819550,00020,31281955000020,O,1994-08-01,NN,,,,false,4,,4,,RUE,DE KERENTRE,56300,NEULLIAC,,,56146,,,,,,,,,,,,,,,,,,,2003-08-14,F,TY COZ,,,,55.3A,NAFRev1,N,-2.982512,48.12797,0.9,housenumber,4 Rue de Kerentree 56300 Neulliac,56146_0069_00004,G,4 RUE DE KERENTREE,
313119976,00022,31311997600022,O,1900-01-01,NN,,,2013-07-18T03:18:08,true,4,,,,,LE STUMO,56300,NEULLIAC,,,56146,,,,,,,,,,,,,,,,,,,2012-12-18,F,,,,,86.90D,NAFRev2,N,-3.002001,48.143388,0.95,street,Le Stumo 56300 Neulliac,56146_6q5kb9,G,LE STUMO,
313259640,00016,31325964000016,O,,NN,,,,true,1,,,,,BOLUMET,56300,NEULLIAC,,,56146,,,,,,,,,,,,,,,,,,,1990-02-15,F,,,,,01.63,NAP,N,-2.952761,48.112984,0.95,street,Bolumet 56300 Neulliac,56146_zdsedn,G,BOLUMET,
313259657,00010,31325965700010,O,,,,,,true,1,,,,,PENHOUEDO,56300,NEULLIAC,,,56146,,,,,,,,,,,,,,,,,,,1984-12-25,F,,,,,01.63,NAP,N,-2.927455,48.116989,0.95,street,Penhouedo 56300 Neulliac,56146_xt8usd,G,PENHOUEDO,
313276958,00011,31327695800011,O,1978-01-01,NN,,,2006-10-27T00:37:45,true,2,,,,,LE RESTE,56300,NEULLIAC,,,56146,,,,,,,,,,,,,,,,,,,1992-12-31,F,,,,,,,,-2.968797,48.135153,0.95,street,Le Reste 56300 Neulliac,56146_dzl5my,G,LE RESTE,
313831786,00014,31383178600014,O,1978-01-01,02,2021,,2023-11-30T10:21:06,true,4,,3,,RUE,DE LA MAIRIE,56300,NEULLIAC,,,56146,,,,,,,,,,,,,,,,,,,2008-01-01,A,,,,,85.20Z,NAFRev2,O,-2.983979,48.128345,0.95,housenumber,3 Rue de la Mairie 56300 Neulliac,56146_0080_00003,G,3 RUE DE LA MAIRIE,
316073758,00039,31607375800039,O,1999-02-08,,,,,true,1,,,,,PENFAVEN,56300,NEULLIAC,,,56146,,,,,,,,,,,,,,,,,,,1999-12-31,F,,,,,80.4C,NAF1993,N,-2.952431,48.098427,0.95,street,Penfaven 56300 Neulliac,56146_v3vdjt,G,PENFAVEN,
316193754,00058,31619375400058,O,1988-10-01,NN,,,,true,1,,,,,LE RESTE,56300,NEULLIAC,,,56146,,,,,,,,,,,,,,,,,,,2002-06-30,F,,,,,52.6H,NAF1993,N,-2.968797,48.135153,0.95,street,Le Reste 56300 Neulliac,56146_dzl5my,G,LE RESTE,
318726593,00011,31872659300011,O,1980-01-01,NN,,,2017-07-27T03:16:27,true,4,,,,,LE ROZE,56300,NEULLIAC,,,56146,,,,,,,,,,,,,,,,,,,2017-06-30,F,,,,,01.61Z,NAFRev2,N,-2.938324,48.103004,0.72,street,Le Roz 56300 Neulliac,56146_mpo4r7,G,LE ROZ,
318726593,00029,31872659300029,O,1999-01-01,NN,,,2017-06-29T14:30:27,false,4,,,,,LE ROZE,56300,NEULLIAC,,,56146,,,,,,,,,,,,,,,,,,,2017-06-30,F,,,,,01.46Z,NAFRev2,N,-2.938324,48.103004,0.72,street,Le Roz 56300 Neulliac,56146_mpo4r7,G,LE ROZ,
319620274,00013,31962027400013,O,1980-08-13,NN,,,2019-10-15T13:20:35,true,4,,,,,KERVENO,56300,NEULLIAC,,,56146,,,,,,,,,,,,,,,,,,,2019-10-12,F,,,,,41.10D,NAFRev2,N,-2.942527,48.097012,0.95,street,Kerveno 56300 Neulliac,56146_3cegxw,G,KERVENO,
319889911,00032,31988991100032,O,,NN,,,,true,1,,7,,RUE,DE KERENTREE,56300,NEULLIAC,,,56146,,,,,,,,,,,,,,,,,,,1996-06-28,F,,,,,93.0D,NAF1993,N,-2.982361,48.127906,0.95,housenumber,7 Rue de Kerentree 56300 Neulliac,56146_0069_00007,G,7 RUE DE KERENTREE,
320210412,00013,32021041200013,O,1980-11-01,NN,,4520AB,2017-07-27T19:33:05,true,5,,,,,KERLEFEN,56300,NEULLIAC,,,56146,,,,,,,,,,,,,,,,,,,2017-06-30,F,,,,,45.20A,NAFRev2,O,-2.978204,48.122737,0.95,street,Kerlefen 56300 Neulliac,56146_t8s6i8,G,KERLEFEN,
320219124,00015,32021912400015,O,1980-07-01,NN,,,,true,4,,,,,SAINT JEAN,56300,NEULLIAC,,,56146,,,,,,,,,,,,,,,,,,,2000-06-30,F,,,,,51.3A,NAF1993,O,-2.984932,48.110018,0.94,street,Saint Jean 56300 Neulliac,56146_B080,G,SAINT JEAN,
320301427,00011,32030142700011,O,,NN,,,,true,1,,1,,RUE,DE LA PAIX,56300,NEULLIAC,,,56146,,,,,,,,,,,,,,,,,,,1993-12-31,F,,,,,15.8C,NAF1993,N,-2.981205,48.128356,0.95,housenumber,1 Rue de la Paix 56300 Neulliac,56146_0095_00001,G,1 RUE DE LA PAIX,
321000507,00012,32100050700012,O,,,,,,true,1,,,,,LE PEN POULO,56300,NEULLIAC,,,56146,,,,,,,,,,,,,,,,,,,1984-12-25,F,,,,,55.72,NAP,N,-2.996566,48.15376,0.75,street,Pen Poulo 56300 Neulliac,56146_B049,G,PEN POULO,
322712654,00019,32271265400019,O,,,,,,true,1,,,,,QUILLETEN KERGOFF,56300,NEULLIAC,,,56146,,,,,,,,,,,,,,,,,,,1984-12-25,F,,,,,87.07,NAP,N,-2.968939,48.104558,0.58,street,Quilleten 56300 Neulliac,56146_0bp7wg,G,QUILLETEN,
323605238,00019,32360523800019,O,,,,,,true,1,,,,,BEL AIR,56300,NEULLIAC,,,56146,,,,,,,,,,,,,,,,,,,1985-12-25,F,,,,,55.73,NAP,N,-2.979495,48.1018,0.95,street,Bel Air 56300 Neulliac,56146_B002,G,BEL AIR,
324449776,00016,32444977600016,O,,,,,,true,1,,,,,QUILLETEN,56300,NEULLIAC,,,56146,,,,,,,,,,,,,,,,,,,1985-12-25,F,,,,,86.07,NAP,N,-2.968939,48.104558,0.94,street,Quilleten 56300 Neulliac,56146_0bp7wg,G,QUILLETEN,
324910736,00028,32491073600028,O,,NN,,,,true,1,,8,,CHE,DE LA RABINE,56300,NEULLIAC,,,56146,,,,,,,,,,,,,,,,,,,1991-03-30,F,,,,,55.73,NAP,N,-2.983323,48.132873,0.85,housenumber,8 Chemin de la Rabine 56300 Neulliac,56146_0111_00008,G,8 CHEMIN DE LA RABINE,
325351807,00012,32535180700012,O,,,,,,true,1,,,,,AUQUIGNAN,56300,NEULLIAC,,,56146,,,,,,,,,,,,,,,,,,,1984-12-25,F,,,,,55.50,NAP,N,-3.00128,48.131143,0.95,street,Auquignan 56300 Neulliac,56146_d2i0lz,G,AUQUIGNAN,
327303590,00019,32730359000019,O,,NN,,,,true,1,,,,CHE,DU GOLUT,56300,NEULLIAC,,,56146,,,,,,,,,,,,,,,,,,,1988-10-28,F,,,,,69.12,NAP,N,-2.959729,48.124617,0.47,street,Le Golut 56300 Neulliac,56146_f9m84w,G,LE GOLUT,
327552485,00010,32755248500010,O,,,,,,true,1,,,,,PEM FAVEM,56300,NEULLIAC,,,56146,,,,,,,,,,,,,,,,,,,1997-09-30,F,,,,,70.2C,NAF1993,N,-2.952431,48.098427,0.42,street,Penfaven 56300 Neulliac,56146_v3vdjt,G,PENFAVEN,
327613964,00037,32761396400037,O,1990-03-01,NN,,,2019-01-03T08:34:06,true,6,,6,,RUE,DE LA PAIX,56300,NEULLIAC,,,56146,,,,,,,,,,,,,,,,,,,2018-12-31,F,,,,,86.21Z,NAFRev2,N,-2.981327,48.127431,0.95,housenumber,6 Rue de la Paix 56300 Neulliac,56146_0095_00006,G,6 RUE DE LA PAIX,
328371760,00013,32837176000013,O,,NN,,,,true,1,,,,,LE ROZ,56300,NEULLIAC,,,56146,,,,,,,,,,,,,,,,,,,,F,,,,,60.10,NAP,N,-2.938324,48.103004,0.95,street,Le Roz 56300 Neulliac,56146_mpo4r7,G,LE ROZ,
329975320,00014,32997532000014,O,1984-06-01,NN,,,2018-09-29T12:25:29,true,4,,,,,LE PERZO,56300,NEULLIAC,,,56146,,,,,,,,,,,,,,,,,,,2017-02-26,F,,,,,01.11Z,NAFRev2,N,-2.991173,48.145358,0.95,street,Le Perzo 56300 Neulliac,56146_r0w56x,G,LE PERZO,
330142381,00012,33014238100012,O,1984-06-01,NN,,,2015-05-19T11:34:34,true,2,LOTISSEMENT DE KERRECH,,,,ST JEAN,56300,NEULLIAC,,,56146,,,,,,,,,,,,,,,,,,,1998-03-31,F,,,,,,,,-2.984932,48.110018,0.7,street,Saint Jean 56300 Neulliac,56146_B080,G,SAINT JEAN,
330512724,00031,33051272400031,O,1997-08-06,,,,2011-04-28T00:25:45,false,3,,,,,PENHOUET MARO,56300,NEULLIAC,,,56146,,,,,,,,,,,,,,,,,,,1998-05-22,F,,,,,,,N,-2.924955,48.11836,0.61,street,Penhouet d’En Haut 56300 Neulliac,56146_B052,G,PENHOUET D EN HAUT,
330521261,00058,33052126100058,O,1999-02-25,NN,,,2014-10-24T08:37:30,true,5,,,,,PENFAVEN,56300,NEULLIAC,,,56146,,,,,,,,,,,,,,,,,,,2014-10-22,F,,,,,96.09Z,NAFRev2,N,-2.952431,48.098427,0.95,street,Penfaven 56300 Neulliac,56146_v3vdjt,G,PENFAVEN,
331041954,00016,33104195400016,O,1984-09-29,NN,,,,true,1,,,,LD,DEUX CROIX,56300,NEULLIAC,,,56146,,,,,,,,,,,,,,,,,,,2000-12-31,F,,,,,01.1A,NAF1993,N,-2.98521,48.129143,0.93,street,Les Deux Croix 56300 Neulliac,56146_B015,G,LES DEUX CROIX,
331512921,00015,33151292100015,O,1985-01-04,NN,,,,true,1,,22,,LD,BELLEVUE,56300,NEULLIAC,,,56146,,,,,,,,,,,,,,,,,,,1999-03-31,F,,,,,20.5A,NAF1993,N,-2.988622,48.135434,0.87,housenumber,22 Rue de Bellevue 56300 Neulliac,56146_0018_00022,G,22 RUE DE BELLEVUE,
331586271,00032,33158627100032,O,1997-01-18,NN,,,2015-02-19T09:06:00,false,3,,,,,PENHOUET MARO,56300,NEULLIAC,,,56146,,,,,,,,,,,,,,,,,,,2004-12-31,F,,,,,45.4J,NAFRev1,O,-2.924955,48.11836,0.61,street,Penhouet d’En Haut 56300 Neulliac,56146_B052,G,PENHOUET D EN HAUT,
332003938,00013,33200393800013,O,1985-03-01,NN,,,2008-01-04T20:20:14,true,3,,,,LD,GUERLEMOING,56300,NEULLIAC,,,56146,,,,,,,,,,,,,,,,,,,2008-01-01,A,,,,,01.41Z,NAFRev2,N,-2.944772,48.116608,0.94,street,Guerlemoing 56300 Neulliac,56146_xb1u19,G,GUERLEMOING,
332489632,00023,33248963200023,O,1994-05-17,01,2021,1089ZZ,2023-11-30T10:25:38,true,4,,5,,RUE,DE KERENTREE,56300,NEULLIAC,,,56146,,,,,,,,,,,,,,,,,,,2008-01-01,A,,,,,56.10A,NAFRev2,O,-2.982353,48.128157,0.95,housenumber,5 Rue de Kerentree 56300 Neulliac,56146_0069_00005,G,5 RUE DE KERENTREE,
332706449,00011,33270644900011,O,,NN,,,,true,1,,,,,LE MOUSTOIR,56300,NEULLIAC,,,56146,,,,,,,,,,,,,,,,,,,1992-03-31,F,,,,,01.4A,NAF1993,N,-3.5199584,48.2626039,0.9,poi,(Pont) Le Moustoir,https://osm.org/way/183501442,G,,
332706456,00016,33270645600016,O,,,,,,true,1,,,,LD,LE MOUSTOIR,56300,NEULLIAC,,,56146,,,,,,,,,,,,,,,,,,,1992-03-31,F,,,,,01.4A,NAF1993,N,-3.5199584,48.2626039,0.9,poi,(Pont) Le Moustoir,https://osm.org/way/183501442,G,,
333154409,00010,33315440900010,O,,NN,,,,true,1,,,,LD,GUERLEMOING,56300,NEULLIAC,,,56146,,,,,,,,,,,,,,,,,,,1988-12-31,F,,,,,70.2C,NAF1993,N,-2.944772,48.116608,0.94,street,Guerlemoing 56300 Neulliac,56146_xb1u19,G,GUERLEMOING,
333289346,00012,33328934600012,O,,NN,,,,true,1,,,,LD,LE MOUSTOIR,56300,NEULLIAC,,,56146,,,,,,,,,,,,,,,,,,,1992-03-31,F,,,,,01.4A,NAF1993,N,-3.5199584,48.2626039,0.9,poi,(Pont) Le Moustoir,https://osm.org/way/183501442,G,,
333476273,00011,33347627300011,O,1985-07-01,NN,,,2008-01-04T20:39:36,true,3,,,,LD,AUQUIGNAN,56300,NEULLIAC,,,56146,,,,,,,,,,,,,,,,,,,2008-01-01,A,,,,,01.13Z,NAFRev2,N,-3.00128,48.131143,0.95,street,Auquignan 56300 Neulliac,56146_d2i0lz,G,AUQUIGNAN,
334283462,00011,33428346200011,O,1985-07-01,NN,,,2013-06-11T03:48:44,true,3,,,,,PENFAVEN,56300,NEULLIAC,,,56146,,,,,,,,,,,,,,,,,,,2008-01-01,A,,,,,01.50Z,NAFRev2,N,-2.952431,48.098427,0.95,street,Penfaven 56300 Neulliac,56146_v3vdjt,G,PENFAVEN,
334747201,00013,33474720100013,O,,,,,,true,1,,,,LD,LE MOUSTOIR,56300,NEULLIAC,,,56146,,,,,,,,,,,,,,,,,,,1992-04-09,F,,,,,01.4A,NAF1993,N,-3.5199584,48.2626039,0.9,poi,(Pont) Le Moustoir,https://osm.org/way/183501442,G,,
334890183,00018,33489018300018,O,1986-01-01,NN,,,2008-01-04T20:55:52,true,3,,,,LD,KERYVON,56300,NEULLIAC,,,56146,,,,,,,,,,,,,,,,,,,2008-01-01,A,,,,,01.41Z,NAFRev2,N,-2.981824,48.146453,0.7,street,Ker Yvon 56300 Neulliac,56146_B078,G,KER YVON,
334890191,00011,33489019100011,O,1986-01-01,NN,,,2023-01-19T03:41:12,true,4,,,,LD,GUERLONAY,56300,NEULLIAC,,,56146,,,,,,,,,,,,,,,,,,,2022-12-31,F,,,,,01.11Z,NAFRev2,N,,,0,,,,,,
337863245,00011,33786324500011,O,1986-05-09,NN,,,2014-03-17T03:33:22,true,5,,,,PL,DE L EGLISE,56300,NEULLIAC,,,56146,,,,,,,,,,,,,,,,,,,2010-05-13,F,,,,,47.73Z,NAFRev2,O,-2.98226,48.128909,0.82,street,Place de l'Église 56300 Neulliac,56146_9jxahh,G,PLACE DE L EGLISE,
337935217,00014,33793521700014,O,1986-02-01,NN,,,,true,1,,,,,LE GOLUT,56300,NEULLIAC,,,56146,,,,,,,,,,,,,,,,,,,2002-12-31,F,,,,,01.3Z,NAF1993,N,-2.959729,48.124617,0.95,street,Le Golut 56300 Neulliac,56146_f9m84w,G,LE GOLUT,
337980163,00030,33798016300030,O,2011-04-01,,,,2012-11-28T04:54:40,true,1,,13,,RUE,DE BELLEVUE,56300,NEULLIAC,,,56146,,,,,,,,,,,,,,,,,,,2011-04-01,F,,,,,47.89Z,NAFRev2,N,-2.987694,48.134558,0.95,housenumber,13 Rue de Bellevue 56300 Neulliac,56146_0018_00013,G,13 RUE DE BELLEVUE,
338744451,00026,33874445100026,O,2021-07-01,,,,2021-09-06T10:00:49,true,1,,12,,,KERGOFF,56300,NEULLIAC,,,56146,,,,,,,,,,,,,,,,,,,2021-07-01,A,,,,,01.11Z,NAFRev2,N,-2.969212,48.100477,0.95,housenumber,12 Kergoff 56300 Neulliac,56146_d7j0xq_00012,G,12 KERGOFF,
339841918,00024,33984191800024,O,1998-01-01,,,,,true,1,,5,,RUE,DU STADE,56300,NEULLIAC,,,56146,,,,,,,,,,,,,,,,,,,2000-12-31,F,,,,,74.2C,NAF1993,N,-2.982654,48.129383,0.95,housenumber,5 Rue du Stade 56300 Neulliac,56146_0157_00005,G,5 RUE DU STADE,
339918336,00019,33991833600019,O,,NN,,,,true,1,,,,RTE,DE CAVANNE,56300,NEULLIAC,,,56146,,,,,,,,,,,,,,,,,,,1993-05-10,F,,,,,51.5F,NAF1993,N,-2.987842,48.12714,0.47,street,Cavannes 56300 Neulliac,56146_n4s4zq,G,CAVANNES,
340393800,00016,34039380000016,O,,NN,,,,true,1,,,,LD,LE STUMO,56300,NEULLIAC,,,56146,,,,,,,,,,,,,,,,,,,1992-03-31,F,,,,,55.4B,NAF1993,N,-3.002001,48.143388,0.95,street,Le Stumo 56300 Neulliac,56146_6q5kb9,G,LE STUMO,
340458538,00014,34045853800014,O,1986-12-01,NN,,,2014-07-08T00:44:36,true,5,,,,,LE STUMO,56300,NEULLIAC,,,56146,,,,,,,,,,,,,,,,,,,2008-11-30,F,,,,,43.32A,NAFRev2,O,-3.002001,48.143388,0.95,street,Le Stumo 56300 Neulliac,56146_6q5kb9,G,LE STUMO,
341172237,00065,34117223700065,O,2016-01-12,NN,,4333ZZ,2021-10-27T08:34:10,true,1,,11,,,LE STUMO,56300,NEULLIAC,,,56146,,,,,,,,,,,,,,,,,,,2016-01-12,A,,,,,43.33Z,NAFRev2,N,-3.000816,48.142832,0.95,housenumber,11 Le Stumo 56300 Neulliac,56146_6q5kb9_00011,G,11 LE STUMO,
341192227,00476,34119222700476,O,2018-07-23,,,,2018-08-25T03:58:44,false,1,,,,,KERGOUET PA DU PONT ST CARADEC,56300,NEULLIAC,,,56146,,,,,,,,,,,,,,,,,,,2018-07-23,A,BOISSONS NEUILLIAC,,,ITM ALIMENTAIRE INTERNATIONAL,46.39B,NAFRev2,N,-2.921058,48.109045,0.48,street,Pont Saint Caradec 56300 Neulliac,56146_B059,G,PONT SAINT CARADEC,
341528339,00011,34152833900011,O,,NN,,,2010-04-18T04:54:24,true,1,,,,,LE GREVEL,56300,NEULLIAC,,,56146,,,,,,,,,,,,,,,,,,,1992-11-20,F,,,,,01.2A,NAF1993,N,-2.99071,48.102354,0.95,street,Le Grevel 56300 Neulliac,56146_9aqlgw,G,LE GREVEL,
342273539,00029,34227353900029,O,2015-10-01,,,,2021-02-23T10:57:49,true,1,,,,,KERVEGANT,56300,NEULLIAC,,,56146,,,,,,,,,,,,,,,,,,,2015-10-01,A,,,,,68.20B,NAFRev2,N,-2.949071,48.098958,0.95,street,Kervegant 56300 Neulliac,56146_2mo4ax,G,KERVEGANT,
342817822,00014,34281782200014,O,,NN,,,,true,1,,,,,PENHOET D EN HAUT,56300,NEULLIAC,,,56146,,,,,,,,,,,,,,,,,,,1990-12-31,F,,,,,01.07,NAP,N,-2.924955,48.11836,0.84,street,Penhouet d’En Haut 56300 Neulliac,56146_B052,G,PENHOUET D EN HAUT,
342871514,00028,34287151400028,O,1989-08-01,NN,,,,true,4,,,,,Z A BEL AIR ST ELOI,56300,NEULLIAC,,,56146,,,,,,,,,,,,,,,,,,,2003-12-23,F,,,,,28.6C,NAFRev1,O,-2.980989,48.100395,0.7,street,Parc d’Activites St Eloi Bel Air 56300 Neulliac,56146_o9c7io,G,PARC D ACTIVITES ST ELOI BEL AIR,
343409322,00017,34340932200017,O,1988-01-01,00,2021,,2023-11-30T10:28:32,true,5,,,,LD,KERVENO,56300,NEULLIAC,,,56146,,,,,,,,,,,,,,,,,,,2013-01-01,A,,,,,55.20Z,NAFRev2,O,-2.942527,48.097012,0.95,street,Kerveno 56300 Neulliac,56146_3cegxw,G,KERVENO,
344188230,00017,34418823000017,O,,NN,,,,true,1,,,,,COH CARMES,56300,NEULLIAC,,,56146,,,,,,,,,,,,,,,,,,,1995-02-28,F,,,,,01.1A,NAF1993,N,-3.004538,48.151274,0.95,street,Coh Carmes 56300 Neulliac,56146_B014,G,COH CARMES,
344519798,00013,34451979800013,O,1988-03-24,NN,,,2006-10-27T03:28:13,true,3,,,,LD,CARMES,56300,NEULLIAC,,,56146,,,,,,,,,,,,,,,,,,,2005-11-26,F,,,,,01.3Z,NAFRev1,N,-2.989512,48.112126,0.95,street,Carmes 56300 Neulliac,56146_n3a82t,G,CARMES,
344552849,00012,34455284900012,O,1988-03-01,NN,,,2023-01-24T03:52:00,true,4,,,,LD,AUQUIGNON,56300,NEULLIAC,,,56146,,,,,,,,,,,,,,,,,,,2022-12-31,F,,,,,01.11Z,NAFRev2,N,-3.00128,48.131143,0.67,street,Auquignan 56300 Neulliac,56146_d2i0lz,G,AUQUIGNAN,
344810932,00014,34481093200014,O,,NN,,,,true,1,,,,,KERGICQUEL,56300,NEULLIAC,,,56146,,,,,,,,,,,,,,,,,,,1992-06-25,F,,,,,01.3Z,NAF1993,N,-3.003761,48.15654,0.94,street,Kergicquel 56300 Neulliac,56146_iawpzo,G,KERGICQUEL,
344832365,00011,34483236500011,O,,NN,,,,true,1,,,,,BOLUMET,56300,NEULLIAC,,,56146,,,,,,,,,,,,,,,,,,,1989-02-28,F,,,,,01.1A,NAF1993,N,-2.952761,48.112984,0.95,street,Bolumet 56300 Neulliac,56146_zdsedn,G,BOLUMET,
344866546,00023,34486654600023,O,2005-11-24,,,,2021-02-23T10:59:48,true,4,,,,,PEN POULO,56300,NEULLIAC,,,56146,,,,,,,,,,,,,,,,,,,2010-01-15,A,,,,,43.34Z,NAFRev2,N,-2.996566,48.15376,0.94,street,Pen Poulo 56300 Neulliac,56146_B049,G,PEN POULO,
345265490,00044,34526549000044,O,2010-02-01,,,,2021-02-23T11:00:09,true,3,,,,,LE MOUSTOIR,56300,NEULLIAC,,,56146,,,,,,,,,,,,,,,,,,,2015-10-19,A,,,,,68.20A,NAFRev2,N,-3.5199584,48.2626039,0.9,poi,(Pont) Le Moustoir,https://osm.org/way/183501442,G,,
345366660,00016,34536666000016,O,1988-06-01,,,,2008-11-08T00:20:58,false,3,,1,,RUE,DU STADE,56300,NEULLIAC,,,56146,,,,,,,,,,,,,,,,,,,1993-10-31,F,,,,,15.8C,NAF1993,,-2.98251,48.129196,0.95,housenumber,1 Rue du Stade 56300 Neulliac,56146_0157_00001,G,1 RUE DU STADE,
348309188,00012,34830918800012,O,1988-10-01,NN,,,2009-03-11T04:18:49,true,5,,,,,LE MOUSTOIR,56300,NEULLIAC,,,56146,,,,,,,,,,,,,,,,,,,2009-02-28,F,,,,,01.41Z,NAFRev2,N,-3.5199584,48.2626039,0.9,poi,(Pont) Le Moustoir,https://osm.org/way/183501442,G,,
349067033,00010,34906703300010,O,,NN,,,,true,1,,,,,COH CARMESSE,56300,NEULLIAC,,,56146,,,,,,,,,,,,,,,,,,,1992-12-31,F,,,,,01.2A,NAF1993,N,-3.004538,48.151274,0.75,street,Coh Carmes 56300 Neulliac,56146_B014,G,COH CARMES,
349457259,00019,34945725900019,O,1989-01-09,NN,,,2020-02-19T03:52:46,true,4,,,,,ST ELOI,56300,NEULLIAC,,,56146,,,,,,,,,,,,,,,,,,,2020-01-31,F,,,,,68.20B,NAFRev2,N,-2.980989,48.100395,0.91,street,Parc d’Activites St Eloi Bel Air 56300 Neulliac,56146_o9c7io,G,PARC D ACTIVITES ST ELOI BEL AIR,
351638531,00019,35163853100019,O,1989-08-21,NN,,,,true,1,,,,,BOLUMET,56300,NEULLIAC,,,56146,,,,,,,,,,,,,,,,,,,2001-08-31,F,,,,,52.6E,NAF1993,N,-2.952761,48.112984,0.95,street,Bolumet 56300 Neulliac,56146_zdsedn,G,BOLUMET,
351956446,00014,35195644600014,O,1989-05-24,NN,,,,true,1,,,,RTE,DE CAVANNE,56300,NEULLIAC,,,56146,,,,,,,,,,,,,,,,,,,1998-12-24,F,,,,,70.2C,NAF1993,N,-2.987842,48.12714,0.47,street,Cavannes 56300 Neulliac,56146_n4s4zq,G,CAVANNES,
351960521,00026,35196052100026,O,1990-04-01,NN,,,,false,4,,,,,KERVENO,56300,NEULLIAC,,,56146,,,,,,,,,,,,,,,,,,,1998-09-01,F,,,,,85.1C,NAF1993,N,-2.942527,48.097012,0.95,street,Kerveno 56300 Neulliac,56146_3cegxw,G,KERVENO,
352026132,00014,35202613200014,O,,NN,,,,true,1,,,,,KERRECH,56300,NEULLIAC,,,56146,,,,,,,,,,,,,,,,,,,1990-03-25,F,,,,,60.09,NAP,N,-2.987008,48.105518,0.95,street,Kerrech 56300 Neulliac,56146_h3ne8v,G,KERRECH,
352026934,00013,35202693400013,O,1989-07-19,NN,,,2023-02-08T08:39:19,true,3,NEULLIAC,,,,ST JEAN,56300,NEULLIAC,,,56146,,,,,,,,,,,,,,,,,,,2008-01-01,A,,,,,68.20B,NAFRev2,N,-2.984932,48.110018,0.7,street,Saint Jean 56300 Neulliac,56146_B080,G,SAINT JEAN,
353110927,00020,35311092700020,O,1989-12-07,,,,,false,3,,,,,BOLUMET,56300,NEULLIAC,,,56146,,,,,,,,,,,,,,,,,,,1999-01-31,F,,,,,01.2E,NAF1993,N,-2.952761,48.112984,0.95,street,Bolumet 56300 Neulliac,56146_zdsedn,G,BOLUMET,