siren,nic,siret,statutDiffusionEtablissement,dateCreationEtablissement,trancheEffectifsEtablissement,anneeEffectifsEtablissement,activitePrincipaleRegistreMetiersEtablissement,dateDernierTraitementEtablissement,etablissementSiege,nombrePeriodesEtablissement,complementAdresseEtablissement,numeroVoieEtablissement,indiceRepetitionEtablissement,typeVoieEtablissement,libelleVoieEtablissement,codePostalEtablissement,libelleCommuneEtablissement,libelleCommuneEtrangerEtablissement,distributionSpecialeEtablissement,codeCommuneEtablissement,codeCedexEtablissement,libelleCedexEtablissement,codePaysEtrangerEtablissement,libellePaysEtrangerEtablissement,complementAdresse2Etablissement,numeroVoie2Etablissement,indiceRepetition2Etablissement,typeVoie2Etablissement,libelleVoie2Etablissement,codePostal2Etablissement,libelleCommune2Etablissement,libelleCommuneEtranger2Etablissement,distributionSpeciale2Etablissement,codeCommune2Etablissement,codeCedex2Etablissement,libelleCedex2Etablissement,codePaysEtranger2Etablissement,libellePaysEtranger2Etablissement,dateDebut,etatAdministratifEtablissement,enseigne1Etablissement,enseigne2Etablissement,enseigne3Etablissement,denominationUsuelleEtablissement,activitePrincipaleEtablissement,nomenclatureActivitePrincipaleEtablissement,caractereEmployeurEtablissement,longitude,latitude,geo_score,geo_type,geo_adresse,geo_id,geo_ligne,geo_l4,geo_l5
215801549,00019,21580154900019,O,1983-03-01,01,2021,,2023-11-30T10:18:25,true,3,,,,,,58190,LA MAISON-DIEU,,,58154,,,,,,,,,,,,,,,,,,,2008-01-01,A,MAIRIE,,,,84.11Z,NAFRev2,O,,,0,,,,,,
215801549,00035,21580154900035,O,1996-12-25,NN,,,2019-11-14T14:00:46,false,2,MAIRIE,,,,BOURG,58190,LA MAISON-DIEU,,,58154,,,,,,,,,,,,,,,,,,,2008-01-01,A,SERVICE EAU,,,,36.00Z,NAFRev2,N,3.646084,47.412968,0.92,street,Le Bourg 58190 La Maison-Dieu,58154_arwvpt,G,LE BOURG,
265801548,00016,26580154800016,O,1983-03-01,NN,,,2019-11-14T14:00:46,true,4,,,,,MAIRIE,58190,LA MAISON-DIEU,,,58154,,,,,,,,,,,,,,,,,,,2017-08-01,F,CCAS,,,,88.99B,NAFRev2,N,3.649125,47.414188,0.38,street,Route de Chamoux 58190 La Maison-Dieu,58154_0054,G,ROUTE DE CHAMOUX,
275801439,00017,27580143900017,O,,,,,2019-11-14T14:00:46,true,1,,,,,MAIRIE,58190,LA MAISON-DIEU,,,58154,,,,,,,,,,,,,,,,,,,1995-12-25,F,,,,,41.0Z,NAF1993,N,3.649125,47.414188,0.38,street,Route de Chamoux 58190 La Maison-Dieu,58154_0054,G,ROUTE DE CHAMOUX,
295801542,00016,29580154200016,O,,NN,,,2019-11-14T14:00:46,true,1,,,,,MAIRIE,58190,LA MAISON-DIEU,,,58154,,,,,,,,,,,,,,,,,,,1991-12-26,F,,,,,70.1C,NAF1993,N,3.649125,47.414188,0.38,street,Route de Chamoux 58190 La Maison-Dieu,58154_0054,G,ROUTE DE CHAMOUX,
301635686,00043,30163568600043,O,1988-07-15,NN,,,2019-11-14T14:00:46,false,3,,,,,,58190,LA MAISON-DIEU,,,58154,,,,,,,,,,,,,,,,,,,2007-12-31,F,,,,,70.2C,NAFRev1,N,,,0,,,,,,
301635686,00050,30163568600050,O,2007-01-22,,,,2019-11-14T14:00:46,true,2,,,,,LA POTERNE,58190,LA MAISON-DIEU,,,58154,,,,,,,,,,,,,,,,,,,2007-12-31,F,,,,,52.6H,NAFRev1,N,3.646861,47.414067,0.92,street,Rue de la Poterne 58190 La Maison-Dieu,58154_0220,G,RUE DE LA POTERNE,
302390760,00023,30239076000023,O,1990-10-02,NN,,1101ZQ,2019-11-14T14:00:46,true,3,,,,,,58190,LA MAISON-DIEU,,,58154,,,,,,,,,,,,,,,,,,,2008-01-01,A,,,,,11.01Z,NAFRev2,N,,,0,,,,,,
306081449,00010,30608144900010,O,1900-01-01,NN,,,2022-02-22T04:00:32,true,4,,,,,,58190,LA MAISON-DIEU,,,58154,,,,,,,,,,,,,,,,,,,2022-01-01,A,,,,,01.45Z,NAFRev2,N,,,0,,,,,,
315638106,00015,31563810600015,O,1979-01-01,NN,,,2019-11-14T14:00:46,true,4,,,,,,58190,LA MAISON-DIEU,,,58154,,,,,,,,,,,,,,,,,,,2019-06-26,F,,,,,68.20B,NAFRev2,N,,,0,,,,,,
328197728,00012,32819772800012,O,,NN,,,2019-11-14T14:00:46,true,1,,,,,LE BOURG,58190,LA MAISON-DIEU,,,58154,,,,,,,,,,,,,,,,,,,1991-09-30,F,,,,,62.11,NAP,N,3.646084,47.412968,0.94,street,Le Bourg 58190 La Maison-Dieu,58154_arwvpt,G,LE BOURG,
332797984,00017,33279798400017,O,1985-01-01,NN,,,2019-11-14T14:00:46,true,4,,,,,,58190,LA MAISON-DIEU,,,58154,,,,,,,,,,,,,,,,,,,2009-01-01,F,,,,,01.11Z,NAFRev2,N,,,0,,,,,,
339736902,00042,33973690200042,P,1998-04-01,NN,,,2019-11-14T14:00:46,false,4,[ND],[ND],[ND],[ND],[ND],[ND],LA MAISON-DIEU,,[ND],58154,[ND],[ND],,,[ND],[ND],[ND],[ND],[ND],[ND],,,[ND],,[ND],[ND],,,2001-08-01,F,[ND],[ND],[ND],[ND],01.4B,NAF1993,N,,,0,,,,,,
347811507,00016,34781150700016,O,,NN,,,2019-11-14T14:00:46,true,1,,,,,,58190,LA MAISON-DIEU,,,58154,,,,,,,,,,,,,,,,,,,1989-06-30,F,,,,,55.71,NAP,N,,,0,,,,,,
348731910,00025,34873191000025,O,1988-05-01,NN,,,2019-11-14T14:00:46,false,4,,,,,,58190,LA MAISON-DIEU,,,58154,,,,,,,,,,,,,,,,,,,2017-09-19,F,,,,,47.24Z,NAFRev2,N,,,0,,,,,,
353261456,00019,35326145600019,O,1990-01-01,NN,,,2019-11-14T14:00:46,true,3,,,,,,58190,LA MAISON-DIEU,,,58154,,,,,,,,,,,,,,,,,,,2008-01-01,A,,,,,01.50Z,NAFRev2,N,,,0,,,,,,
353297492,00012,35329749200012,O,1990-01-01,NN,,,2020-07-04T04:05:21,true,4,,,,,,58190,LA MAISON-DIEU,,,58154,,,,,,,,,,,,,,,,,,,2008-12-31,F,,,,,01.42Z,NAFRev2,N,,,0,,,,,,
353379514,00022,35337951400022,O,1987-12-31,NN,,,2019-11-14T14:00:46,true,4,,,,,AU BOURG,58190,LA MAISON-DIEU,,,58154,,,,,,,,,,,,,,,,,,,2005-01-06,F,,,,,01.2A,NAFRev1,N,3.646084,47.412968,0.61,street,Le Bourg 58190 La Maison-Dieu,58154_arwvpt,G,LE BOURG,
353680101,00014,35368010100014,O,1990-02-12,NN,,,2019-11-14T14:00:46,true,1,,,,,,58190,LA MAISON-DIEU,,,58154,,,,,,,,,,,,,,,,,,,1998-10-06,F,,,,,45.2V,NAF1993,N,,,0,,,,,,
379793763,00028,37979376300028,O,1993-11-22,NN,,,2019-11-14T14:00:46,false,4,,,,,LE BOURG,58190,LA MAISON-DIEU,,,58154,,,,,,,,,,,,,,,,,,,2002-09-30,F,,,,,55.4B,NAF1993,N,3.646084,47.412968,0.94,street,Le Bourg 58190 La Maison-Dieu,58154_arwvpt,G,LE BOURG,
381619071,00016,38161907100016,O,,,,,2019-11-14T14:00:46,true,1,,,,,LE BOURG,58190,LA MAISON-DIEU,,,58154,,,,,,,,,,,,,,,,,,,1992-12-31,F,,,,,45.1A,NAF1993,N,3.646084,47.412968,0.94,street,Le Bourg 58190 La Maison-Dieu,58154_arwvpt,G,LE BOURG,
381867324,00018,38186732400018,O,1991-04-02,NN,,,2019-11-14T14:00:46,false,4,,,,,,58190,LA MAISON-DIEU,,,58154,,,,,,,,,,,,,,,,,,,2004-07-31,F,,,,,74.7Z,NAFRev1,O,,,0,,,,,,
384360343,00014,38436034300014,O,1992-02-10,NN,,,2019-11-14T14:00:46,false,3,RATTACHEMENT MAIRIE,,,PL,DE L'HOTEL DE VILLE,58190,LA MAISON-DIEU,,,58154,,,,,,,,,,,,,,,,,,,1996-12-31,F,,,,,52.6E,NAF1993,N,3.644307,47.413091,0.35,street,Rue de la Treille 58190 La Maison-Dieu,58154_0260,G,RUE DE LA TREILLE,
388838682,00010,38883868200010,O,1992-07-01,NN,,,2019-11-14T14:00:46,false,3,,,,,,58190,LA MAISON-DIEU,,,58154,,,,,,,,,,,,,,,,,,,1993-12-31,F,,,,,01.4A,NAF1993,N,,,0,,,,,,
393250907,00010,39325090700010,O,,,,,2019-11-14T14:00:46,true,1,,,,,LA PRESLE,58190,LA MAISON-DIEU,,,58154,,,,,,,,,,,,,,,,,,,1997-01-01,F,,,,,01.1A,NAF1993,N,3.646861,47.414067,0.38,street,Rue de la Poterne 58190 La Maison-Dieu,58154_0220,G,RUE DE LA POTERNE,
393250956,00017,39325095600017,P,1987-01-01,NN,,,2023-03-14T14:54:11,false,4,[ND],[ND],[ND],[ND],[ND],[ND],LA MAISON-DIEU,,[ND],58154,[ND],[ND],,,[ND],[ND],[ND],[ND],[ND],[ND],,,[ND],,[ND],[ND],,,2023-02-28,F,[ND],[ND],[ND],[ND],01.42Z,NAFRev2,N,,,0,,,,,,
393251004,00015,39325100400015,O,1975-01-01,NN,,,2019-11-14T14:00:46,true,1,,,,,,58190,LA MAISON-DIEU,,,58154,,,,,,,,,,,,,,,,,,,2001-06-19,F,,,,,01.1A,NAF1993,N,,,0,,,,,,
393251053,00012,39325105300012,O,1985-01-01,NN,,,2019-11-14T14:00:46,true,1,,,,,,58190,LA MAISON-DIEU,,,58154,,,,,,,,,,,,,,,,,,,1992-11-01,F,,,,,01.1A,NAF1993,N,,,0,,,,,,
409189099,00040,40918909900040,O,2010-01-01,,,,2019-11-14T14:00:46,false,2,,,,RTE,DE METZ LE COMTE,58190,LA MAISON-DIEU,,,58154,,,,,,,,,,,,,,,,,,,2013-01-01,F,,,,,70.22Z,NAFRev2,N,3.645116,47.412374,0.85,street,Route de Metz le Comte 58190 La Maison-Dieu,58154_0100,G,ROUTE DE METZ LE COMTE,
410029300,00010,41002930000010,O,,NN,,,2019-11-14T14:00:46,true,1,,,,,FORBET,58190,LA MAISON-DIEU,,,58154,,,,,,,,,,,,,,,,,,,1997-12-31,F,,,,,01.1A,NAF1993,N,3.636759,47.414283,0.93,street,Forbet 58190 La Maison-Dieu,58154_qlh8gb,G,FORBET,
418012902,00015,41801290200015,O,1997-01-02,NN,,,2019-11-14T14:00:46,true,3,,,,,LA PRESLE,58190,LA MAISON-DIEU,,,58154,,,,,,,,,,,,,,,,,,,2005-11-01,F,,,,,01.1A,NAFRev1,N,3.646861,47.414067,0.38,street,Rue de la Poterne 58190 La Maison-Dieu,58154_0220,G,RUE DE LA POTERNE,
418213757,00010,41821375700010,O,1998-02-15,NN,,,2019-11-14T14:00:46,true,3,,,,,,58190,LA MAISON-DIEU,,,58154,,,,,,,,,,,,,,,,,,,2008-01-01,A,,,,,90.03A,NAFRev2,N,,,0,,,,,,
423266741,00010,42326674100010,O,1999-07-01,NN,,,2019-11-14T14:00:46,true,3,,,,,DOMAINE DE FORBET,58190,LA MAISON-DIEU,,,58154,,,,,,,,,,,,,,,,,,,2008-01-01,A,,,,,01.42Z,NAFRev2,N,3.643686,47.413872,0.62,street,Route de Forbet 58190 La Maison-Dieu,58154_0070,G,ROUTE DE FORBET,
423460997,00012,42346099700012,O,1999-05-18,NN,,,2019-11-14T14:00:46,true,3,,,,,,58190,LA MAISON-DIEU,,,58154,,,,,,,,,,,,,,,,,,,2008-01-01,A,,,,,68.20B,NAFRev2,N,,,0,,,,,,
423515832,00024,42351583200024,O,2005-03-01,NN,,,2019-11-14T14:00:46,true,3,,,,RTE,DE CHAMOUX,58190,LA MAISON-DIEU,,,58154,,,,,,,,,,,,,,,,,,,2009-01-21,F,,,,,43.99C,NAFRev2,N,3.649125,47.414188,0.82,street,Route de Chamoux 58190 La Maison-Dieu,58154_0054,G,ROUTE DE CHAMOUX,
428455109,00028,42845510900028,O,2000-05-01,NN,,,2019-11-14T14:00:46,true,3,LE BOURG,,,,,58190,LA MAISON-DIEU,,,58154,,,,,,,,,,,,,,,,,,,2008-01-01,A,,,,,90.01Z,NAFRev2,N,3.646084,47.412968,0.94,street,Le Bourg 58190 La Maison-Dieu,58154_arwvpt,D,LE BOURG,
428693956,00016,42869395600016,O,1980-01-01,NN,,,2019-11-14T14:00:46,true,3,,,,,,58190,LA MAISON-DIEU,,,58154,,,,,,,,,,,,,,,,,,,2008-01-01,A,,,,,02.20Z,NAFRev2,N,,,0,,,,,,
434875142,00060,43487514200060,O,2008-06-01,,,,2019-11-14T14:00:46,false,2,,,,,BOIS DE MONSGAULT,58190,LA MAISON-DIEU,,,58154,,,,,,,,,,,,,,,,,,,2013-03-25,F,,,,,02.10Z,NAFRev2,N,,,0,,,,,,
440996858,00013,44099685800013,O,1970-05-10,NN,,,2019-11-14T14:00:46,true,4,,,,,,58190,LA MAISON-DIEU,,,58154,,,,,,,,,,,,,,,,,,,2002-10-28,F,,,,,01.2C,NAF1993,N,,,0,,,,,,
444466940,00012,44446694000012,O,2002-05-14,NN,,,2019-11-14T14:00:46,false,4,,,,RUE,DE LA TEURLEE,58190,LA MAISON-DIEU,,,58154,,,,,,,,,,,,,,,,,,,2019-08-01,F,,,,,68.20B,NAFRev2,N,3.645299,47.413204,0.93,street,Rue de la Teurlée 58190 La Maison-Dieu,58154_0250,G,RUE DE LA TEURLEE,
480007699,00014,48000769900014,O,2004-07-26,,,,2019-11-14T14:00:46,true,3,,,,RUE,DE CARROUGE,58190,LA MAISON-DIEU,,,58154,,,,,,,,,,,,,,,,,,,2008-01-01,A,,,,,01.11Z,NAFRev2,N,3.645851,47.413407,0.94,street,Rue de Carrouge 58190 La Maison-Dieu,58154_0050,G,RUE DE CARROUGE,
482615762,00010,48261576200010,O,2004-11-01,NN,,,2019-11-14T14:00:46,true,4,,,,,,58190,LA MAISON-DIEU,,,58154,,,,,,,,,,,,,,,,,,,2012-01-15,F,,,,,01.11Z,NAFRev2,N,,,0,,,,,,
494676455,00012,49467645500012,P,2007-05-01,,,,2019-11-14T14:00:46,false,3,[ND],[ND],[ND],[ND],[ND],[ND],LA MAISON-DIEU,,[ND],58154,[ND],[ND],,,[ND],[ND],[ND],[ND],[ND],[ND],,,[ND],,[ND],[ND],,,2009-12-31,F,[ND],[ND],[ND],[ND],01.49Z,NAFRev2,N,,,0,,,,,,
509162772,00016,50916277200016,O,2008-11-01,NN,,,2019-11-14T14:00:46,false,4,,,,RUE,DE LA TEURLEE,58190,LA MAISON-DIEU,,,58154,,,,,,,,,,,,,,,,,,,2019-05-20,F,,,,,71.20B,NAFRev2,N,3.645299,47.413204,0.93,street,Rue de la Teurlée 58190 La Maison-Dieu,58154_0250,G,RUE DE LA TEURLEE,
531757029,00156,53175702900156,O,2017-09-06,,,,2021-07-21T16:23:03,false,2,,,,,LES TREMBLAS,58190,LA MAISON-DIEU,,,58154,,,,,,,,,,,,,,,,,,,2021-06-16,F,,,,,43.22B,NAFRev2,N,3.646948,47.414319,0.3,street,Rue sous les Murs 58190 La Maison-Dieu,58154_0200,G,RUE SOUS LES MURS,
531757029,03895,53175702903895,O,2019-10-14,,,,2019-11-14T14:00:46,false,1,,,,LD,LES TREMBLAS,58190,LA MAISON-DIEU,,,58154,,,,,,,,,,,,,,,,,,,2019-10-14,A,,,,,35.11Z,NAFRev2,N,3.646948,47.414319,0.3,street,Rue sous les Murs 58190 La Maison-Dieu,58154_0200,G,RUE SOUS LES MURS,
532761756,00016,53276175600016,O,2011-03-18,,,,2019-11-14T14:00:46,true,1,,,,,LE BOURG,58190,LA MAISON-DIEU,,,58154,,,,,,,,,,,,,,,,,,,2011-03-18,A,,,,,43.32B,NAFRev2,N,3.646084,47.412968,0.94,street,Le Bourg 58190 La Maison-Dieu,58154_arwvpt,G,LE BOURG,
539313106,00012,53931310600012,O,2012-02-22,,,,2019-11-14T14:00:46,true,1,,,,,LE BOURG,58190,LA MAISON-DIEU,,,58154,,,,,,,,,,,,,,,,,,,2012-02-22,A,,,,,01.11Z,NAFRev2,N,3.646084,47.412968,0.94,street,Le Bourg 58190 La Maison-Dieu,58154_arwvpt,G,LE BOURG,
750401101,00522,75040110100522,O,2023-11-20,,,,2023-12-01T10:31:46,false,1,,,,LD,LES TREMBLAIS,58190,LA MAISON-DIEU,,,58154,,,,,,,,,,,,,,,,,,,2023-11-20,A,,,,,35.11Z,NAFRev2,N,3.646948,47.414319,0.35,street,Rue sous les Murs 58190 La Maison-Dieu,58154_0200,G,RUE SOUS LES MURS,
778463133,00018,77846313300018,O,,,,,2019-11-14T14:00:46,true,1,,,,,,58190,LA MAISON-DIEU,,,58154,,,,,,,,,,,,,,,,,,,1984-12-25,F,,,,,55.60,NAP,N,,,0,,,,,,
797701554,00017,79770155400017,O,2013-10-01,,,,2019-11-14T14:00:46,true,2,,,,CHE,DE FORBET,58190,LA MAISON-DIEU,,,58154,,,,,,,,,,,,,,,,,,,2014-12-01,F,,,,,45.20A,NAFRev2,N,3.643686,47.413872,0.73,street,Route de Forbet 58190 La Maison-Dieu,58154_0070,G,ROUTE DE FORBET,
799448139,00011,79944813900011,O,2013-11-25,,,,2019-11-14T14:00:46,true,1,CHEZ MADAME MARECHAL,,,RUE,DE CARROUGE,58190,LA MAISON-DIEU,,,58154,,,,,,,,,,,,,,,,,,,2013-11-25,A,,,,,95.11Z,NAFRev2,N,3.645851,47.413407,0.94,street,Rue de Carrouge 58190 La Maison-Dieu,58154_0050,G,RUE DE CARROUGE,
804836500,00020,80483650000020,O,2018-01-01,,,,2021-12-16T04:18:04,true,2,,8,,RUE,DE CARROUGE,58190,LA MAISON-DIEU,,,58154,,,,,,,,,,,,,,,,,,,2021-12-31,F,GUILLEMARD ANGELE GESTION ET TRAVAUX FORESTIERS,,,GUILLEMARD ANGELE TECHNICIEN FORESTIER ETF,02.40Z,NAFRev2,N,3.645729,47.413565,0.94,housenumber,8 Rue de Carrouge 58190 La Maison-Dieu,58154_0050_00008,G,8 RUE DE CARROUGE,
809269921,00015,80926992100015,O,2013-07-12,,,,2019-11-14T14:00:46,true,1,,,,RTE,DE CHAMOUX,58190,LA MAISON-DIEU,,,58154,,,,,,,,,,,,,,,,,,,2013-07-12,A,,,,,55.20Z,NAFRev2,N,3.649125,47.414188,0.82,street,Route de Chamoux 58190 La Maison-Dieu,58154_0054,G,ROUTE DE CHAMOUX,
813765369,00018,81376536900018,O,2014-05-18,,,,2019-11-14T14:00:46,true,1,,,,,FORBET,58190,LA MAISON-DIEU,,,58154,,,,,,,,,,,,,,,,,,,2014-05-18,A,,,,,94.99Z,NAFRev2,N,3.636759,47.414283,0.93,street,Forbet 58190 La Maison-Dieu,58154_qlh8gb,G,FORBET,
827997917,00014,82799791700014,P,2017-03-01,,,,2019-11-14T14:00:46,true,1,[ND],[ND],[ND],[ND],[ND],[ND],LA MAISON-DIEU,,[ND],58154,[ND],[ND],,,[ND],[ND],[ND],[ND],[ND],[ND],,,[ND],,[ND],[ND],,,2017-03-01,A,[ND],[ND],[ND],[ND],47.78B,NAFRev2,N,,,0,,,,,,
831086087,00465,83108608700465,O,2021-06-22,,,,2021-07-05T08:05:53,false,1,,,,,LES TREMBLAS,58190,LA MAISON-DIEU,,,58154,,,,,,,,,,,,,,,,,,,2021-06-22,A,,,,,35.11Z,NAFRev2,N,3.646948,47.414319,0.3,street,Rue sous les Murs 58190 La Maison-Dieu,58154_0200,G,RUE SOUS LES MURS,
841958408,00012,84195840800012,O,2018-09-29,,,,2019-11-14T14:00:46,true,1,,3,,RUE,DE LA TEURLEE,58190,LA MAISON-DIEU,,,58154,,,,,,,,,,,,,,,,,,,2018-09-29,A,,,,FDH CREATIONS,18.12Z,NAFRev2,N,3.644967,47.413672,0.93,housenumber,3 Rue de la Teurlée 58190 La Maison-Dieu,58154_0250_00003,G,3 RUE DE LA TEURLEE,
885610329,00017,88561032900017,O,,,,,2019-11-14T14:00:46,true,1,,,,,,58190,LA MAISON-DIEU,,,58154,,,,,,,,,,,,,,,,,,,1984-12-25,F,,,,,67.08,NAP,N,,,0,,,,,,
886210103,00018,88621010300018,O,,,,,2019-11-14T14:00:46,true,1,,,,,,58190,LA MAISON-DIEU,,,58154,,,,,,,,,,,,,,,,,,,1987-12-31,F,,,,,38.40,NAP,N,,,0,,,,,,
887110039,00013,88711003900013,O,1964-01-01,NN,,,2019-11-14T14:00:46,true,1,,,,,,58190,LA MAISON-DIEU,,,58154,,,,,,,,,,,,,,,,,,,1998-09-30,F,,,,,02.0D,NAF1993,N,,,0,,,,,,
899615504,00011,89961550400011,O,2021-05-09,,,,2021-06-02T09:30:19,true,1,LIEUDIT LES TREMBLAS,,,RTE,DE SENOSSE,58190,LA MAISON-DIEU,,,58154,,,,,,,,,,,,,,,,,,,2021-05-09,A,,,,,01.47Z,NAFRev2,N,3.651405,47.414465,0.81,street,Route de Senosse 58190 La Maison-Dieu,58154_0240,G,ROUTE DE SENOSSE,
908450232,00016,90845023200016,P,2022-01-03,,,1629ZA,2022-01-12T10:54:10,true,1,[ND],[ND],[ND],[ND],[ND],[ND],LA MAISON-DIEU,,[ND],58154,[ND],[ND],,,[ND],[ND],[ND],[ND],[ND],[ND],,,[ND],,[ND],[ND],,,2022-01-03,A,[ND],[ND],[ND],[ND],47.91A,NAFRev2,N,,,0,,,,,,
919555540,00013,91955554000013,P,2022-09-21,,,,2022-09-23T08:51:05,true,1,[ND],[ND],[ND],[ND],[ND],[ND],LA MAISON-DIEU,,[ND],58154,[ND],[ND],,,[ND],[ND],[ND],[ND],[ND],[ND],,,[ND],,[ND],[ND],,,2022-09-21,A,[ND],[ND],[ND],[ND],47.99A,NAFRev2,N,,,0,,,,,,
921515417,00100,92151541700100,O,2023-06-22,,,,2023-07-31T13:44:41,false,1,,,,LD,LES TREMBLAIS,58190,LA MAISON-DIEU,,,58154,,,,,,,,,,,,,,,,,,,2023-06-22,A,,,,,35.11Z,NAFRev2,N,3.646948,47.414319,0.35,street,Rue sous les Murs 58190 La Maison-Dieu,58154_0200,G,RUE SOUS LES MURS,
949602080,00010,94960208000010,O,2023-03-07,,,,2023-03-30T20:00:41,true,1,,,,RUE,DE LA POTERNE,58190,LA MAISON-DIEU,,,58154,,,,,,,,,,,,,,,,,,,2023-03-07,A,,,,LE P'TIT MARAICHER DU COIN,01.13Z,NAFRev2,N,3.646861,47.414067,0.94,street,Rue de la Poterne 58190 La Maison-Dieu,58154_0220,G,RUE DE LA POTERNE,
979570884,00010,97957088400010,P,2023-09-18,,,,2023-09-18T10:16:31,true,1,[ND],[ND],[ND],[ND],[ND],[ND],LA MAISON-DIEU,,[ND],58154,[ND],[ND],,,[ND],[ND],[ND],[ND],[ND],[ND],,,[ND],,[ND],[ND],,,2023-09-18,A,[ND],[ND],[ND],[ND],68.31Z,NAFRev2,N,,,0,,,,,,
980159735,00011,98015973500011,P,2023-09-01,,,,2023-10-07T14:30:20,true,1,[ND],[ND],[ND],[ND],[ND],[ND],LA MAISON-DIEU,,[ND],58154,[ND],[ND],,,[ND],[ND],[ND],[ND],[ND],[ND],,,[ND],,[ND],[ND],,,2023-09-01,A,[ND],[ND],[ND],[ND],93.29Z,NAFRev2,N,,,0,,,,,,
