siren,nic,siret,statutDiffusionEtablissement,dateCreationEtablissement,trancheEffectifsEtablissement,anneeEffectifsEtablissement,activitePrincipaleRegistreMetiersEtablissement,dateDernierTraitementEtablissement,etablissementSiege,nombrePeriodesEtablissement,complementAdresseEtablissement,numeroVoieEtablissement,indiceRepetitionEtablissement,typeVoieEtablissement,libelleVoieEtablissement,codePostalEtablissement,libelleCommuneEtablissement,libelleCommuneEtrangerEtablissement,distributionSpecialeEtablissement,codeCommuneEtablissement,codeCedexEtablissement,libelleCedexEtablissement,codePaysEtrangerEtablissement,libellePaysEtrangerEtablissement,complementAdresse2Etablissement,numeroVoie2Etablissement,indiceRepetition2Etablissement,typeVoie2Etablissement,libelleVoie2Etablissement,codePostal2Etablissement,libelleCommune2Etablissement,libelleCommuneEtranger2Etablissement,distributionSpeciale2Etablissement,codeCommune2Etablissement,codeCedex2Etablissement,libelleCedex2Etablissement,codePaysEtranger2Etablissement,libellePaysEtranger2Etablissement,dateDebut,etatAdministratifEtablissement,enseigne1Etablissement,enseigne2Etablissement,enseigne3Etablissement,denominationUsuelleEtablissement,activitePrincipaleEtablissement,nomenclatureActivitePrincipaleEtablissement,caractereEmployeurEtablissement,longitude,latitude,geo_score,geo_type,geo_adresse,geo_id,geo_ligne,geo_l4,geo_l5
216204180,00014,21620418000014,O,1983-03-01,02,2021,,2023-11-30T10:18:28,true,3,,10,,PL,DES TILLEULS,62810,HAUTEVILLE,,,62418,,,,,,,,,,,,,,,,,,,2008-01-01,A,MAIRIE,,,,84.11Z,NAFRev2,O,2.573023,50.273497,0.85,housenumber,10 Place des Tilleuls 62810 Hauteville,62418_0110_00010,G,10 PLACE DES TILLEULS,
216204180,00022,21620418000022,O,1983-12-21,01,2021,,2023-11-30T10:18:28,false,4,,,,PL,DE LA MAIRIE,62810,HAUTEVILLE,,,62418,,,,,,,,RUE,D'AVESNES LE COMTE,62810,HAUTEVILLE,,,62418,,,,,2020-12-25,A,ECOLE ELEMENTAIRE RPI 51,,,,85.20Z,NAFRev2,N,2.572508,50.273514,0.76,street,Impasse de la Mairie 62810 Hauteville,62418_0054,G,IMPASSE DE LA MAIRIE,
216204180,00030,21620418000030,O,2012-05-21,,,,2013-03-14T10:00:57,false,1,,10,,PL,DES TILLEULS,62810,HAUTEVILLE,,,62418,,,,,,,,,,,,,,,,,,,2012-05-21,F,,,,,84.11Z,NAFRev2,O,2.573023,50.273497,0.85,housenumber,10 Place des Tilleuls 62810 Hauteville,62418_0110_00010,G,10 PLACE DES TILLEULS,
266204189,00010,26620418900010,O,1983-03-01,NN,,,2022-04-12T12:54:50,true,5,MAIRIE,10,,PL,DES TILLEULS,62810,HAUTEVILLE,,,62418,,,,,,,,,,,,,,,,,,,2017-12-31,F,,,,,88.99B,NAFRev2,N,2.573023,50.273497,0.85,housenumber,10 Place des Tilleuls 62810 Hauteville,62418_0110_00010,G,10 PLACE DES TILLEULS,
266204189,00028,26620418900028,O,2012-05-21,,,,2013-03-14T10:21:36,false,1,,10,,PL,DES TILLEULS,62810,HAUTEVILLE,,,62418,,,,,,,,,,,,,,,,,,,2012-05-21,F,,,,,88.99B,NAFRev2,N,2.573023,50.273497,0.85,housenumber,10 Place des Tilleuls 62810 Hauteville,62418_0110_00010,G,10 PLACE DES TILLEULS,
304148984,00012,30414898400012,O,,,,,,true,1,,,,RUE,DE LATTRE,62810,HAUTEVILLE,,,62418,,,,,,,,,,,,,,,,,,,1984-12-25,F,,,,,62.42,NAP,N,2.573715,50.275395,0.92,street,Rue de Lattre Saint Quentin 62810 Hauteville,62418_0045,G,RUE DE LATTRE SAINT QUENTIN,
310279633,00021,31027963300021,O,1982-01-01,NN,,,2014-07-08T00:14:59,true,5,,11,,RUE,DE LATTRE,62810,HAUTEVILLE,,,62418,,,,,,,,,,,,,,,,,,,2011-12-31,F,,,,,45.20A,NAFRev2,O,2.572976,50.275227,0.92,housenumber,11 Rue de Lattre Saint Quentin 62810 Hauteville,62418_0045_00011,G,11 RUE DE LATTRE SAINT QUENTIN,
311842447,00014,31184244700014,O,1964-01-01,NN,,,,true,1,,,,PL,DE LA MAIRIE,62810,HAUTEVILLE,,,62418,,,,,,,,,,,,,,,,,,,2002-06-30,F,,,,,15.8C,NAF1993,O,2.572508,50.273514,0.76,street,Impasse de la Mairie 62810 Hauteville,62418_0054,G,IMPASSE DE LA MAIRIE,
318077633,00036,31807763300036,O,1989-05-09,NN,,,2011-04-28T00:17:09,false,4,,7,,RUE,DE FOSSEUX,62810,HAUTEVILLE,,,62418,,,,,,,,,,,,,,,,,,,1998-12-31,F,,,,,51.2E,NAF1993,O,2.572449,50.27209,0.95,housenumber,7 Rue de Fosseux 62810 Hauteville,62418_0030_00007,G,7 RUE DE FOSSEUX,
324739184,00012,32473918400012,O,,,,,,true,1,,,,RTE,DE LATTRE ST QUENTIN,62810,HAUTEVILLE,,,62418,,,,,,,,,,,,,,,,,,,1984-12-25,F,,,,,00.10,NAP,N,2.573715,50.275395,0.77,street,Rue de Lattre Saint Quentin 62810 Hauteville,62418_0045,G,RUE DE LATTRE SAINT QUENTIN,
325162469,00010,32516246900010,O,,NN,,,,true,1,,3,,RUE,DE LATTRE ST QUENTIN,62810,HAUTEVILLE,,,62418,,,,,,,,,,,,,,,,,,,1989-12-30,F,,,,,78.02,NAP,N,2.572628,50.274106,0.88,housenumber,3 Rue de Lattre Saint Quentin 62810 Hauteville,62418_0045_00003,G,3 RUE DE LATTRE SAINT QUENTIN,
332915628,00025,33291562800025,O,,NN,,,2006-11-25T10:21:07,true,1,,1,,RUE,DU FOUR,62810,HAUTEVILLE,,,62418,,,,,,,,,,,,,,,,,,,1989-06-30,F,,,,,57.02,NAP,N,2.571694,50.271705,0.94,housenumber,1 Rue du Four 62810 Hauteville,62418_0038_00001,G,1 RUE DU FOUR,
341586923,00045,34158692300045,O,2009-01-19,,,4932ZA,2019-03-28T19:35:10,true,2,,18,,RUE,DU MOULIN,62810,HAUTEVILLE,,,62418,,,,,,,,,,,,,,,,,,,2019-03-30,F,,,,,49.32Z,NAFRev2,N,2.578226,50.276174,0.94,housenumber,18 Rue du Moulin 62810 Hauteville,62418_0070_00018,G,18 RUE DU MOULIN,
343137931,00014,34313793100014,O,1987-12-14,NN,,,2008-01-04T22:11:57,true,3,,,,,,62810,HAUTEVILLE,,,62418,,,,,,,,,,,,,,,,,,,2008-01-01,A,,,,,68.20A,NAFRev2,N,,,0,,,,,,
343221933,00017,34322193300017,O,1900-01-01,NN,,,2017-12-21T13:34:58,true,5,,4,,RUE,DU PENSIONNAT,62810,HAUTEVILLE,,,62418,,,,,,,,,,,,,,,,,,,2017-10-31,F,,,,,01.11Z,NAFRev2,N,2.57206,50.273067,0.94,housenumber,4 Rue du Pensionnat 62810 Hauteville,62418_0094_00004,G,4 RUE DU PENSIONNAT,
343224622,00013,34322462200013,O,1987-10-01,NN,,,2016-12-23T03:22:40,true,4,,2,,IMP,DES QUATRES FERMES,62810,HAUTEVILLE,,,62418,,,,,,,,,,,,,,,,,,,2016-11-02,F,,,,,01.11Z,NAFRev2,N,2.571712,50.271202,0.53,housenumber,2 Impasse des 4 Fermes 62810 Hauteville,62418_0105_00002,G,2 IMPASSE DES 4 FERMES,
345348536,00011,34534853600011,O,1988-06-07,NN,,,2020-09-21T15:48:25,true,4,,,,RUE,DU FOUR,62810,HAUTEVILLE,,,62418,,,,,,,,,,,,,,,,,,,2020-09-18,F,,,,,68.20B,NAFRev2,N,2.570983,50.271639,0.94,street,Rue du Four 62810 Hauteville,62418_0038,G,RUE DU FOUR,
353385610,00012,35338561000012,O,1990-01-01,,,,2014-07-11T08:32:06,true,5,,8,,RUE,DU MOULIN,62810,HAUTEVILLE,,,62418,,,,,,,,,,,,,,,,,,,2014-07-31,F,,,,,01.47Z,NAFRev2,N,2.576411,50.274963,0.94,housenumber,8 Rue du Moulin 62810 Hauteville,62418_0070_00008,G,8 RUE DU MOULIN,
353385610,00020,35338561000020,O,1996-04-01,,,,2014-08-28T08:14:06,false,2,,10,,RUE,DU MOULIN,62810,HAUTEVILLE,,,62418,,,,,,,,,,,,,,,,,,,2014-07-31,F,,,,,55.20Z,NAFRev2,N,2.57663,50.275063,0.94,housenumber,10 Rue du Moulin 62810 Hauteville,62418_0070_00010,G,10 RUE DU MOULIN,
378050884,00014,37805088400014,O,,,,,,true,1,,7,,RES,LES CHENES,62810,HAUTEVILLE,,,62418,,,,,,,,,,,,,,,,,,,1997-12-19,F,,,,,70.3A,NAF1993,N,2.57618,50.273247,0.87,housenumber,7 Residence les Chenes 62810 Hauteville,62418_a511_00007,G,7 RESIDENCE LES CHENES,
379661085,00017,37966108500017,O,,NN,,,,true,1,,22,,RUE,DE FOSSEUX,62810,HAUTEVILLE,,,62418,,,,,,,,,,,,,,,,,,,1991-01-31,F,,,,,87.03,NAP,N,2.574173,50.269788,0.95,housenumber,22 Rue de Fosseux 62810 Hauteville,62418_0030_00022,G,22 RUE DE FOSSEUX,
381187871,00011,38118787100011,O,,,,,2006-11-25T11:33:18,true,1,,7,,RUE,DE FOSSEUX,62810,HAUTEVILLE,,,62418,,,,,,,,,,,,,,,,,,,1993-03-30,F,,,,,92.6C,NAF1993,N,2.572449,50.27209,0.95,housenumber,7 Rue de Fosseux 62810 Hauteville,62418_0030_00007,G,7 RUE DE FOSSEUX,
387855927,00027,38785592700027,O,1999-02-01,,,,,true,1,,2,,RES,CHENES,62810,HAUTEVILLE,,,62418,,,,,,,,,,,,,,,,,,,1999-11-30,F,,,,,52.6D,NAF1993,N,2.576058,50.273288,0.92,housenumber,2 Residence les Chenes 62810 Hauteville,62418_a511_00002,G,2 RESIDENCE LES CHENES,
393164801,00010,39316480100010,O,1993-10-01,NN,,,2010-04-18T06:29:40,true,4,,15,B,RUE,DE FOSSEUX,62810,HAUTEVILLE,,,62418,,,,,,,,,,,,,,,,,,,2008-01-31,F,,,,,01.50Z,NAFRev2,N,2.574245,50.269815,0.95,interpolation,15 Rue de Fosseux 62810 Hauteville,,G,13 RUE DE FOSSEUX,
393959424,00010,39395942400010,O,1994-01-19,NN,,,,false,3,,8,,RUE,DE LATTRE ST QUENTIN,62810,HAUTEVILLE,,,62418,,,,,,,,,,,,,,,,,,,2001-09-10,F,,,,,70.2A,NAF1993,N,2.573931,50.274961,0.88,housenumber,8 Rue de Lattre Saint Quentin 62810 Hauteville,62418_0045_00008,G,8 RUE DE LATTRE SAINT QUENTIN,
394420913,00037,39442091300037,O,2017-03-13,,,,2020-12-16T08:40:26,true,2,,7,,RUE,DE FOSSEUX,62810,HAUTEVILLE,,,62418,,,,,,,,,,,,,,,,,,,2018-09-30,F,ETS LEJOSNE,,,ETS LEJOSNE,96.01B,NAFRev2,O,2.572449,50.27209,0.95,housenumber,7 Rue de Fosseux 62810 Hauteville,62418_0030_00007,G,7 RUE DE FOSSEUX,
395103203,00018,39510320300018,O,1987-01-01,NN,,,2013-02-22T03:36:30,true,5,,3,,RUE,DE NOYELLE,62810,HAUTEVILLE,,,62418,,,,,,,,,,,,,,,,,,,2013-03-31,F,,,,,68.20B,NAFRev2,N,2.571668,50.274497,0.94,housenumber,3 Rue de Noyelle 62810 Hauteville,62418_0080_00003,G,3 RUE DE NOYELLE,
399919083,00010,39991908300010,O,1984-01-01,NN,,,2011-06-09T03:51:04,true,5,,1,,RUE,DU FOUR,62810,HAUTEVILLE,,,62418,,,,,,,,,,,,,,,,,,,2011-04-30,F,,,,,68.20B,NAFRev2,N,2.571694,50.271705,0.94,housenumber,1 Rue du Four 62810 Hauteville,62418_0038_00001,G,1 RUE DU FOUR,
402749923,00015,40274992300015,O,,NN,,,,true,1,,4,,RUE,NOYELLE,62810,HAUTEVILLE,,,62418,,,,,,,,,,,,,,,,,,,1997-12-31,F,,,,,92.3A,NAF1993,N,2.571763,50.274471,0.93,housenumber,4 Rue de Noyelle 62810 Hauteville,62418_0080_00004,G,4 RUE DE NOYELLE,
404254054,00012,40425405400012,O,1960-01-01,NN,,,,true,1,,1,,RUE,DE FOSSEUX,62810,HAUTEVILLE,,,62418,,,,,,,,,,,,,,,,,,,1998-12-31,F,,,,,01.3Z,NAF1993,N,2.573855,50.273203,0.95,housenumber,1 Rue de Fosseux 62810 Hauteville,62418_0030_00001,G,1 RUE DE FOSSEUX,
404254062,00023,40425406200023,O,2003-03-01,NN,,,2006-10-28T03:20:07,true,3,,2,,RUE,FOUR,62810,HAUTEVILLE,,,62418,,,,,,,,,,,,,,,,,,,2004-12-31,F,,,,,01.4D,NAFRev1,N,2.571719,50.271815,0.85,housenumber,2 Rue du Four 62810 Hauteville,62418_0038_00002,G,2 RUE DU FOUR,
414520635,00015,41452063500015,O,1997-09-01,NN,,,2006-10-28T04:19:07,false,3,,8,,RUE,DE LATTRE ST QUENTIN,62810,HAUTEVILLE,,,62418,,,,,,,,,,,,,,,,,,,2004-03-24,F,,,,,70.2C,NAFRev1,N,2.573931,50.274961,0.88,housenumber,8 Rue de Lattre Saint Quentin 62810 Hauteville,62418_0045_00008,G,8 RUE DE LATTRE SAINT QUENTIN,
414607754,00028,41460775400028,O,2014-09-03,,,,2015-10-30T09:16:11,true,2,,21,,RUE,DE FOSSEUX,62810,HAUTEVILLE,,,62418,,,,,,,,,,,,,,,,,,,2015-09-30,F,,,,,43.21A,NAFRev2,N,2.574375,50.269252,0.95,housenumber,21 Rue de Fosseux 62810 Hauteville,62418_0030_00021,G,21 RUE DE FOSSEUX,
420318396,00017,42031839600017,O,1998-10-12,,,,,false,3,,9,,RUE,DE LATTRE,62810,HAUTEVILLE,,,62418,,,,,,,,,,,,,,,,,,,1998-12-25,F,,,,,85.1G,NAF1993,N,2.573316,50.274785,0.92,housenumber,9 Rue de Lattre Saint Quentin 62810 Hauteville,62418_0045_00009,G,9 RUE DE LATTRE SAINT QUENTIN,
421502808,00031,42150280800031,O,2018-06-01,,,4789ZP,2021-02-23T11:42:50,true,1,,4,,RUE,D'ARRAS,62810,HAUTEVILLE,,,62418,,,,,,,,,,,,,,,,,,,2018-06-01,A,CHEZ OLIVE FLEURS,,,RODIER OLIVIER,47.89Z,NAFRev2,N,2.574256,50.27342,0.94,housenumber,4 Rue d'Arras 62810 Hauteville,62418_0010_00004,G,4 RUE D ARRAS,
421858093,00014,42185809300014,O,1999-01-01,NN,,,,true,3,,1,,RUE,DE FOSSEUX,62810,HAUTEVILLE,,,62418,,,,,,,,,,,,,,,,,,,2003-12-31,F,,,,,01.3Z,NAFRev1,N,2.573855,50.273203,0.95,housenumber,1 Rue de Fosseux 62810 Hauteville,62418_0030_00001,G,1 RUE DE FOSSEUX,
428315535,00016,42831553500016,O,1979-01-01,NN,,,2009-02-13T03:56:47,true,4,,,,RUE,PRINCIPALE,62810,HAUTEVILLE,,,62418,,,,,,,,,,,,,,,,,,,2008-08-15,F,,,,,96.09Z,NAFRev2,N,2.573715,50.275395,0.34,street,Rue de Lattre Saint Quentin 62810 Hauteville,62418_0045,G,RUE DE LATTRE SAINT QUENTIN,
429822091,00014,42982209100014,O,2000-03-01,NN,,,,true,4,,7,,RUE,DE FOSSEUX,62810,HAUTEVILLE,,,62418,,,,,,,,,,,,,,,,,,,2003-03-31,F,,,,,51.4S,NAFRev1,N,2.572449,50.27209,0.95,housenumber,7 Rue de Fosseux 62810 Hauteville,62418_0030_00007,G,7 RUE DE FOSSEUX,
432543841,00048,43254384100048,O,2016-08-30,,,,2021-02-23T13:13:47,true,1,,7,,RUE,DE FOSSEUX,62810,HAUTEVILLE,,,62418,,,,,,,,,,,,,,,,,,,2016-08-30,A,,,,,86.21Z,NAFRev2,N,2.572449,50.27209,0.95,housenumber,7 Rue de Fosseux 62810 Hauteville,62418_0030_00007,G,7 RUE DE FOSSEUX,
435071881,00021,43507188100021,O,2006-06-01,,,4391BZ,2017-05-04T03:46:46,false,3,,2,,RUE,DU FOUR,62810,HAUTEVILLE,,,62418,,,,,,,,,,,,,,,,,,,2015-10-14,F,,,,,43.91B,NAFRev2,O,2.571719,50.271815,0.94,housenumber,2 Rue du Four 62810 Hauteville,62418_0038_00002,G,2 RUE DU FOUR,
437994270,00019,43799427000019,O,2001-05-01,NN,,,2018-09-29T12:19:40,true,3,,1,,RUE,DU FOUR,62810,HAUTEVILLE,,,62418,,,,,,,,,,,,,,,,,,,2008-01-01,A,,,,,01.41Z,NAFRev2,N,2.571694,50.271705,0.94,housenumber,1 Rue du Four 62810 Hauteville,62418_0038_00001,G,1 RUE DU FOUR,
438479974,00018,43847997400018,O,2001-06-01,NN,,,2014-10-08T04:28:45,true,4,,3,,RUE,DE NOYELLES,62810,HAUTEVILLE,,,62418,,,,,,,,,,,,,,,,,,,2012-12-31,F,,,,,01.50Z,NAFRev2,N,2.571668,50.274497,0.84,housenumber,3 Rue de Noyelle 62810 Hauteville,62418_0080_00003,G,3 RUE DE NOYELLE,
439185844,00032,43918584400032,O,2010-10-01,,,,2021-02-23T13:19:50,true,1,,4,,IMP,DE LA MAIRIE,62810,HAUTEVILLE,,,62418,,,,,,,,,,,,,,,,,,,2010-10-01,A,,,,,86.90D,NAFRev2,N,2.572255,50.273462,0.84,housenumber,4 Impasse de la Mairie 62810 Hauteville,62418_0054_00004,G,4 IMPASSE DE LA MAIRIE,
440376036,00016,44037603600016,O,2002-01-08,NN,,4520AC,2015-03-17T01:06:29,true,3,,19,,RUE,DE LATTRE ST QUENTIN,62810,HAUTEVILLE,,,62418,,,,,,,,,,,,,,,,,,,2008-01-01,A,,,,,45.20A,NAFRev2,N,2.573886,50.276159,0.88,housenumber,19 Rue de Lattre Saint Quentin 62810 Hauteville,62418_0045_00019,G,19 RUE DE LATTRE SAINT QUENTIN,
441864261,00017,44186426100017,O,1999-10-01,NN,,,2008-01-04T21:29:23,true,3,,18,,RUE,D'ARRAS,62810,HAUTEVILLE,,,62418,,,,,,,,,,,,,,,,,,,2008-01-01,A,,,,,01.11Z,NAFRev2,N,2.577134,50.273872,0.94,housenumber,18 Rue d'Arras 62810 Hauteville,62418_0010_00018,G,18 RUE D ARRAS,
443581384,00015,44358138400015,O,2002-07-01,NN,,,2014-07-08T02:26:37,true,5,,1,,RUE,DELATTRE SAINT QUENTIN,62810,HAUTEVILLE,,,62418,,,,,,,,,,,,,,,,,,,2008-12-04,F,,,,,10.71C,NAFRev2,N,2.572861,50.273899,0.88,housenumber,1 Rue de Lattre Saint Quentin 62810 Hauteville,62418_0045_00001,G,1 RUE DE LATTRE SAINT QUENTIN,
449219500,00021,44921950000021,P,2012-05-01,,,,2021-07-14T09:31:58,true,2,[ND],[ND],[ND],[ND],[ND],[ND],HAUTEVILLE,,[ND],62418,[ND],[ND],,,[ND],[ND],[ND],[ND],[ND],[ND],,,[ND],,[ND],[ND],,,2021-02-08,A,[ND],[ND],[ND],[ND],47.99A,NAFRev2,N,,,0,,,,,,
449977636,00017,44997763600017,O,2003-05-09,NN,,,2023-05-12T03:34:22,true,3,HAUTEVILLE,19,,RUE,DE LATTRE,62810,HAUTEVILLE,,,62418,,,,,,,,,,,,,,,,,,,2008-01-01,A,,,,,68.20B,NAFRev2,N,2.573886,50.276159,0.92,housenumber,19 Rue de Lattre Saint Quentin 62810 Hauteville,62418_0045_00019,G,19 RUE DE LATTRE SAINT QUENTIN,
493578256,00015,49357825600015,O,2006-12-10,NN,,,2015-06-24T04:24:55,true,4,,10,,RUE,DU MOULIN,62810,HAUTEVILLE,,,62418,,,,,,,,,,,,,,,,,,,2014-12-30,F,,,,,70.22Z,NAFRev2,N,2.57663,50.275063,0.94,housenumber,10 Rue du Moulin 62810 Hauteville,62418_0070_00010,G,10 RUE DU MOULIN,
507865830,00016,50786583000016,O,2008-06-30,,,,2009-01-23T04:15:12,true,2,,7,,RUE,DE FOSSEUX,62810,HAUTEVILLE,,,62418,,,,,,,,,,,,,,,,,,,2008-12-31,F,,,,,01.43Z,NAFRev2,N,2.572449,50.27209,0.95,housenumber,7 Rue de Fosseux 62810 Hauteville,62418_0030_00007,G,7 RUE DE FOSSEUX,
509954574,00018,50995457400018,O,2009-01-01,,,,2016-02-02T04:02:18,false,2,,7,,RUE,DE FOSSEUX,62810,HAUTEVILLE,,,62418,,,,,,,,,,,,,,,,,,,2015-11-01,F,HARAS DU CHATEAU,,,,01.43Z,NAFRev2,N,2.572449,50.27209,0.95,housenumber,7 Rue de Fosseux 62810 Hauteville,62418_0030_00007,G,7 RUE DE FOSSEUX,
528043870,00013,52804387000013,O,2010-01-01,,,,2010-11-03T05:25:52,true,1,,,,RUE,DU PENSIONNAT,62810,HAUTEVILLE,,,62418,,,,,,,,,,,,,,,,,,,2010-01-01,A,,,,,01.49Z,NAFRev2,N,2.57201,50.273203,0.94,street,Rue du Pensionnat 62810 Hauteville,62418_0094,G,RUE DU PENSIONNAT,
529934168,00020,52993416800020,O,2014-01-14,,,,2018-06-27T19:32:22,true,2,,1,,RUE,DU PENSIONNAT,62810,HAUTEVILLE,,,62418,,,,,,,,,,,,,,,,,,,2017-03-14,F,,,,,43.22B,NAFRev2,N,2.57172,50.273667,0.94,housenumber,1 Rue du Pensionnat 62810 Hauteville,62418_0094_00001,G,1 RUE DU PENSIONNAT,
531082592,00027,53108259200027,O,2015-07-01,02,2021,4312AZ,2023-11-30T10:38:06,true,2,,4,,RUE,DU FOUR,62810,HAUTEVILLE,,,62418,,,,,,,,,,,,,,,,,,,2016-01-31,A,,,,ASSAINISSEMENT THELLIER,43.12A,NAFRev2,O,2.571024,50.272097,0.94,housenumber,4 Rue du Four 62810 Hauteville,62418_0038_00004,G,4 RUE DU FOUR,
532105533,00014,53210553300014,O,1973-05-24,NN,,,2014-06-14T08:15:45,true,2,MAIRIE,10,,PL,DES TILLEULS,62810,HAUTEVILLE,,,62418,,,,,,,,,,,,,,,,,,,2011-09-01,A,,,,,94.99Z,NAFRev2,O,2.573023,50.273497,0.85,housenumber,10 Place des Tilleuls 62810 Hauteville,62418_0110_00010,G,10 PLACE DES TILLEULS,
538421355,00032,53842135500032,O,2017-12-01,NN,,,2021-10-27T08:44:31,true,1,,3,,RUE,DU MOULIN,62810,HAUTEVILLE,,,62418,,,,,,,,,,,,,,,,,,,2017-12-01,A,,,,,71.20B,NAFRev2,O,2.575286,50.274931,0.94,housenumber,3 Rue du Moulin 62810 Hauteville,62418_0070_00003,G,3 RUE DU MOULIN,
631913407,00013,63191340700013,O,,NN,,,,true,1,,1,,RUE,DU FOUR,62810,HAUTEVILLE,,,62418,,,,,,,,,,,,,,,,,,,1989-11-17,F,,,,,81.21,NAP,N,2.571694,50.271705,0.94,housenumber,1 Rue du Four 62810 Hauteville,62418_0038_00001,G,1 RUE DU FOUR,
691920243,00017,69192024300017,O,,NN,,,,true,1,,1,,RUE,DU FOUR,62810,HAUTEVILLE,,,62418,,,,,,,,,,,,,,,,,,,1989-11-17,F,,,,,57.02,NAP,N,2.571694,50.271705,0.94,housenumber,1 Rue du Four 62810 Hauteville,62418_0038_00001,G,1 RUE DU FOUR,
711911297,00010,71191129700010,O,1971-01-01,NN,,,2008-11-08T03:16:30,true,4,,14,,RUE,D ARRAS,62810,HAUTEVILLE,,,62418,,,,,,,,,,,,,,,,,,,2008-08-31,F,,,,,47.81Z,NAFRev2,N,2.575578,50.274044,0.94,housenumber,14 Rue d'Arras 62810 Hauteville,62418_0010_00014,G,14 RUE D ARRAS,
731910360,00023,73191036000023,O,,NN,,,,true,1,,24,,RUE,DE FOSSEUX,62810,HAUTEVILLE,,,62418,,,,,,,,,,,,,,,,,,,1991-07-03,F,,,,,58.10,NAP,N,2.574214,50.269579,0.95,housenumber,24 Rue de Fosseux 62810 Hauteville,62418_0030_00024,G,24 RUE DE FOSSEUX,
751125436,00012,75112543600012,O,2012-03-01,00,2020,,2022-08-29T09:41:30,true,3,,3,,RUE,DE NOYELLE,62810,HAUTEVILLE,,,62418,,,,,,,,,,,,,,,,,,,2020-05-01,A,,,,,68.20B,NAFRev2,N,2.571668,50.274497,0.94,housenumber,3 Rue de Noyelle 62810 Hauteville,62418_0080_00003,G,3 RUE DE NOYELLE,
784008724,00014,78400872400014,O,,NN,,,,true,1,,,,,,62810,HAUTEVILLE,,,62418,,,,,,,,,,,,,,,,,,,,F,,,,,22.02,NAP,N,,,0,,,,,,
784008732,00017,78400873200017,O,,,,,,true,1,,6,,RUE,D ARRAS,62810,HAUTEVILLE,,,62418,,,,,,,,,,,,,,,,,,,,F,,,,,55.72,NAP,N,2.574385,50.273488,0.94,housenumber,6 Rue d'Arras 62810 Hauteville,62418_0010_00006,G,6 RUE D ARRAS,
784008765,00017,78400876500017,O,,,,,,true,1,,,,,,62810,HAUTEVILLE,,,62418,,,,,,,,,,,,,,,,,,,1984-12-25,F,,,,,00.98,NAP,N,,,0,,,,,,
793257809,00012,79325780900012,O,2013-05-23,,,3109BA,2017-01-09T13:37:50,true,2,,9,,RUE,DU MOULIN,62810,HAUTEVILLE,,,62418,,,,,,,,,,,,,,,,,,,2016-12-31,F,,,,,47.78C,NAFRev2,N,2.576524,50.275123,0.94,housenumber,9 Rue du Moulin 62810 Hauteville,62418_0070_00009,G,9 RUE DU MOULIN,
797599198,00018,79759919800018,O,2013-09-03,NN,,,2017-05-04T09:36:31,true,1,MAIRIE,,,RUE,D'AVESNES,62810,HAUTEVILLE,,,62418,,,,,,,,,,,,,,,,,,,2013-09-03,A,,,,,93.12Z,NAFRev2,O,2.572406,50.27384,0.92,street,Rue d'Avesnes le Comte 62810 Hauteville,62418_fcd4hg,G,RUE D AVESNES LE COMTE,
799176375,00019,79917637500019,O,2014-01-02,NN,,,2023-04-25T03:42:43,true,3,,1,,RUE,DE LATTRE SAINT QUENTIN,62810,HAUTEVILLE,,,62418,,,,,,,,,,,,,,,,,,,2017-09-06,A,AU MOULIN D'HAUTEVILLE,,,AU MOULIN D'HAUTEVILLE,10.71C,NAFRev2,N,2.572861,50.273899,0.94,housenumber,1 Rue de Lattre Saint Quentin 62810 Hauteville,62418_0045_00001,G,1 RUE DE LATTRE SAINT QUENTIN,
801803545,00012,80180354500012,O,2014-05-02,,,,2016-03-09T05:06:54,true,2,,11,,RUE,DE FOSSEUX,62810,HAUTEVILLE,,,62418,,,,,,,,,,,,,,,,,,,2016-02-04,F,MEG-ESTHETIQUE,,,BIGALION MEG-ANNE,96.02B,NAFRev2,N,2.574153,50.270264,0.95,housenumber,11 Rue de Fosseux 62810 Hauteville,62418_0030_00011,G,11 RUE DE FOSSEUX,
803436765,00017,80343676500017,O,2014-07-31,,,,2018-04-10T15:03:20,true,1,,10,,RUE,DU MOULIN,62810,HAUTEVILLE,,,62418,,,,,,,,,,,,,,,,,,,2014-07-31,A,DEBAISIEUX JEAN-MARIE,,,,01.47Z,NAFRev2,N,2.57663,50.275063,0.94,housenumber,10 Rue du Moulin 62810 Hauteville,62418_0070_00010,G,10 RUE DU MOULIN,
803436765,00025,80343676500025,O,2014-07-31,,,,2017-12-05T14:47:16,false,2,,10,,RUE,DU MOULIN,62810,HAUTEVILLE,,,62418,,,,,,,,,,,,,,,,,,,2017-09-30,F,,,,,55.20Z,NAFRev2,N,2.57663,50.275063,0.94,housenumber,10 Rue du Moulin 62810 Hauteville,62418_0070_00010,G,10 RUE DU MOULIN,
811963305,00016,81196330500016,P,2015-06-20,,,,2020-01-09T08:38:54,false,4,[ND],[ND],[ND],[ND],[ND],[ND],HAUTEVILLE,,[ND],62418,[ND],[ND],,,[ND],[ND],[ND],[ND],[ND],[ND],,,[ND],,[ND],[ND],,,2019-11-01,F,[ND],[ND],[ND],[ND],85.59B,NAFRev2,N,,,0,,,,,,
813950136,00016,81395013600016,O,2015-10-19,,,4321AB,2021-03-04T19:55:28,true,1,,21,,RUE,DE FOSSEUX,62810,HAUTEVILLE,,,62418,,,,,,,,,,,,,,,,,,,2015-10-19,A,,,,,43.21A,NAFRev2,N,2.574375,50.269252,0.95,housenumber,21 Rue de Fosseux 62810 Hauteville,62418_0030_00021,G,21 RUE DE FOSSEUX,
822397493,00013,82239749300013,O,2016-09-10,,,,2016-10-20T03:38:02,true,2,,16,,RUE,DE FOSSEUX,62810,HAUTEVILLE,,,62418,,,,,,,,,,,,,,,,,,,2016-10-14,F,,,,,53.20Z,NAFRev2,N,2.573799,50.270709,0.95,housenumber,16 Rue de Fosseux 62810 Hauteville,62418_0030_00016,G,16 RUE DE FOSSEUX,
827682667,00015,82768266700015,O,2016-11-03,,,,2023-04-26T03:34:34,true,1,,2,,IMP,DES QUATRES FERMES,62810,HAUTEVILLE,,,62418,,,,,,,,,,,,,,,,,,,2016-11-03,A,,,,,01.11Z,NAFRev2,N,2.571712,50.271202,0.53,housenumber,2 Impasse des 4 Fermes 62810 Hauteville,62418_0105_00002,G,2 IMPASSE DES 4 FERMES,
828141606,00016,82814160600016,O,2017-03-13,,,,2019-12-17T03:38:06,true,2,,25,,RUE,DE LATTRE SAINT QUENTIN,62810,HAUTEVILLE,,,62418,,,,,,,,,,,,,,,,,,,2019-09-30,F,,,,,70.22Z,NAFRev2,N,2.574179,50.27689,0.94,housenumber,25 Rue de Lattre Saint Quentin 62810 Hauteville,62418_0045_00025,G,25 RUE DE LATTRE SAINT QUENTIN,
834398935,00017,83439893500017,O,2017-12-14,,,,2023-04-22T08:38:35,true,3,,10,,RUE,DU MOULIN,62810,HAUTEVILLE,,,62418,,,,,,,,,,,,,,,,,,,2022-12-31,F,,,,LA SOLETTE ZEN,55.20Z,NAFRev2,N,2.57663,50.275063,0.94,housenumber,10 Rue du Moulin 62810 Hauteville,62418_0070_00010,G,10 RUE DU MOULIN,
837878990,00014,83787899000014,P,2018-03-02,,,2370ZZ,2018-03-06T11:04:52,true,1,[ND],[ND],[ND],[ND],[ND],[ND],HAUTEVILLE,,[ND],62418,[ND],[ND],,,[ND],[ND],[ND],[ND],[ND],[ND],,,[ND],,[ND],[ND],,,2018-03-02,A,[ND],[ND],[ND],[ND],23.70Z,NAFRev2,N,,,0,,,,,,
848917928,00014,84891792800014,O,1990-03-29,,,,2019-03-22T14:21:00,true,1,MAIRIE,10,,PL,DES TILLEULS,62810,HAUTEVILLE,,,62418,,,,,,,,,,,,,,,,,,,1990-03-29,A,,,,,94.99Z,NAFRev2,N,2.573023,50.273497,0.85,housenumber,10 Place des Tilleuls 62810 Hauteville,62418_0110_00010,G,10 PLACE DES TILLEULS,
878160522,00016,87816052200016,O,2019-10-01,01,2021,,2023-11-30T11:28:46,true,1,,3,,RUE,DE NOYELLE,62810,HAUTEVILLE,,,62418,,,,,,,,,,,,,,,,,,,2019-10-01,A,,,,,01.50Z,NAFRev2,N,2.571668,50.274497,0.94,housenumber,3 Rue de Noyelle 62810 Hauteville,62418_0080_00003,G,3 RUE DE NOYELLE,
878953744,00017,87895374400017,P,2019-08-27,,,1330ZZ,2022-02-23T14:04:20,false,2,[ND],[ND],[ND],[ND],[ND],[ND],HAUTEVILLE,,[ND],62418,[ND],[ND],,,[ND],[ND],[ND],[ND],[ND],[ND],,,[ND],,[ND],[ND],,,2021-04-01,F,[ND],[ND],[ND],[ND],13.30Z,NAFRev2,N,,,0,,,,,,
881966204,00011,88196620400011,O,2020-03-01,,,,2020-11-05T07:50:12,true,3,,13,,PL,DES TILLEULS,62810,HAUTEVILLE,,,62418,,,,,,,,,,,,,,,,,,,2020-07-16,A,,,,,47.99A,NAFRev2,N,2.573679,50.273466,0.85,housenumber,13 Place des Tilleuls 62810 Hauteville,62418_0110_00013,G,13 PLACE DES TILLEULS,