siren,nic,siret,statutDiffusionEtablissement,dateCreationEtablissement,trancheEffectifsEtablissement,anneeEffectifsEtablissement,activitePrincipaleRegistreMetiersEtablissement,dateDernierTraitementEtablissement,etablissementSiege,nombrePeriodesEtablissement,complementAdresseEtablissement,numeroVoieEtablissement,indiceRepetitionEtablissement,typeVoieEtablissement,libelleVoieEtablissement,codePostalEtablissement,libelleCommuneEtablissement,libelleCommuneEtrangerEtablissement,distributionSpecialeEtablissement,codeCommuneEtablissement,codeCedexEtablissement,libelleCedexEtablissement,codePaysEtrangerEtablissement,libellePaysEtrangerEtablissement,complementAdresse2Etablissement,numeroVoie2Etablissement,indiceRepetition2Etablissement,typeVoie2Etablissement,libelleVoie2Etablissement,codePostal2Etablissement,libelleCommune2Etablissement,libelleCommuneEtranger2Etablissement,distributionSpeciale2Etablissement,codeCommune2Etablissement,codeCedex2Etablissement,libelleCedex2Etablissement,codePaysEtranger2Etablissement,libellePaysEtranger2Etablissement,dateDebut,etatAdministratifEtablissement,enseigne1Etablissement,enseigne2Etablissement,enseigne3Etablissement,denominationUsuelleEtablissement,activitePrincipaleEtablissement,nomenclatureActivitePrincipaleEtablissement,caractereEmployeurEtablissement,longitude,latitude,geo_score,geo_type,geo_adresse,geo_id,geo_ligne,geo_l4,geo_l5
216404236,00012,21640423600012,O,1983-03-01,01,2021,,2023-11-30T10:18:30,true,4,,,,,LE BOURG,64390,ORAAS,,,64423,,,,,,,,,,,,,,,,,,,2008-02-17,A,MAIRIE,,,,84.11Z,NAFRev2,O,2.212915,47.9910304,0.9,poi.bar,Le Bourg (Bar) Ingrannes,https://osm.org/node/1718543174,G,,
216404236,00020,21640423600020,O,2019-04-10,,,,2023-06-13T09:34:32,false,1,MAIRIE,,,,LE BOURG,64390,ORAAS,,,64423,,,,,,,,,,,,,,,,,,,2019-04-10,A,PHOTOVOLTAIQUE,,,,35.11Z,NAFRev2,N,2.212915,47.9910304,0.9,poi.bar,Le Bourg (Bar) Ingrannes,https://osm.org/node/1718543174,G,,
266404045,00012,26640404500012,O,1983-03-01,NN,,,,true,1,,,,,,64390,ORAAS,,,64423,,,,,,,,,,,,,,,,,,,2001-12-25,F,,,,,85.3K,NAF1993,N,,,0,,,,,,
296403033,00016,29640303300016,O,2000-10-02,NN,,,2008-01-04T19:07:29,true,3,MAIRIE,,,,LE BOURG,64390,ORAAS,,,64423,,,,,,,,,,,,,,,,,,,2007-12-10,F,,,,,70.1C,NAFRev1,N,2.212915,47.9910304,0.9,poi.bar,Le Bourg (Bar) Ingrannes,https://osm.org/node/1718543174,G,,
301304713,00011,30130471300011,O,1974-01-01,NN,,2341ZZ,2015-03-17T00:10:56,true,3,,,,,MAISON PARABIS,64390,ORAAS,,,64423,,,,,,,,,,,,,,,,,,,2008-01-01,A,,,,,23.41Z,NAFRev2,N,,,0,,,,,,
313777542,00017,31377754200017,O,,NN,,,,true,1,,,,,MAISON BYS,64390,ORAAS,,,64423,,,,,,,,,,,,,,,,,,,1982-10-01,F,,,,,77.10,NAP,N,,,0,,,,,,
317867034,00017,31786703400017,O,1980-01-01,NN,,,,true,1,,,,,MAIRIE,64390,ORAAS,,,64423,,,,,,,,,,,,,,,,,,,1998-06-11,F,,,,,71.3A,NAF1993,N,3.0709671,50.6304695,0.92,poi.townhall,Hôtel de Ville Lille,https://osm.org/way/40917078,G,,
322025453,00018,32202545300018,O,1981-07-06,NN,,4321AB,2020-08-25T10:29:27,false,6,,,,,,64390,ORAAS,,,64423,,,,,,,,,,,,,,,,,,,2018-09-01,F,,,,,43.21A,NAFRev2,N,,,0,,,,,,
322025453,00026,32202545300026,O,1991-11-01,NN,,,2023-01-03T09:38:52,true,4,,,,,,64390,ORAAS,,,64423,,,,,,,,,,,,,,,,,,,2022-12-31,F,,,,,01.11Z,NAFRev2,N,,,0,,,,,,
331884585,00018,33188458500018,O,1985-01-01,NN,,,2018-03-21T08:18:02,true,4,MAIS HESTIA,,,QUAI,SALINES,64390,ORAAS,,,64423,,,,,,,,,,,,,,,,,,,2015-08-31,F,,,,,68.20B,NAFRev2,N,-0.964089,43.442689,0.44,street,Chemin de la Saline 64390 Oraàs,64423_0077,G,CHEMIN DE LA SALINE,
335039913,00017,33503991300017,O,1986-04-01,NN,,,2023-07-01T11:33:08,true,3,,19,,RTE,DE SALIES,64390,ORAAS,,,64423,,,,,,,,,,,,,,,,,,,2008-01-01,A,,,,,01.41Z,NAFRev2,N,-0.973548,43.434644,0.65,street,Route de Salies de Bearn 64390 Oraàs,64423_0075,G,ROUTE DE SALIES DE BEARN,
340731538,00021,34073153800021,O,2015-07-10,,,,2021-02-23T10:56:40,true,1,MAISON BORDENAVE,28,,RTE,DE SAUVETERRE DE BEARN,64390,ORAAS,,,64423,,,,,,,,,,,,,,,,,,,2015-07-10,A,LES JARDINS DU BORDENAVE,,,,01.13Z,NAFRev2,N,-0.987368,43.43916,0.88,housenumber,28 Route de Sauveterre de Béarn 64390 Oraàs,64423_0085_00028,G,28 ROUTE DE SAUVETERRE DE BEARN,
344306956,00014,34430695600014,O,1988-01-01,NN,,,2008-01-04T22:26:05,true,3,,,,,,64390,ORAAS,,,64423,,,,,,,,,,,,,,,,,,,2008-01-01,A,,,,,01.11Z,NAFRev2,N,,,0,,,,,,
383364148,00023,38336414800023,O,2005-11-14,,,,2006-10-28T00:57:34,false,2,MAISON LALANNE,,,,,64390,ORAAS,,,64423,,,,,,,,,,,,,,,,,,,2006-08-01,F,,,,,01.2C,NAFRev1,N,,,0,,,,,,
389510264,00028,38951026400028,O,1993-03-10,NN,,,,false,3,,,,,,64390,ORAAS,,,64423,,,,,,,,,,,,,,,,,,,1996-12-25,F,,,,,01.1A,NAF1993,N,,,0,,,,,,
390201705,00014,39020170500014,O,1993-01-11,NN,,,2012-07-28T13:55:13,true,4,,,,,,64390,ORAAS,,,64423,,,,,,,,,,,,,,,,,,,2008-01-01,F,,,,,01.42Z,NAFRev2,N,,,0,,,,,,
391851706,00013,39185170600013,O,1993-01-01,NN,,,2008-01-04T23:57:50,true,3,,,,,MAISON LACROUTS,64390,ORAAS,,,64423,,,,,,,,,,,,,,,,,,,2008-01-01,A,,,,,01.42Z,NAFRev2,N,,,0,,,,,,
392086815,00017,39208681500017,O,1992-01-01,NN,,,2007-01-18T09:33:58,true,3,,,,QUA,DE PEYREDE,64390,ORAAS,,,64423,,,,,,,,,,,,,,,,,,,1998-12-25,F,,,,,01.3Z,NAF1993,N,-0.980357,43.426654,0.66,street,Chemin de Peyrede 64390 Oraàs,64423_0065,G,CHEMIN DE PEYREDE,
392092102,00012,39209210200012,O,1992-01-01,NN,,,,true,1,,,,,,64390,ORAAS,,,64423,,,,,,,,,,,,,,,,,,,1999-12-31,F,,,,,01.3Z,NAF1993,N,,,0,,,,,,
394394274,00010,39439427400010,O,1994-03-01,NN,,,2008-01-04T18:05:44,true,3,MAISON MOULIA,,,,,64390,ORAAS,,,64423,,,,,,,,,,,,,,,,,,,2008-01-01,A,,,,,01.42Z,NAFRev2,N,,,0,,,,,,
400243069,00012,40024306900012,O,1995-01-01,NN,,,2022-06-03T14:18:14,true,4,,,,,MAISON  HAU,64390,ORAAS,,,64423,,,,,,,,,,,,,,,,,,,2022-01-31,F,,,,,01.24Z,NAFRev2,N,,,0,,,,,,
411105570,00013,41110557000013,O,1990-01-01,NN,,,2016-05-20T10:20:08,false,4,LE LEU,,,,,64390,ORAAS,,,64423,,,,,,,,,,,,,,,,,,,2013-12-10,F,,,,,01.50Z,NAFRev2,N,,,0,,,,,,
411548860,00013,41154886000013,O,1979-01-01,NN,,,2006-12-14T06:01:33,true,3,,,,,,64390,ORAAS,,,64423,,,,,,,,,,,,,,,,,,,2007-01-31,F,,,,,01.3Z,NAFRev1,N,,,0,,,,,,
411923329,00014,41192332900014,O,1988-01-01,NN,,,2008-01-04T22:07:02,true,4,,,,,MAISON CAPDEVIELLE,64390,ORAAS,,,64423,,,,,,,,,,,,,,,,,,,2008-01-01,A,,,,,68.20B,NAFRev2,N,,,0,,,,,,
412006900,00010,41200690000010,O,1975-01-01,,,,,true,1,,,,,MAISON LALANNE,64390,ORAAS,,,64423,,,,,,,,,,,,,,,,,,,2000-12-31,F,,,,,01.2A,NAF1993,N,,,0,,,,,,
412662975,00017,41266297500017,O,1997-06-06,NN,,,2012-05-05T05:56:27,false,7,,,,,MAISON BYS,64390,ORAAS,,,64423,,,,,,,,,,,,,,,,,,,2010-09-20,F,,,,,66.19A,NAFRev2,O,,,0,,,,,,
417665494,00015,41766549400015,O,1997-01-01,NN,,,2008-01-04T23:08:40,true,3,,,,,,64390,ORAAS,,,64423,,,,,,,,,,,,,,,,,,,2008-01-01,A,,,,,01.11Z,NAFRev2,N,,,0,,,,,,
418085429,00011,41808542900011,O,1972-01-01,NN,,,2008-03-03T11:03:07,true,3,MAISON BONNECAZE,,,,,64390,ORAAS,,,64423,,,,,,,,,,,,,,,,,,,2007-12-24,F,,,,,01.3Z,NAFRev1,N,-0.948733,43.440293,0.6,street,Chemin Bonnecaze 64390 Oraàs,64423_0010,D,CHEMIN BONNECAZE,
419127659,00011,41912765900011,O,1997-01-01,NN,,,2008-01-04T23:31:31,true,3,,,,,,64390,ORAAS,,,64423,,,,,,,,,,,,,,,,,,,2008-01-01,A,,,,,01.11Z,NAFRev2,N,,,0,,,,,,
419197470,00018,41919747000018,O,1982-12-31,NN,,,2008-01-04T23:32:26,true,3,,,,,DUISABEAU,64390,ORAAS,,,64423,,,,,,,,,,,,,,,,,,,2008-01-01,A,,,,,01.50Z,NAFRev2,N,,,0,,,,,,
419197488,00010,41919748800010,O,1986-12-31,NN,,,2006-10-28T04:41:04,true,3,,,,,,64390,ORAAS,,,64423,,,,,,,,,,,,,,,,,,,2005-11-30,F,,,,,01.1C,NAFRev1,N,,,0,,,,,,
419197496,00013,41919749600013,O,1988-12-31,NN,,,,true,3,,,,,BONNECAZE,64390,ORAAS,,,64423,,,,,,,,,,,,,,,,,,,2003-12-31,F,,,,,01.1A,NAFRev1,N,-0.948733,43.440293,0.91,street,Chemin Bonnecaze 64390 Oraàs,64423_0010,G,CHEMIN BONNECAZE,
420349102,00012,42034910200012,O,1982-12-31,NN,,,,true,1,,,,,LAUGA,64390,ORAAS,,,64423,,,,,,,,,,,,,,,,,,,2002-11-01,F,,,,,01.1A,NAF1993,N,-0.972105,43.432793,0.91,street,Chemin de Lauga 64390 Oraàs,64423_0050,G,CHEMIN DE LAUGA,
422575761,00016,42257576100016,O,1999-03-20,NN,,,2016-06-08T08:39:42,true,4,,,,,MAISON HESTIA,64390,ORAAS,,,64423,,,,,,,,,,,,,,,,,,,2016-05-15,F,,,,,01.50Z,NAFRev2,N,,,0,,,,,,
423929827,00024,42392982700024,O,2003-06-01,NN,,,2008-01-05T00:47:09,true,4,,,,,MAISON BYS,64390,ORAAS,,,64423,,,,,,,,,,,,,,,,,,,2008-01-01,A,,,,,02.10Z,NAFRev2,N,,,0,,,,,,
423929827,00040,42392982700040,O,2006-01-01,,,,2016-01-12T00:21:11,false,2,,,,,MAISON BYS,64390,ORAAS,,,64423,,,,,,,,,,,,,,,,,,,2008-01-01,A,,,,,68.20B,NAFRev2,N,,,0,,,,,,
425112521,00025,42511252100025,O,2012-01-30,,,,2021-02-23T11:47:28,false,1,,,,,MAISON NOUTS,64390,ORAAS,,,64423,,,,,,,,,,,,,,,,,,,2012-01-30,A,,,,,47.99A,NAFRev2,N,,,0,,,,,,
425212479,00017,42521247900017,O,1969-01-01,NN,,,2008-01-05T01:14:01,true,3,,,,,MAISON MOULIA,64390,ORAAS,,,64423,,,,,,,,,,,,,,,,,,,2008-01-01,A,,,,,01.11Z,NAFRev2,N,3.3303982,46.5668517,0.77,poi.3,Maison Mantin (Patrimoine national) Moulins,https://osm.org/way/77185707,G,,
425212644,00016,42521264400016,O,1987-01-01,NN,,,2008-01-05T01:14:01,true,3,,,,,,64390,ORAAS,,,64423,,,,,,,,,,,,,,,,,,,2008-01-01,A,,,,,01.11Z,NAFRev2,N,,,0,,,,,,
428595573,00018,42859557300018,O,1993-01-01,NN,,,2023-07-03T21:04:22,true,4,,,,,,64390,ORAAS,,,64423,,,,,,,,,,,,,,,,,,,2016-12-25,F,,,,,01.11Z,NAFRev2,N,,,0,,,,,,
429313992,00019,42931399200019,O,2000-01-01,NN,,,2008-01-05T01:37:36,true,3,,,,,MAISON COUDES,64390,ORAAS,,,64423,,,,,,,,,,,,,,,,,,,2008-01-01,A,,,,,01.50Z,NAFRev2,N,3.2104248,45.6151221,0.83,poi.community_centre,Maison des Associations (Salle des fêtes) Coudes,https://osm.org/node/4970457624,G,,
433206372,00016,43320637200016,O,2001-01-01,NN,,,,true,1,,,,,MAISON LALANNE,64390,ORAAS,,,64423,,,,,,,,,,,,,,,,,,,2002-12-01,F,,,,,01.3Z,NAF1993,N,,,0,,,,,,
451269005,00018,45126900500018,O,2003-12-01,NN,,,2023-04-12T03:42:32,true,3,MAISON CAPDEVIELLE,,,,,64390,ORAAS,,,64423,,,,,,,,,,,,,,,,,,,2008-01-01,A,,,,,01.50Z,NAFRev2,N,,,0,,,,,,
452575434,00017,45257543400017,O,2004-02-13,NN,,,2008-01-05T02:46:57,true,3,BP 379,,,,LOUS PARTAGES B379,64390,ORAAS,,,64423,,,,,,,,,,,,,,,,,,,2008-01-01,A,,,,,68.10Z,NAFRev2,N,,,0,,,,,,
453768137,00060,45376813700060,O,2016-06-01,,,,2021-02-23T13:38:18,true,1,,23,,RTE,DE SAUVETERRE DE BEARN,64390,ORAAS,,,64423,,,,,,,,,,,,,,,,,,,2016-06-01,A,,,,,01.13Z,NAFRev2,N,-0.986759,43.438273,0.88,housenumber,23 Route de Sauveterre de Béarn 64390 Oraàs,64423_0085_00023,G,23 ROUTE DE SAUVETERRE DE BEARN,
483032389,00015,48303238900015,O,2005-07-01,,,,2018-02-21T04:02:25,true,3,MAISON BARTHOU,,,,,64390,ORAAS,,,64423,,,,,,,,,,,,,,,,,,,2017-12-31,F,,,,,01.11Z,NAFRev2,N,,,0,,,,,,
488370529,00015,48837052900015,O,2006-01-01,01,2021,,2023-11-30T10:28:03,true,2,MAISON BYS,,,,,64390,ORAAS,,,64423,,,,,,,,,,,,,,,,,,,2008-01-01,A,,,,,01.21Z,NAFRev2,N,,,0,,,,,,
492675335,00011,49267533500011,O,2006-11-01,NN,,,2010-04-18T12:27:17,true,3,,,,,,64390,ORAAS,,,64423,,,,,,,,,,,,,,,,,,,2008-12-31,F,,,,,01.11Z,NAFRev2,N,,,0,,,,,,
493262802,00017,49326280200017,O,2007-02-01,01,2021,,2023-11-30T10:32:31,true,2,MAISON LESTRADE,,,,,64390,ORAAS,,,64423,,,,,,,,,,,,,,,,,,,2008-01-01,A,,,,,01.50Z,NAFRev2,N,,,0,,,,,,
499250876,00012,49925087600012,O,2007-07-01,,,,2008-01-05T01:15:14,true,2,"BATIMENT A, 0, IMMEUBLE CANTOU",,,,,64390,ORAAS,,,64423,,,,,,,,,,,,,,,,,,,2008-01-01,A,,,,,68.20B,NAFRev2,N,,,0,,,,,,
502010572,00019,50201057200019,O,2007-12-25,,,,2015-03-10T08:21:37,false,2,BONNECAZE,,,,,64390,ORAAS,,,64423,,,,,,,,,,,,,,,,,,,2008-12-31,F,,,,,01.11Z,NAFRev2,N,-0.948733,43.440293,0.91,street,Chemin Bonnecaze 64390 Oraàs,64423_0010,D,CHEMIN BONNECAZE,
509840492,00011,50984049200011,O,2009-01-01,,,,2009-01-15T04:27:38,true,1,,,,,MAISON BONNECAZE,64390,ORAAS,,,64423,,,,,,,,,,,,,,,,,,,2009-01-01,A,,,,,01.11Z,NAFRev2,N,-0.948733,43.440293,0.6,street,Chemin Bonnecaze 64390 Oraàs,64423_0010,G,CHEMIN BONNECAZE,
511272106,00010,51127210600010,O,2009-01-01,NN,,,2018-09-29T12:23:27,true,2,MAISON VIELLENAVE,,,,,64390,ORAAS,,,64423,,,,,,,,,,,,,,,,,,,2013-01-06,A,VICASSIAU,,,,01.24Z,NAFRev2,O,,,0,,,,,,
518728753,00014,51872875300014,O,2009-12-01,,,,2014-06-18T09:16:45,false,2,LE BOURG,,,,MAISON POUEY,64390,ORAAS,,,64423,,,,,,,,,,,,,,,,,,,2010-08-19,F,,,,,74.10Z,NAFRev2,N,,,0,,,,,,
523246338,00017,52324633800017,O,2010-06-18,01,2021,,2023-11-30T10:33:43,true,2,,,,CHE,DU HOUR,64390,ORAAS,,,64423,,,,,,,,,,,,,,,,,,,2014-10-02,A,,,,,35.11Z,NAFRev2,O,,,0,,,,,,
523726719,00017,52372671900017,O,2010-08-07,,,4321AB,2015-03-18T01:30:21,true,2,,,,CHE,DU HOUR,64390,ORAAS,,,64423,,,,,,,,,,,,,,,,,,,2013-12-31,F,MASTER SOLAR,,,,43.21A,NAFRev2,N,,,0,,,,,,
528232051,00078,52823205100078,O,2011-08-29,,,,2014-05-23T03:58:28,false,2,,,,,LIEU-DIT MAISON LESTRADE,64390,ORAAS,,,64423,,,,,,,,,,,,,,,,,,,2014-03-07,F,,,,,35.11Z,NAFRev2,N,-0.3796308,44.1300945,0.72,poi.guest_house,Domaine de Grand Lestrat (Maison d'hôte) Lencouacq,https://osm.org/node/4502494594,G,,
532451291,00019,53245129100019,O,2011-06-01,,,,2012-11-10T03:11:47,false,2,RTE D ORAAS,,,,QUARTIER LASBORDES,64390,ORAAS,,,64423,,,,,,,,,,,,,,,,,,,2012-06-01,F,,,,SB SERVICE AUTO,45.20A,NAFRev2,N,-0.937355,43.440855,0.94,street,Quartier Lasbordes 64390 Oraàs,64423_5x5deb,G,QUARTIER LASBORDES,
533945465,00011,53394546500011,O,2011-08-06,,,,2015-01-28T03:46:45,true,2,RD 27,,,,LE BOURG,64390,ORAAS,,,64423,,,,,,,,,,,,,,,,,,,2014-12-31,F,,,,,47.89Z,NAFRev2,N,2.212915,47.9910304,0.9,poi.bar,Le Bourg (Bar) Ingrannes,https://osm.org/node/1718543174,G,,
788655256,00022,78865525600022,O,2021-07-23,,,,2021-07-28T11:31:37,true,1,,,,CHE,DU HOUR,64390,ORAAS,,,64423,,,,,,,,,,,,,,,,,,,2021-07-23,A,MAATHAI PEPINIERE,,,,01.30Z,NAFRev2,N,,,0,,,,,,
811274356,00013,81127435600013,O,2015-05-01,,,,2017-06-27T13:47:46,false,1,MAISON NOUTS,9,,CHE,DE L'EGLISE,64390,ORAAS,,,64423,,,,,,,,,,,,,,,,,,,2015-05-01,A,,,,,47.99A,NAFRev2,N,-0.988598,43.435476,0.84,housenumber,9 Chemin de l’Eglise 64390 Oraàs,64423_0025_00009,G,9 CHEMIN DE L EGLISE,
815140405,00011,81514040500011,O,2015-01-01,,,,2015-12-09T08:38:53,true,1,MAISON NOUGUE,7,,CHE,DE L'EGLISE,64390,ORAAS,,,64423,,,,,,,,,,,,,,,,,,,2015-01-01,A,,,,,55.20Z,NAFRev2,N,-0.98819,43.435013,0.84,housenumber,7 Chemin de l’Eglise 64390 Oraàs,64423_0025_00007,G,7 CHEMIN DE L EGLISE,
819798539,00014,81979853900014,O,2012-01-01,,,,2019-10-22T03:47:22,true,2,,4,,RTE,DE SAUVETERRE,64390,ORAAS,,,64423,,,,,,,,,,,,,,,,,,,2019-09-21,F,,,,,68.20A,NAFRev2,N,-0.978865,43.429073,0.85,housenumber,4 Route de Sauveterre de Béarn 64390 Oraàs,64423_0085_00004,G,4 ROUTE DE SAUVETERRE DE BEARN,
824292080,00010,82429208000010,O,2016-11-18,,,,2016-12-13T09:13:05,true,1,,9,,CHE,DE L'EGLISE,64390,ORAAS,,,64423,,,,,,,,,,,,,,,,,,,2016-11-18,A,,,,,68.20B,NAFRev2,N,-0.988598,43.435476,0.84,housenumber,9 Chemin de l’Eglise 64390 Oraàs,64423_0025_00009,G,9 CHEMIN DE L EGLISE,
842205999,00035,84220599900035,O,2022-06-01,,,,2022-06-19T03:35:40,false,1,,6,B,CHE,DE LA SALINE,64390,ORAAS,,,64423,,,,,,,,,,,,,,,,,,,2022-06-01,A,,,,,46.34Z,NAFRev2,N,-0.964089,43.442689,0.84,interpolation,6 Chemin de la Saline 64390 Oraàs,,G,4 CHEMIN DE LA SALINE,
849636402,00026,84963640200026,O,2019-12-02,,,9602AB,2021-02-12T09:06:17,false,2,,19,,CHE,DE L EGLISE,64390,ORAAS,,,64423,,,,,,,,,,,,,,,,,,,2021-01-05,F,,,,CHERRY BLOSSOMS,96.02A,NAFRev2,N,-0.988241,43.436876,0.68,street,Chemin de l’Eglise 64390 Oraàs,64423_0025,G,CHEMIN DE L EGLISE,
853213155,00015,85321315500015,O,2019-08-15,,,,2019-08-20T03:42:38,true,1,,8,,CHE,DE LA SALINE,64390,ORAAS,,,64423,,,,,,,,,,,,,,,,,,,2019-08-15,A,ECURIE DE LOUA,,,,01.43Z,NAFRev2,N,-0.964089,43.442689,0.84,housenumber,8 Chemin de la Saline 64390 Oraàs,64423_0077_00008,G,8 CHEMIN DE LA SALINE,
878972058,00019,87897205800019,O,2019-10-21,,,,2023-01-04T03:47:08,false,2,,7,,CHE,DE PEYREDE,64390,ORAAS,,,64423,,,,,,,,,,,,,,,,,,,2022-08-15,F,,,,,86.21Z,NAFRev2,N,-0.980602,43.426739,0.82,housenumber,7 Chemin de Peyrede 64390 Oraàs,64423_0065_00007,G,7 CHEMIN DE PEYREDE,
893549253,00019,89354925300019,O,2020-12-06,,,,2021-02-03T12:04:56,true,1,,2,,CHE,D ISABAU,64390,ORAAS,,,64423,,,,,,,,,,,,,,,,,,,2020-12-06,A,,,,,68.10Z,NAFRev2,N,-0.970684,43.428112,0.81,housenumber,2 Chemin d’Isabau 64390 Oraàs,64423_0040_00002,G,2 CHEMIN D ISABAU,
898221817,00015,89822181700015,P,2021-04-18,,,7420ZS,2021-04-15T08:47:24,true,1,[ND],[ND],[ND],[ND],[ND],[ND],ORAAS,,[ND],64423,[ND],[ND],,,[ND],[ND],[ND],[ND],[ND],[ND],,,[ND],,[ND],[ND],,,2021-04-18,A,[ND],[ND],[ND],[ND],74.20Z,NAFRev2,N,,,0,,,,,,
902739911,00011,90273991100011,P,2021-09-01,,,,2021-09-02T08:46:59,true,1,[ND],[ND],[ND],[ND],[ND],[ND],ORAAS,,[ND],64423,[ND],[ND],,,[ND],[ND],[ND],[ND],[ND],[ND],,,[ND],,[ND],[ND],,,2021-09-01,A,[ND],[ND],[ND],[ND],96.09Z,NAFRev2,N,,,0,,,,,,
909341711,00010,90934171100010,O,2022-02-01,,,,2022-01-20T04:20:52,true,1,,9,,CHE,DE PEYREDE,64390,ORAAS,,,64423,,,,,,,,,,,,,,,,,,,2022-02-01,A,,,,,01.24Z,NAFRev2,N,-0.981343,43.42746,0.82,housenumber,9 Chemin de Peyrede 64390 Oraàs,64423_0065_00009,G,9 CHEMIN DE PEYREDE,
918907940,00012,91890794000012,O,2022-08-25,,,,2022-09-06T08:09:24,true,1,,2,,IMP,SAUSSET ,64390,ORAAS,,,64423,,,,,,,,,,,,,,,,,,,2022-08-25,A,,,,,66.30Z,NAFRev2,N,-0.988641,43.438291,0.8,housenumber,2 Impasse Sausset 64390 Oraàs,64423_0083_00002,G,2 IMPASSE SAUSSET,
919375857,00019,91937585700019,O,2022-09-13,,,,2022-09-20T07:20:14,true,1,,2,,IMP,SAUSSET ,64390,ORAAS,,,64423,,,,,,,,,,,,,,,,,,,2022-09-13,A,,,,,68.20B,NAFRev2,N,-0.988641,43.438291,0.8,housenumber,2 Impasse Sausset 64390 Oraàs,64423_0083_00002,G,2 IMPASSE SAUSSET,
949964795,00015,94996479500015,O,2023-03-03,,,,2023-03-23T19:00:28,true,1,MAISON PRAT,488,,QUA,LASBORDES,64390,ORAAS,,,64423,,,,,,,,,,,,,,,,,,,2023-03-03,A,,,,,68.20B,NAFRev2,N,-0.931412,43.442152,0.63,street,Quartier Quartier Lasbordes 64390 Oraàs,64423_0evy0n,G,QUARTIER QUARTIER LASBORDES,
981567951,00018,98156795100018,O,2023-11-01,,,,2023-11-15T08:41:06,true,1,,5,,CHE,DE L EGLISE,64390,ORAAS,,,64423,,,,,,,,,,,,,,,,,,,2023-11-01,A,,,,JF CORROSION MANAGEMENT,71.12B,NAFRev2,N,-0.987545,43.434573,0.84,housenumber,5 Chemin de l’Eglise 64390 Oraàs,64423_0025_00005,G,5 CHEMIN DE L EGLISE,
