siren,nic,siret,statutDiffusionEtablissement,dateCreationEtablissement,trancheEffectifsEtablissement,anneeEffectifsEtablissement,activitePrincipaleRegistreMetiersEtablissement,dateDernierTraitementEtablissement,etablissementSiege,nombrePeriodesEtablissement,complementAdresseEtablissement,numeroVoieEtablissement,indiceRepetitionEtablissement,typeVoieEtablissement,libelleVoieEtablissement,codePostalEtablissement,libelleCommuneEtablissement,libelleCommuneEtrangerEtablissement,distributionSpecialeEtablissement,codeCommuneEtablissement,codeCedexEtablissement,libelleCedexEtablissement,codePaysEtrangerEtablissement,libellePaysEtrangerEtablissement,complementAdresse2Etablissement,numeroVoie2Etablissement,indiceRepetition2Etablissement,typeVoie2Etablissement,libelleVoie2Etablissement,codePostal2Etablissement,libelleCommune2Etablissement,libelleCommuneEtranger2Etablissement,distributionSpeciale2Etablissement,codeCommune2Etablissement,codeCedex2Etablissement,libelleCedex2Etablissement,codePaysEtranger2Etablissement,libellePaysEtranger2Etablissement,dateDebut,etatAdministratifEtablissement,enseigne1Etablissement,enseigne2Etablissement,enseigne3Etablissement,denominationUsuelleEtablissement,activitePrincipaleEtablissement,nomenclatureActivitePrincipaleEtablissement,caractereEmployeurEtablissement,longitude,latitude,geo_score,geo_type,geo_adresse,geo_id,geo_ligne,geo_l4,geo_l5
015650088,02523,01565008802523,O,1994-12-15,NN,,,,false,3,,,,RTE,DE STRASBOURG,67500,HAGUENAU,,,67180,,,,,,,,,,,,,,,,,,,1996-12-31,F,,,,,50.3B,NAF1993,O,7.773884,48.805415,0.87,street,Route de Strasbourg 67500 Haguenau,67180_2920,G,ROUTE DE STRASBOURG,
026980045,00020,02698004500020,O,2005-01-01,NN,,,2008-04-26T08:05:07,false,2,,12,,RUE,BRANLY,67500,HAGUENAU,,,67180,,,,,,,,,,,,,,,,,,,2006-01-09,F,,,,,25.2H,NAFRev1,O,7.808135,48.803287,0.97,housenumber,12 Rue Branly 67500 Haguenau,67180_0465_00012,G,12 RUE BRANLY,
037873726,00014,03787372600014,O,1994-12-25,NN,,,2008-04-26T08:05:28,true,3,REPR PAR MR LACOMBE J L,2,,RUE,DES LILAS,67500,HAGUENAU,,,67180,,,,,,,,,,,,,,,,,,,2008-01-01,A,,,,,81.10Z,NAFRev2,N,7.787436,48.803561,0.96,housenumber,2 Rue des Lilas 67500 Haguenau,67180_1740_00002,G,2 RUE DES LILAS,
037874633,00011,03787463300011,O,1994-12-25,NN,,,2008-04-26T08:05:28,true,3,,78,,RTE,DE STRASBOURG,67500,HAGUENAU,,,67180,,,,,,,,,,,,,,,,,,,2008-01-01,A,,,,,81.10Z,NAFRev2,N,7.769765,48.804345,0.89,housenumber,78 Route de Strasbourg 67500 Haguenau,67180_2920_00078,G,78 ROUTE DE STRASBOURG,
037874823,00018,03787482300018,O,1994-12-25,NN,,,2019-06-24T13:04:43,true,5,,5,A,RUE,DU MAL FOCH,67500,HAGUENAU,,,67180,,,,,,,,,,,,,,,,,,,2017-06-30,A,,,,,81.10Z,NAFRev2,N,7.788291,48.812486,0.91,housenumber,5a Rue du Marechal Foch 67500 Haguenau,67180_1840_00005_a,G,5A RUE DU MARECHAL FOCH,
038578860,00017,03857886000017,O,1994-12-25,NN,,,2010-04-18T03:01:24,true,3,,12,A,RUE,BUTTE URBAN,67500,HAGUENAU,,,67180,,,,,,,,,,,,,,,,,,,2008-01-01,A,,,,,81.10Z,NAFRev2,N,7.771746,48.806541,0.76,housenumber,12a Butte Urban 67500 Haguenau,67180_ftdisa_00012_a,G,12A BUTTE URBAN,
038579959,00016,03857995900016,O,1994-12-25,NN,,,2014-06-13T23:04:19,true,4,,3,,RUE,DES PREMONTRES,67500,HAGUENAU,,,67180,,,,,,,,,,,,,,,,,,,2012-12-31,A,,,,,81.10Z,NAFRev2,N,7.793616,48.819904,0.97,housenumber,3 Rue des Premontres 67500 Haguenau,67180_2430_00003,G,3 RUE DES PREMONTRES,
038579983,00016,03857998300016,O,1994-12-25,NN,,,2008-01-04T17:56:13,true,2,,12,,RUE,DES CIGALES,67500,HAGUENAU,,,67180,,,,,,,,,,,,,,,,,,,2008-01-01,A,,,,,81.10Z,NAFRev2,N,7.792526,48.806083,0.97,housenumber,12 Rue des Cigales 67500 Haguenau,67180_0710_00012,G,12 RUE DES CIGALES,
038580130,00011,03858013000011,O,1994-12-25,NN,,,2008-01-04T17:56:13,true,2,,39,,,GRAND RUE,67500,HAGUENAU,,,67180,,,,,,,,,,,,,,,,,,,2008-01-01,A,,,,,81.10Z,NAFRev2,N,7.787097,48.813139,0.98,housenumber,39 Grand Rue 67500 Haguenau,67180_1350_00039,G,39 GRAND RUE,
038580148,00013,03858014800013,O,,NN,,,,true,1,,30,,RUE,DU PREFET LEZAY MARNESIA,67500,HAGUENAU,,,67180,,,,,,,,,,,,,,,,,,,1997-12-31,F,,,,,70.3C,NAF1993,O,7.78184,48.798337,0.97,housenumber,30 Rue du Prefet Lezay Marnesia 67500 Haguenau,67180_2425_00030,G,30 RUE DU PREFET LEZAY MARNESIA,
038581443,00017,03858144300017,O,1994-12-25,NN,,,2008-01-04T17:56:13,true,3,,1,,RUE,DU BOUC,67500,HAGUENAU,,,67180,,,,,,,,,,,,,,,,,,,2008-01-01,A,,,,,81.10Z,NAFRev2,N,7.789498,48.813725,0.96,housenumber,1 Rue du Bouc 67500 Haguenau,67180_0430_00001,G,1 RUE DU BOUC,
038581450,00012,03858145000012,O,,NN,,,,true,1,,4,,CHE,DE LA RAMPE,67500,HAGUENAU,,,67180,,,,,,,,,,,,,,,,,,,1997-12-31,F,,,,,70.3C,NAF1993,O,7.782669,48.808269,0.86,housenumber,4 Chemin de la Rampe 67500 Haguenau,67180_2510_00004,G,4 CHEMIN DE LA RAMPE,
038581476,00017,03858147600017,O,1994-12-25,NN,,,2018-09-29T12:00:37,true,2,,16,,BD,NESSEL,67500,HAGUENAU,,,67180,,,,,,,,,,,,,,,,,,,2008-01-01,A,,,,,81.10Z,NAFRev2,O,7.784358,48.812471,0.81,housenumber,16 Boulevard Nessel 67500 Haguenau,67180_2080_00016,G,16 BOULEVARD NESSEL,
038581534,00013,03858153400013,O,1994-12-25,NN,,,2008-01-04T17:56:13,true,3,,7,,RUE,DU BELIER,67500,HAGUENAU,,,67180,,,,,,,,,,,,,,,,,,,2008-01-01,A,,,,,81.10Z,NAFRev2,N,7.795869,48.803344,0.96,housenumber,7 Rue du Belier 67500 Haguenau,67180_0320_00007,G,7 RUE DU BELIER,
038581559,00010,03858155900010,O,1994-12-25,01,2021,,2023-11-30T10:16:33,true,2,,1,A,RUE,STIEGELMANN,67500,HAGUENAU,,,67180,,,,,,,,,,,,,,,,,,,2008-01-01,A,,,,,81.10Z,NAFRev2,O,7.788592,48.812235,0.96,housenumber,1a Rue Stiegelmann 67500 Haguenau,67180_2910_00001_a,G,1A RUE STIEGELMANN,
038581567,00013,03858156700013,O,1994-12-25,NN,,,2008-01-04T17:56:13,true,2,,3,,PL,BARBEROUSSE,67500,HAGUENAU,,,67180,,,,,,,,,,,,,,,,,,,2008-01-01,A,,,,,81.10Z,NAFRev2,O,7.789208,48.816599,0.85,housenumber,3 Place Barberousse 67500 Haguenau,67180_0260_00003,G,3 PLACE BARBEROUSSE,
038584348,00015,03858434800015,O,1994-12-25,NN,,,2008-01-04T17:56:14,true,3,,,,,MEYERSHOFEN,67500,HAGUENAU,,,67180,,,,,,,,,,,,,,,,,,,2008-01-01,A,,,,,81.10Z,NAFRev2,N,7.74752,48.79983,0.88,street,Meyershoffen 67500 Haguenau,67180_tun35h,G,MEYERSHOFFEN,
038584454,00011,03858445400011,O,1994-12-25,NN,,,2008-01-04T17:56:14,true,2,,,,RUE,DU PRETEUR,67500,HAGUENAU,,,67180,,,,,,,,,,,,,,,,,,,2008-01-01,A,,,,,81.10Z,NAFRev2,N,7.776738,48.80533,0.97,street,Rue du Preteur 67500 Haguenau,67180_2450,G,RUE DU PRETEUR,
038584470,00017,03858447000017,O,1994-12-25,NN,,,2008-01-04T17:56:14,true,3,,2,,RUE,DE THIERENBACH MARIENTHAL,67500,HAGUENAU,,,67180,,,,,,,,,,,,,,,,,,,2008-01-01,A,,,,,81.10Z,NAFRev2,N,7.812778,48.781577,0.96,housenumber,2 Rue de Thierenbach Marienthal 67500 Haguenau,67180_2985_00002,G,2 RUE DE THIERENBACH MARIENTHAL,
038584488,00019,03858448800019,O,1994-12-25,NN,,,2008-01-04T17:56:14,true,2,,1,,RUE,GEYHER,67500,HAGUENAU,,,67180,,,,,,,,,,,,,,,,,,,2008-01-01,A,,,,,81.10Z,NAFRev2,N,7.794542,48.818021,0.96,housenumber,1 Rue Geyher 67500 Haguenau,67180_1267_00001,G,1 RUE GEYHER,
038584751,00010,03858475100010,O,1994-12-25,NN,,,2010-04-18T03:01:25,true,3,,22,,RTE,DE WINTERSHOUSE,67500,HAGUENAU,,,67180,,,,,,,,,,,,,,,,,,,2008-12-31,A,,,,,81.10Z,NAFRev2,N,7.774979,48.808303,0.89,housenumber,22 Route de Wintershouse 67500 Haguenau,67180_3190_00022,G,22 ROUTE DE WINTERSHOUSE,
038584769,00012,03858476900012,O,1994-12-25,NN,,,2018-09-29T12:00:37,true,3,,26,,CHE,DU PLATEAU,67500,HAGUENAU,,,67180,,,,,,,,,,,,,,,,,,,2015-12-31,A,,,,,81.10Z,NAFRev2,N,7.771817,48.809991,0.87,housenumber,26 Chemin du Plateau 67500 Haguenau,67180_2340_00026,G,26 CHEMIN DU PLATEAU,
038584843,00015,03858484300015,O,1994-12-25,NN,,,2013-05-18T02:03:01,true,3,,2,,RUE,DES GUEPES,67500,HAGUENAU,,,67180,,,,,,,,,,,,,,,,,,,2011-05-28,A,,,,,81.10Z,NAFRev2,N,7.791584,48.805951,0.96,housenumber,2 Rue des Guepes 67500 Haguenau,67180_1380_00002,G,2 RUE DES GUEPES,
038589792,00019,03858979200019,O,1994-12-25,00,2020,,2022-08-29T09:00:45,true,4,,1,,RUE,DU STADE,67500,HAGUENAU,,,67180,,,,,,,,,,,,,,,,,,,2020-06-30,A,,,,,81.10Z,NAFRev2,N,7.773278,48.806906,0.96,housenumber,1 Rue du Stade 67500 Haguenau,67180_2875_00001,G,1 RUE DU STADE,
038589875,00012,03858987500012,O,1994-12-25,NN,,,2014-06-13T23:04:19,true,3,,44,,BD,MAL DE LATTRE DE TASSIGNY,67500,HAGUENAU,,,67180,,,,,,,,,,,,,,,,,,,2012-09-30,A,,,,,81.10Z,NAFRev2,N,7.790686,48.821056,0.93,housenumber,44 Bd du Mal de Lattre de Tassigny 67500 Haguenau,67180_1830_00044,G,44 BD MAL DE LATTRE DE TASSIGNY,
038590923,00017,03859092300017,O,1994-12-25,01,2021,,2023-11-30T10:16:33,true,2,,1,,RUE,STIEGELMANN,67500,HAGUENAU,,,67180,,,,,,,,,,,,,,,,,,,2008-01-01,A,,,,,81.10Z,NAFRev2,O,7.788641,48.811978,0.96,housenumber,1 Rue Stiegelmann 67500 Haguenau,67180_2910_00001,G,1 RUE STIEGELMANN,
038596136,00010,03859613600010,O,1994-12-25,NN,,,2008-01-04T17:56:15,true,2,,12,,BD,NESSEL,67500,HAGUENAU,,,67180,,,,,,,,,,,,,,,,,,,2008-01-01,A,,,,,81.10Z,NAFRev2,N,7.78466,48.812228,0.81,housenumber,12 Boulevard Nessel 67500 Haguenau,67180_2080_00012,G,12 BOULEVARD NESSEL,
038596508,00010,03859650800010,O,1994-12-25,NN,,,2012-05-05T00:07:33,true,4,,3,,RUE,DU STADE,67500,HAGUENAU,,,67180,,,,,,,,,,,,,,,,,,,2010-12-31,A,,,,,81.10Z,NAFRev2,N,7.77376,48.806525,0.96,housenumber,3 Rue du Stade 67500 Haguenau,67180_2875_00003,G,3 RUE DU STADE,
038596722,00017,03859672200017,O,1994-12-25,NN,,,2014-06-13T23:04:20,true,3,,188,,,GRAND RUE,67500,HAGUENAU,,,67180,,,,,,,,,,,,,,,,,,,2012-10-31,A,,,,,81.10Z,NAFRev2,N,7.791241,48.818871,0.98,housenumber,188 Grand Rue 67500 Haguenau,67180_1350_00188,G,188 GRAND RUE,
038597704,00014,03859770400014,O,1994-12-25,NN,,,2015-05-14T03:03:52,true,5,,1,,PL,BARBEROUSSE,67500,HAGUENAU,,,67180,,,,,,,,,,,,,,,,,,,2013-12-31,A,,,,,81.10Z,NAFRev2,N,7.789433,48.816463,0.85,housenumber,1 Place Barberousse 67500 Haguenau,67180_0260_00001,G,1 PLACE BARBEROUSSE,
061501615,00415,06150161500415,O,2022-01-01,,,,2022-01-19T09:06:31,false,1,,3,,BD,HELENE BOUCHER,67500,HAGUENAU,,,67180,,,,,,,,,,,,,,,,,,,2022-01-01,A,,,,,46.69B,NAFRev2,O,2.8783923,42.7237786,0.76,poi.school,École Hélène Boucher Perpignan,https://osm.org/way/26960448,G,,
068502376,01127,06850237601127,O,1989-11-01,NN,,,2013-05-18T02:05:15,false,4,,132,,,GRAND RUE,67500,HAGUENAU,,BP 126,67180,67503,HAGUENAU CEDEX,,,,,,,,,,,,,,,,,2011-11-03,F,MAXI FLASH 67,,,,58.13Z,NAFRev2,O,7.791907,48.816113,0.98,housenumber,132 Grand Rue 67500 Haguenau,67180_1350_00132,G,132 GRAND RUE,
130005457,00317,13000545700317,O,2009-01-01,21,2021,,2023-11-30T10:17:04,false,1,,30,,RUE,DU MAIRE ANDRE TRABAND,67500,HAGUENAU,,,67180,,,,,,,,,,,,,,,,,,,2009-01-01,A,IUT HAGUENAU,,,,85.42Z,NAFRev2,N,7.785907,48.816147,0.97,housenumber,30 Rue du Maire Andre Traband 67500 Haguenau,67180_1801_00030,G,30 RUE DU MAIRE ANDRE TRABAND,
130005481,02883,13000548102883,O,2008-12-19,NN,,,2020-08-25T10:13:05,false,3,,2,,RUE,DU FOULON,67500,HAGUENAU,,,67180,,,,,,,,,,,,,,,,,,,2018-06-01,F,AGENCE LOCALE POUR L'EMPLOI,,,,84.13Z,NAFRev2,O,7.781276,48.808934,0.97,housenumber,2 Rue du Foulon 67500 Haguenau,67180_1160_00002,G,2 RUE DU FOULON,
130005481,04905,13000548104905,O,2008-12-19,NN,,,2020-08-25T10:13:05,false,3,ANTENNE DE HAGUENAU,24,,RTE,DE STRASBOURG,67500,HAGUENAU,,HAGUENAU,67180,,,,,,,,,,,,,,,,,,,2018-06-01,F,,,,,84.13Z,NAFRev2,O,7.778886,48.808754,0.89,housenumber,24 Route de Strasbourg 67500 Haguenau,67180_2920_00024,G,24 ROUTE DE STRASBOURG,
130005481,25421,13000548125421,O,2017-07-01,21,2021,,2023-11-30T10:17:04,false,1,,33,,RUE,DE LA REDOUTE,67500,HAGUENAU,,,67180,,,,,,,,,,,,,,,,,,,2017-07-01,A,POLE EMPLOI HAGUENEAU,,,,84.13Z,NAFRev2,N,7.789807,48.8105,0.97,housenumber,33 Rue de la Redoute 67500 Haguenau,67180_2520_00033,G,33 RUE DE LA REDOUTE,
130010218,00043,13001021800043,O,2010-01-01,03,2021,,2023-11-30T10:17:06,false,1,,5,,RUE,DES FRANCISCAINS,67500,HAGUENAU,,,67180,,,,,,,,,,,,,,,,,,,2010-01-01,A,UNITE TERRITORIALE NORD,,,,84.13Z,NAFRev2,O,7.789794,48.813878,0.96,housenumber,5 Rue des Franciscains 67500 Haguenau,67180_1180_00005,G,5 RUE DES FRANCISCAINS,
130012933,00060,13001293300060,O,2010-11-01,NN,,,2017-05-04T01:10:46,false,2,,5,,PL,D ARMES,67500,HAGUENAU,,BP  3026,67180,,,,,,,,,,,,,,,,,,,2016-10-06,F,RECETTE DES FINANCES DE HAGUENAU,,,,84.11Z,NAFRev2,N,7.78875,48.814781,0.82,housenumber,5 Place d’Armes 67500 Haguenau,67180_0170_00005,G,5 PLACE D ARMES,
130012933,00086,13001293300086,O,2010-11-01,12,2020,,2022-08-29T09:03:36,false,2,,2,,RUE,DU CLABAUD,67500,HAGUENAU,,BP 60254,67180,,,,,,,,,,,,,,,,,,,2022-01-01,F,SERVICE DES IMPOTS DES PARTICULIERS D'HAGUENAU,,,,84.11Z,NAFRev2,N,7.789422,48.812454,0.96,housenumber,2 Rue du Clabaud 67500 Haguenau,67180_0730_00002,G,2 RUE DU CLABAUD,
130012933,00243,13001293300243,O,2010-11-01,00,2021,,2023-11-30T10:17:08,false,3,RES LES DOMINICAINS,120,D,,GRAND RUE,67500,HAGUENAU,,BP 80238,67180,,,,,,,,,,,,,,,,,,,2021-09-01,F,SERVICE DE GESTION COMPTABLE D'HAGUENAU,,,,84.11Z,NAFRev2,N,7.79135,48.815317,0.98,housenumber,120d Grand Rue 67500 Haguenau,67180_1350_00120_d,G,120D GRAND RUE,
130012933,00615,13001293300615,O,2010-11-01,01,2021,,2023-11-30T10:17:08,false,1,,2,,RUE,DU CLABAUD,67500,HAGUENAU,,BP 60254,67180,,,,,,,,,,,,,,,,,,,2010-11-01,A,CDIF  HAGUENAU,,,,84.11Z,NAFRev2,N,7.789422,48.812454,0.96,housenumber,2 Rue du Clabaud 67500 Haguenau,67180_0730_00002,G,2 RUE DU CLABAUD,
130012933,00672,13001293300672,O,2010-11-01,11,2021,,2023-11-30T10:17:08,false,1,CENTRE DES FINANCES PUBLIQUES,2,,RUE,DU CLABAUD,67500,HAGUENAU,,BP 60254,67180,67504,HAGUENAU CEDEX,,,,,,,,,,,,,,,,,2010-11-01,A,SIE HAGUENAU,,,,84.11Z,NAFRev2,N,7.789422,48.812454,0.96,housenumber,2 Rue du Clabaud 67500 Haguenau,67180_0730_00002,G,2 RUE DU CLABAUD,
130012933,00987,13001293300987,O,2020-07-09,,,,2020-07-21T11:39:11,false,1,,2,,RUE,DU CLABAUD,67500,HAGUENAU,,,67180,67504,HAGUENAU CEDEX,,,,,,,,,,,,,,,,,2020-07-09,A,ANTENNE D'HAGUENAU - PCRP DU BAS -RHIN,,,,84.11Z,NAFRev2,N,7.789422,48.812454,0.96,housenumber,2 Rue du Clabaud 67500 Haguenau,67180_0730_00002,G,2 RUE DU CLABAUD,
130012933,01027,13001293301027,O,2021-09-01,12,2021,,2023-11-30T10:17:08,false,1,CENTRE DES FINANCES PUBLIQUES,2,,RUE,DU CLABAUD,67500,HAGUENAU,,CS 60254,67180,67504,HAGUENAU CEDEX,,,,,,,,,,,,,,,,,2021-09-01,A,SERVICE DE GESTION COMPTABLE HAGUENAU,,,,84.11Z,NAFRev2,N,7.789422,48.812454,0.96,housenumber,2 Rue du Clabaud 67500 Haguenau,67180_0730_00002,G,2 RUE DU CLABAUD,
130012933,01035,13001293301035,O,2022-01-01,,,,2021-11-05T15:03:17,false,1,CENTRE DES FINANCES PUBLIQUES,2,,RUE,DU CLABAUD,67500,HAGUENAU,,CS 60254,67180,67504,HAGUENAU CEDEX,,,,,,,,,,,,,,,,,2022-01-01,A,ANTENNE HAGUENAU,,,,84.11Z,NAFRev2,N,7.789422,48.812454,0.96,housenumber,2 Rue du Clabaud 67500 Haguenau,67180_0730_00002,G,2 RUE DU CLABAUD,
130020308,00016,13002030800016,O,2012-11-06,,,,2014-08-06T15:07:30,true,1,,64,,AV,DU PROF RENE LERICHE,67500,HAGUENAU,,BP 40252,67180,67504,HAGUENAU CEDEX,,,,,,,,,,,,,,,,,2012-11-06,A,,,,,84.12Z,NAFRev2,N,7.779346,48.798914,0.9,housenumber,64 Av du Professeur Rene Leriche 67500 Haguenau,67180_2457_00064,G,64 AV DU PROFESSEUR RENE LERICHE,
130020308,00024,13002030800024,O,2012-11-06,,,,2021-02-23T10:28:24,false,1,,64,,AV,DU PROF RENE LERICHE,67500,HAGUENAU,,BP 40252,67180,67504,HAGUENAU CEDEX,,,,,,,,,,,,,,,,,2012-11-06,A,GCS BIOPAN - SITE CH HAGUENAU,,,,84.12Z,NAFRev2,N,7.779346,48.798914,0.9,housenumber,64 Av du Professeur Rene Leriche 67500 Haguenau,67180_2457_00064,G,64 AV DU PROFESSEUR RENE LERICHE,
130030919,00018,13003091900018,O,2014-09-09,,,,2023-05-04T11:27:04,true,1,,84,,RTE,DE STRASBOURG,67500,HAGUENAU,,,67180,,,,,,,,,,,,,,,,,,,2014-09-09,A,,,,,94.11Z,NAFRev2,N,7.768429,48.803819,0.89,housenumber,84 Route de Strasbourg 67500 Haguenau,67180_2920_00084,G,84 ROUTE DE STRASBOURG,
176700011,00032,17670001100032,O,1983-03-16,11,2021,,2023-11-30T10:17:17,false,3,,2,,RUE,DES SOEURS,67500,HAGUENAU,,BP 195,67180,67504,HAGUENAU CEDEX,,,,,,,,,,,,,,,,,2008-01-01,A,SOUS PREFECTURE,,,,84.11Z,NAFRev2,N,7.790463,48.813436,0.96,housenumber,2 Rue des Soeurs 67500 Haguenau,67180_2820_00002,G,2 RUE DES SOEURS,
176701316,00109,17670131600109,O,2005-10-01,NN,,,2019-06-24T13:07:29,false,5,,1,,,GRAND RUE,67500,HAGUENAU,,,67180,,,,,,,,,,,,,,,,,,,2017-04-14,F,UEMO SAVERNE,,,,87.90A,NAFRev2,N,7.785078,48.811833,0.98,housenumber,1 Grand Rue 67500 Haguenau,67180_1350_00001,G,1 GRAND RUE,
176701316,00315,17670131600315,O,2016-05-31,03,2021,,2023-11-30T10:17:17,false,1,,13,,RUE,CAPITO,67500,HAGUENAU,,,67180,,,,,,,,,,,,,,,,,,,2016-05-31,A,UEMO HAGUENAU,,,,88.99A,NAFRev2,N,7.791618,48.812117,0.96,housenumber,13 Rue Capito 67500 Haguenau,67180_0515_00013,G,13 RUE CAPITO,
176701514,00026,17670151400026,O,1983-03-16,12,2021,,2023-11-30T10:17:17,false,3,,4,,RUE,DES DOMINICAINS,67500,HAGUENAU,,BP 228,67180,67504,HAGUENAU CEDEX,,,,,,,,,,,,,,,,,2008-01-01,A,COMMISSARIAT DE POLICE,,,,84.24Z,NAFRev2,N,7.792544,48.815503,0.97,housenumber,4 Rue des Dominicains 67500 Haguenau,67180_0911_00004,G,4 RUE DES DOMINICAINS,
176702116,00045,17670211600045,O,1983-03-16,,,,2013-04-29T22:36:36,false,4,,3,,RUE,DE LA REDOUTE,67500,HAGUENAU,,BP 250,67180,67504,HAGUENAU CEDEX,,,,,,,,,,,,,,,,,2010-11-01,F,TRESORERIE DE HAGUENAU,,,,84.11Z,NAFRev2,N,7.794617,48.810489,0.97,housenumber,3 Rue de la Redoute 67500 Haguenau,67180_2520_00003,G,3 RUE DE LA REDOUTE,
176702116,00110,17670211600110,O,1983-03-16,,,,2013-04-29T22:36:36,false,4,LES DOMINICAINS,120,D,,GRAND RUE,67500,HAGUENAU,,BP 238,67180,67504,HAGUENAU CEDEX,,,,,,,,,,,,,,,,,2010-11-01,F,TRESORERIE DE HAGUENAU MUNICIPALE,,,,84.11Z,NAFRev2,N,7.79135,48.815317,0.98,housenumber,120d Grand Rue 67500 Haguenau,67180_1350_00120_d,G,120D GRAND RUE,
176702116,00730,17670211600730,O,1999-04-27,,,,2013-04-29T22:36:36,false,4,,5,,PL,D ARMES,67500,HAGUENAU,,,67180,,,,,,,,,,,,,,,,,,,2010-11-01,F,RECETTE DES FINANCES D'HAGUENAU,,,,84.11Z,NAFRev2,N,7.78875,48.814781,0.82,housenumber,5 Place d’Armes 67500 Haguenau,67180_0170_00005,G,5 PLACE D ARMES,
176702215,00045,17670221500045,O,1983-03-16,,,,2013-04-29T22:36:36,false,4,HOTEL DES IMPOTS,2,,RUE,DU CLABAUD,67500,HAGUENAU,,BP 254,67180,67504,HAGUENAU CEDEX,,,,,,,,,,,,,,,,,2010-11-01,F,CENTRE DES IMPOTS HAGUENAU,,,,84.11Z,NAFRev2,N,7.789422,48.812454,0.96,housenumber,2 Rue du Clabaud 67500 Haguenau,67180_0730_00002,G,2 RUE DU CLABAUD,
176702215,00102,17670221500102,O,1983-03-16,,,,2013-04-29T22:36:36,false,4,HOTEL DES IMPOTS,2,,RUE,DU CLABAUD,67500,HAGUENAU,,BP 60254,67180,67504,HAGUENAU CEDEX,,,,,,,,,,,,,,,,,2010-11-01,F,SCE IMPOTS DES ENTREPRISES HAGUENAU,,,,84.11Z,NAFRev2,N,7.789422,48.812454,0.96,housenumber,2 Rue du Clabaud 67500 Haguenau,67180_0730_00002,G,2 RUE DU CLABAUD,
176702215,00151,17670221500151,O,1983-03-16,NN,,,,false,4,HOTEL DES IMPOTS,2,,RUE,DU CLABAUD,67500,HAGUENAU,,BP 254,67180,67504,HAGUENAU CEDEX,,,,,,,,,,,,,,,,,2003-12-17,F,RECETTE PRINCIPALE HAGUENAU OUEST,,,,75.1A,NAFRev1,N,7.789422,48.812454,0.96,housenumber,2 Rue du Clabaud 67500 Haguenau,67180_0730_00002,G,2 RUE DU CLABAUD,
176702215,00425,17670221500425,O,1983-01-28,,,,2013-04-29T22:36:36,false,4,HOTEL DES IMPOTS,2,,RUE,DU CLABAUD,67500,HAGUENAU,,BP 254,67180,67504,HAGUENAU CEDEX,,,,,,,,,,,,,,,,,2010-11-01,F,CENTRE DES IMPOTS FONCIER D'HAGUENAU,,,,84.11Z,NAFRev2,N,7.789422,48.812454,0.96,housenumber,2 Rue du Clabaud 67500 Haguenau,67180_0730_00002,G,2 RUE DU CLABAUD,
176702215,00433,17670221500433,O,1983-01-25,NN,,,2006-10-26T23:39:14,false,3,HOTEL DES IMPOTS,2,,RUE,DU CLABAUD,67500,HAGUENAU,,BP 254,67180,67504,HAGUENAU CEDEX,,,,,,,,,,,,,,,,,2004-12-20,F,CENTRE DES IMPOTS D'HAGUENAU OUEST,,,,75.1A,NAFRev1,N,7.789422,48.812454,0.96,housenumber,2 Rue du Clabaud 67500 Haguenau,67180_0730_00002,G,2 RUE DU CLABAUD,
176702314,00079,17670231400079,O,1988-02-29,NN,,,2012-05-05T00:19:09,false,5,,14,,RUE,DES AVIATEURS,67500,HAGUENAU,,BP 257,67180,67504,HAGUENAU CEDEX,,,,,,,,,,,,,,,,,2009-12-25,F,DIVISION SUBDIVISION HAGUENAU,,,,84.11Z,NAFRev2,N,7.801623,48.806605,0.97,housenumber,14 Rue des Aviateurs 67500 Haguenau,67180_0240_00014,G,14 RUE DES AVIATEURS,
176702314,00160,17670231400160,O,1978-01-01,11,2021,,2023-11-30T10:17:17,false,1,AERODROME,6,,RUE,MARYSE BASTIE,67500,HAGUENAU,,CS 90257,67180,67504,HAGUENAU CEDEX,,,,,,,,,,,,,,,,,1978-01-01,A,BRIGADE DE SURVEILLANCE ET D'INTERVENTION,,,,84.11Z,NAFRev2,N,7.814973,48.798101,0.96,housenumber,6 Rue Maryse Bastie 67500 Haguenau,67180_1883_00006,G,6 RUE MARYSE BASTIE,
176702314,00178,17670231400178,O,1978-01-01,03,2021,,2023-11-30T10:17:17,false,1,,90,,RTE,DE BISCHWILLER,67500,HAGUENAU,,CS 90257,67180,67504,HAGUENAU CEDEX,,,,,,,,,,,,,,,,,1978-01-01,A,BUREAU DE CONTROLE,,,,84.11Z,NAFRev2,N,7.811914,48.802713,0.89,housenumber,90 Route de Bischwiller 67500 Haguenau,67180_0360_00090,G,90 ROUTE DE BISCHWILLER,
176703015,00147,17670301500147,O,1984-12-11,NN,,,2011-04-23T04:08:37,false,4,,8,,RUE,DU TOURNOI,67500,HAGUENAU,,,67180,,,,,,,,,,,,,,,,,,,2009-12-31,F,CTRE MEDICO SCOLAIRE HAGUENAU,,,,86.21Z,NAFRev2,N,7.793041,48.813628,0.96,housenumber,8 Rue du Tournoi 67500 Haguenau,67180_3040_00008,G,8 RUE DU TOURNOI,
176704310,00109,17670431000109,O,1985-05-02,NN,,,2020-09-16T15:43:43,false,4,,11,,RUE,GEORGES CLEMENCEAU,67500,HAGUENAU,,BP 113,67180,67504,HAGUENAU CEDEX,,,,,,,,,,,,,,,,,2016-12-17,F,CENTRE INFORMATION ORIENTATION,,,,84.12Z,NAFRev2,N,7.789221,48.813,0.96,housenumber,11 Rue Georges Clemenceau 67500 Haguenau,67180_1300_00011,G,11 RUE GEORGES CLEMENCEAU,
176704310,00166,17670431000166,O,1985-05-03,03,2021,,2023-11-30T10:17:17,false,3,,1,,,MARCHE AUX POISSONS,67500,HAGUENAU,,,67180,,,,,,,,,,,,,,,,,,,2008-01-01,A,CIRCONSCRIPTION IEN HAGUENEAU NORD,,,,84.12Z,NAFRev2,N,7.791215,48.815012,0.96,housenumber,1 Marche aux Poissons 67500 Haguenau,67180_1827_00001,G,1 MARCHE AUX POISSONS,
176704310,00422,17670431000422,O,1985-05-10,NN,,,2008-01-04T18:16:06,false,3,,11,,RUE,GEORGES CLEMENCEAU,67500,HAGUENAU,,,67180,,,,,,,,,,,,,,,,,,,2008-01-01,A,COMMISSION CIRC PRESCOL ELEM,,,,84.12Z,NAFRev2,N,7.789221,48.813,0.96,housenumber,11 Rue Georges Clemenceau 67500 Haguenau,67180_1300_00011,G,11 RUE GEORGES CLEMENCEAU,
176704310,00513,17670431000513,O,2000-09-25,03,2021,,2023-11-30T10:17:17,false,3,,1,,,MARCHE AUX POISSONS,67500,HAGUENAU,,,67180,,,,,,,,,,,,,,,,,,,2008-01-01,A,CIRCONSCRIPTION IEN HAGUENEAU SUD,,,,84.12Z,NAFRev2,N,7.791215,48.815012,0.96,housenumber,1 Marche aux Poissons 67500 Haguenau,67180_1827_00001,G,1 MARCHE AUX POISSONS,
176704310,00737,17670431000737,O,2016-11-17,11,2021,,2023-11-30T10:17:17,false,1,,27,,RUE,DE LA REDOUTE,67500,HAGUENAU,,,67180,,,,,,,,,,,,,,,,,,,2016-11-17,A,CIO D'ETAT DE HAGUENAU,,,,84.12Z,NAFRev2,N,7.784379,48.81027,0.97,housenumber,27 Rue de la Redoute 67500 Haguenau,67180_2520_00027,G,27 RUE DE LA REDOUTE,
176706612,00155,17670661200155,O,1983-03-16,NN,,,2010-09-16T10:08:47,false,4,,2,,RTE,DE SCHWEIGHOUSE,67500,HAGUENAU,,BP 237,67180,67504,HAGUENAU CEDEX,,,,,,,,,,,,,,,,,2009-12-31,F,DDE SUBDIVISION DE HAGUENAU,,,,84.13Z,NAFRev2,N,7.781039,48.812089,0.89,housenumber,2 Route de Schweighouse 67500 Haguenau,67180_2780_00002,G,2 ROUTE DE SCHWEIGHOUSE,
176707016,00075,17670701600075,O,1984-08-10,NN,,,2011-04-23T04:08:38,false,5,,14,,BD,NESSEL,67500,HAGUENAU,,BP 118,67180,67504,HAGUENAU CEDEX,,,,,,,,,,,,,,,,,2010-01-01,F,GENIE RURAL,,,,84.13Z,NAFRev2,N,7.784579,48.812351,0.81,housenumber,14 Boulevard Nessel 67500 Haguenau,67180_2080_00014,G,14 BOULEVARD NESSEL,
176801116,00219,17680111600219,O,1983-11-10,12,2021,,2023-11-30T10:17:17,false,5,,84,,,GRAND RUE,67500,HAGUENAU,,BP 10240,67180,67504,HAGUENAU CEDEX,,,,,,,,,,,,,,,,,2020-01-01,A,TRIBUNAL DE PROXIMITE,,,,84.23Z,NAFRev2,N,7.789851,48.814219,0.98,housenumber,84 Grand Rue 67500 Haguenau,67180_1350_00084,G,84 GRAND RUE,
176801116,00284,17680111600284,O,1980-03-07,NN,,,2018-09-29T12:02:37,false,4,,120,E,,GRAND RUE,67500,HAGUENAU,,BP 260,67180,67504,HAGUENAU CEDEX,,,,,,,,,,,,,,,,,2015-02-17,F,CONSEIL DE PRUD'HOMMES DE HAGUENAU,,,,84.23Z,NAFRev2,N,7.791403,48.815387,0.98,housenumber,120e Grand Rue 67500 Haguenau,67180_1350_00120_e,G,120E GRAND RUE,