siren,nic,siret,statutDiffusionEtablissement,dateCreationEtablissement,trancheEffectifsEtablissement,anneeEffectifsEtablissement,activitePrincipaleRegistreMetiersEtablissement,dateDernierTraitementEtablissement,etablissementSiege,nombrePeriodesEtablissement,complementAdresseEtablissement,numeroVoieEtablissement,indiceRepetitionEtablissement,typeVoieEtablissement,libelleVoieEtablissement,codePostalEtablissement,libelleCommuneEtablissement,libelleCommuneEtrangerEtablissement,distributionSpecialeEtablissement,codeCommuneEtablissement,codeCedexEtablissement,libelleCedexEtablissement,codePaysEtrangerEtablissement,libellePaysEtrangerEtablissement,complementAdresse2Etablissement,numeroVoie2Etablissement,indiceRepetition2Etablissement,typeVoie2Etablissement,libelleVoie2Etablissement,codePostal2Etablissement,libelleCommune2Etablissement,libelleCommuneEtranger2Etablissement,distributionSpeciale2Etablissement,codeCommune2Etablissement,codeCedex2Etablissement,libelleCedex2Etablissement,codePaysEtranger2Etablissement,libellePaysEtranger2Etablissement,dateDebut,etatAdministratifEtablissement,enseigne1Etablissement,enseigne2Etablissement,enseigne3Etablissement,denominationUsuelleEtablissement,activitePrincipaleEtablissement,nomenclatureActivitePrincipaleEtablissement,caractereEmployeurEtablissement,longitude,latitude,geo_score,geo_type,geo_adresse,geo_id,geo_ligne,geo_l4,geo_l5
040073058,00014,04007305800014,O,1995-12-25,01,2021,,2023-11-30T10:16:47,true,2,,364,,RUE,JEAN MOULIN,69210,L'ARBRESLE,,,69010,,,,,,,,,,,,,,,,,,,2008-01-01,A,,,,,81.10Z,NAFRev2,O,4.610323,45.834834,0.96,housenumber,364 Rue Jean Moulin 69210 L'Arbresle,69010_0525_00364,G,364 RUE JEAN MOULIN,
040073496,00016,04007349600016,O,1995-12-25,NN,,,2008-01-04T18:03:37,true,2,,,,RUE,DE LA BREVENNE,69210,L'ARBRESLE,,,69010,,,,,,,,,,,,,,,,,,,2008-01-01,A,,,,,81.10Z,NAFRev2,N,4.616405,45.833129,0.95,street,Rue de la Brévenne 69210 L'Arbresle,69010_0180,G,RUE DE LA BREVENNE,
040088098,00013,04008809800013,O,1995-12-25,00,2021,,2023-11-30T10:16:47,true,3,,23,,RUE,GABRIEL PERI,69210,L'ARBRESLE,,,69010,,,,,,,,,,,,,,,,,,,2022-07-31,A,,,,,81.10Z,NAFRev2,N,4.614771,45.833936,0.97,housenumber,23 Rue Gabriel Péri 69210 L'Arbresle,69010_0480_00023,G,23 RUE GABRIEL PERI,
040148934,00017,04014893400017,O,1995-12-25,NN,,,2015-05-14T03:05:38,true,3,,111,,RUE,DU MISTRAL,69210,L'ARBRESLE,,,69010,,,,,,,,,,,,,,,,,,,2014-01-31,A,,,,,81.10Z,NAFRev2,N,4.610316,45.835405,0.96,housenumber,111 Rue du Mistral 69210 L'Arbresle,69010_0710_00111,G,111 RUE DU MISTRAL,
040150294,00011,04015029400011,O,1995-12-25,01,2021,,2023-11-30T10:16:48,true,3,,,,RUE,BARTHELEMY THIMONIER,69210,L'ARBRESLE,,,69010,,,,,,,,,,,,,,,,,,,2022-01-31,A,,,,,81.10Z,NAFRev2,N,4.611753,45.830123,0.92,street,Rue Barthélémy Thimonnier 69210 L'Arbresle,69010_0020,G,RUE BARTHELEMY THIMONNIER,
040150310,00015,04015031000015,O,1995-12-25,NN,,,2008-01-04T18:04:20,true,2,,25,,RUE,GABRIEL PERI,69210,L'ARBRESLE,,,69010,,,,,,,,,,,,,,,,,,,2008-01-01,A,,,,,81.10Z,NAFRev2,N,4.61458,45.833784,0.97,housenumber,25 Rue Gabriel Péri 69210 L'Arbresle,69010_0480_00025,G,25 RUE GABRIEL PERI,
040150385,00017,04015038500017,O,1995-12-25,NN,,,2008-01-04T18:04:20,true,3,,,,RUE,CLAUDE TERRASSE,69210,L'ARBRESLE,,,69010,,,,,,,,,,,,,,,,,,,2008-01-01,A,,,,,81.10Z,NAFRev2,N,4.613072,45.829946,0.97,street,Rue Claude Terrasse 69210 L'Arbresle,69010_0280,G,RUE CLAUDE TERRASSE,
040150393,00011,04015039300011,O,1995-12-25,NN,,,2008-01-04T18:04:20,true,3,GIE MADINIER ET CIE,,,RUE,CLAUDE TERRASSE,69210,L'ARBRESLE,,,69010,,,,,,,,,,,,,,,,,,,2008-01-01,A,,,,,81.10Z,NAFRev2,N,4.613072,45.829946,0.97,street,Rue Claude Terrasse 69210 L'Arbresle,69010_0280,G,RUE CLAUDE TERRASSE,
040152514,00010,04015251400010,O,1995-12-25,,,,2008-01-04T18:04:20,true,2,,3,,RUE,DE PARIS,69210,L'ARBRESLE,,,69010,,,,,,,,,,,,,,,,,,,2008-01-01,A,,,,,81.10Z,NAFRev2,N,4.616298,45.837457,0.78,housenumber,3 Route de Paris 69210 L'Arbresle,69010_0860_00003,G,3 ROUTE DE PARIS,
060200417,01626,06020041701626,O,1986-09-13,NN,,,2015-12-21T21:53:15,false,3,,17,,RUE,GABRIEL PERI,69210,L'ARBRESLE,,,69010,,,,,,,,,,,,,,,,,,,2004-09-01,F,ERAM,,,,52.4E,NAFRev1,N,4.615334,45.834365,0.97,housenumber,17 Rue Gabriel Péri 69210 L'Arbresle,69010_0480_00017,G,17 RUE GABRIEL PERI,
130005481,19689,13000548119689,O,2012-02-01,00,2021,,2023-11-30T10:17:04,false,3,,3,,AV,PIERRE SEMARD,69210,L'ARBRESLE,,,69010,,,,,,,,,,,,,,,,,,,2021-03-01,F,ARBRESLE,,,,84.13Z,NAFRev2,O,4.618734,45.834585,0.76,housenumber,3 Rue Pierre Semard 69210 L'Arbresle,69010_7b4ilx_00003,G,3 RUE PIERRE SEMARD,
130010036,01005,13001003601005,O,2010-01-25,11,2020,,2022-08-29T09:03:30,false,2,LES CHENEVIERES,493,,RUE,CLAUDE TERRASSE,69210,L'ARBRESLE,,BP 53,69010,69592,L ARBRESLE CEDEX,,,,,,,,,,,,,,,,,2021-12-01,F,TRESORERIE  L'ARBRESLE,,,,84.11Z,NAFRev2,N,4.614088,45.831107,0.97,housenumber,493 Rue Claude Terrasse 69210 L'Arbresle,69010_0280_00493,G,493 RUE CLAUDE TERRASSE,
176902112,00265,17690211200265,O,1983-03-16,,,,2006-10-26T23:39:14,false,3,,7,,RUE,DU DOC MICHEL,69210,L'ARBRESLE,,,69010,,,,,,,,,,,,,,,,,,,2004-12-10,F,TRESORERIE DE L'ARBRESLE,,,,75.1A,NAFRev1,N,4.615213,45.836468,0.86,housenumber,7 Rue du Docteur Michel 69210 L'Arbresle,69010_0340_00007,G,7 RUE DU DOCTEUR MICHEL,
176902112,00737,17690211200737,O,2004-12-10,,,,2013-04-29T22:36:39,false,4,LES CHENEVRIERES,493,,RUE,CLAUDE TERRASSE,69210,L'ARBRESLE,,,69010,,,,,,,,,,,,,,,,,,,2010-01-25,F,TRESORERIE DE L'ARBRESLE,,,,84.11Z,NAFRev2,N,4.614088,45.831107,0.97,housenumber,493 Rue Claude Terrasse 69210 L'Arbresle,69010_0280_00493,G,493 RUE CLAUDE TERRASSE,
176904316,00906,17690431600906,O,2005-09-01,11,2021,,2023-11-30T10:17:17,false,2,,203,,RUE,JEAN MOULIN,69210,L'ARBRESLE,,,69010,,,,,,,,,,,,,,,,,,,2008-01-01,A,CIRCONSCRIPTION 1ER DEGRE IEN ARBRESLE,,,,84.12Z,NAFRev2,N,4.612743,45.835988,0.96,housenumber,203 Rue Jean Moulin 69210 L'Arbresle,69010_0525_00203,G,203 RUE JEAN MOULIN,
176906618,00242,17690661800242,O,1982-01-01,NN,,,2011-04-23T04:08:40,false,4,,117,,AV,PIERRE SEMARD,69210,L'ARBRESLE,,BP 0117,69010,,,,,,,,,,,,,,,,,,,2009-12-31,F,DDE SUBDI ARBRESLE ST LAURENT CHAMOUSSET,,,,84.13Z,NAFRev2,N,4.618709,45.834369,0.66,street,Rue Pierre Semard 69210 L'Arbresle,69010_7b4ilx,G,RUE PIERRE SEMARD,
186910014,00023,18691001400023,O,1993-01-01,NN,,,2006-04-18T11:25:04,false,3,,6,,AV,PIERRE SEMARD,69210,L'ARBRESLE,,,69010,,,,,,,,,,,,,,,,,,,2002-07-01,F,SERVICE UTILITE AGRICOLE DE L ELEVAGE,,,,91.1A,NAF1993,N,4.618671,45.83423,0.76,housenumber,6 Rue Pierre Semard 69210 L'Arbresle,69010_7b4ilx_00006,G,6 RUE PIERRE SEMARD,
196900039,00013,19690003900013,O,1983-03-01,21,2021,,2023-11-30T10:17:26,true,3,,160,,AV,ANDRE LASSAGNE,69210,L'ARBRESLE,,BP 111,69010,69592,L ARBRESLE CEDEX,,,,,,,,,,,,,,,,,2008-01-01,A,,,,,85.32Z,NAFRev2,N,4.613051,45.834324,0.87,housenumber,160 Avenue André Lassagne 69210 L'Arbresle,69010_0008_00160,G,160 AVENUE ANDRE LASSAGNE,
196900039,00021,19690003900021,O,1986-01-01,,,,,false,4,,160,,AV,ANDRE LASSAGNE,69210,L'ARBRESLE,,BP 111,69010,69592,L ARBRESLE CEDEX,,,,,,,,,,,,,,,,,2003-08-31,F,GRETA MONTS DU LYONNAIS 2994E,,,,80.4C,NAFRev1,N,4.613051,45.834324,0.87,housenumber,160 Avenue André Lassagne 69210 L'Arbresle,69010_0008_00160,G,160 AVENUE ANDRE LASSAGNE,
196914824,00012,19691482400012,O,1983-03-01,21,2021,,2023-11-30T10:17:26,true,3,,326,,AV,DU ONZE NOVEMBRE 1918,69210,L'ARBRESLE,,,69010,,,,,,,,,,,,,,,,,,,2008-01-01,A,,,,,85.31Z,NAFRev2,N,4.610032,45.832961,0.76,street,Avenue du Onze Novembre 1918 69210 L'Arbresle,69010_0830,G,AVENUE DU ONZE NOVEMBRE 1918,
200000677,00019,20000067700019,O,2005-12-21,03,2021,,2023-11-30T10:17:29,true,3,COMM DE COM DU PAYS DE L'ARBRESLE,117,,RUE,PIERRE PASSEMARD,69210,L'ARBRESLE,,BP 41,69010,,,,,,,,,,,,,,,,,,,2008-01-01,A,,,,,84.13Z,NAFRev2,O,4.610219,45.827811,0.95,housenumber,117 Rue Pierre Passemard 69210 L'Arbresle,69010_0940_00117,G,117 RUE PIERRE PASSEMARD,
216900100,00019,21690010000019,O,1983-03-01,22,2021,,2023-11-30T10:18:33,true,4,,,,PL,PIERRE MARIE DURAND,69210,L'ARBRESLE,,BP 66,69010,69592,L ARBRESLE CEDEX,,,,,,,,,,,,,,,,,2008-01-01,A,MAIRIE,,,,84.11Z,NAFRev2,O,4.6152,45.835446,0.88,street,Place Pierre Marie Durand 69210 L'Arbresle,69010_0920,G,PLACE PIERRE MARIE DURAND,
216900100,00027,21690010000027,O,1983-12-21,12,2021,,2023-11-30T10:18:33,false,5,,,,PL,PIERRE MARIE DURAND,69210,L'ARBRESLE,,,69010,,,,,,,,,,,,,,,,,,,2023-03-01,A,ECOLE PRIMAIRE LASSAGNE-DOLTO,,,,85.20Z,NAFRev2,N,4.6152,45.835446,0.88,street,Place Pierre Marie Durand 69210 L'Arbresle,69010_0920,G,PLACE PIERRE MARIE DURAND,
216900100,00035,21690010000035,O,1983-12-21,00,2020,,2022-08-29T09:08:32,false,3,,90,,AV,ANDRE LASSAGNE,69210,L'ARBRESLE,,,69010,,,,,,,,,,,,,,,,,,,2008-01-01,A,ECOLE MATERNELLE FRANCOISE DOLTO,,,,85.10Z,NAFRev2,N,4.61383,45.834477,0.87,housenumber,90 Avenue André Lassagne 69210 L'Arbresle,69010_0008_00090,G,90 AVENUE ANDRE LASSAGNE,
216900100,00043,21690010000043,O,1993-09-02,NN,,,2013-05-18T02:16:04,false,3,,,,,AUX MOLLIERES,69210,L'ARBRESLE,,,69010,,,,,,,,,,,,,,,,,,,2008-01-01,A,ECOLE MATERNELLE PUBLIQUE LA RESIDENCE,,,,85.20Z,NAFRev2,N,4.60644,45.84257,0.69,street,Chemin des Mollières 69210 L'Arbresle,69010_0715,G,CHEMIN DES MOLLIERES,
216900100,00050,21690010000050,O,1995-04-24,03,2021,,2023-11-30T10:18:33,false,4,,100,,RUE,MICHEL AULAS,69210,L'ARBRESLE,,,69010,,,,,,,,,,,,,,,,,,,2023-03-01,A,ECOLE PRIMAIRE LES MOLLIERES,,,,85.20Z,NAFRev2,N,4.609215,45.840655,0.96,housenumber,100 Rue Michel Aulas 69210 L'Arbresle,69010_0670_00100,G,100 RUE MICHEL AULAS,
216900100,00068,21690010000068,O,1988-01-01,NN,,,2008-01-04T18:40:11,false,3,,,,PL,PIERRE MARIE DURAND,69210,L'ARBRESLE,,BP 66,69010,69592,L ARBRESLE CEDEX,,,,,,,,,,,,,,,,,2008-01-01,A,SERVICE DE L'EAU DE L'ABRESLE,,,,36.00Z,NAFRev2,N,4.6152,45.835446,0.88,street,Place Pierre Marie Durand 69210 L'Arbresle,69010_0920,G,PLACE PIERRE MARIE DURAND,
216900100,00076,21690010000076,O,1988-01-01,NN,,,2006-10-26T23:41:29,false,3,,,,PL,PIERRE MARIE DURAND,69210,L'ARBRESLE,,BP 66,69010,69592,L ARBRESLE CEDEX,,,,,,,,,,,,,,,,,2004-09-03,F,SERVICE ASSAINISSEMENT DE L'ARBRESLE,,,,90.0A,NAFRev1,N,4.6152,45.835446,0.88,street,Place Pierre Marie Durand 69210 L'Arbresle,69010_0920,G,PLACE PIERRE MARIE DURAND,
216900100,00084,21690010000084,O,1997-01-01,NN,,,2007-02-14T10:37:43,false,3,MAIRIE,,,PL,PIERRE MARIE DURAND,69210,L'ARBRESLE,,,69010,,,,,,,,,,,,,,,,,,,2006-01-01,F,ACTIVITES ECONOMIQUES,,,,75.1A,NAFRev1,N,4.6152,45.835446,0.88,street,Place Pierre Marie Durand 69210 L'Arbresle,69010_0920,G,PLACE PIERRE MARIE DURAND,
216900100,00092,21690010000092,O,2007-04-26,NN,,,2009-06-27T03:24:17,false,2,,8,,IMP,CHARRASSIN,69210,L'ARBRESLE,,,69010,,,,,,,,,,,,,,,,,,,2008-01-01,A,ETS ACCUEIL ENFANTS PAUSE TENDRESSE,,,,88.91A,NAFRev2,N,4.617361,45.834678,0.74,housenumber,8 Impasse Charassin 69210 L'Arbresle,69010_0240_00008,G,8 IMPASSE CHARASSIN,
226900017,00485,22690001700485,O,2003-12-25,NN,,,2021-10-27T08:11:38,false,2,,493,,RUE,CLAUDE TERRASSE,69210,L'ARBRESLE,,,69010,,,,,,,,,,,,,,,,,,,2008-01-01,A,M.D.R PRINCIPALE,,,,84.11Z,NAFRev2,N,4.614088,45.831107,0.97,housenumber,493 Rue Claude Terrasse 69210 L'Arbresle,69010_0280_00493,G,493 RUE CLAUDE TERRASSE,
246900021,00022,24690002100022,O,,NN,,,,true,1,,117,,RUE,PIERRE PASSEMARD,69210,L'ARBRESLE,,,69010,,,,,,,,,,,,,,,,,,,1995-12-29,F,,,,,75.1A,NAF1993,O,4.610219,45.827811,0.95,housenumber,117 Rue Pierre Passemard 69210 L'Arbresle,69010_0940_00117,G,117 RUE PIERRE PASSEMARD,
246900625,00012,24690062500012,O,1994-12-30,22,2021,,2023-11-30T10:18:56,true,3,,117,,RUE,PIERRE PASSEMARD,69210,L'ARBRESLE,,BP 41,69010,,,,,,,,,,,,,,,,,,,2008-01-01,A,,,,,84.11Z,NAFRev2,O,4.610219,45.827811,0.95,housenumber,117 Rue Pierre Passemard 69210 L'Arbresle,69010_0940_00117,G,117 RUE PIERRE PASSEMARD,
246900625,00020,24690062500020,O,1997-01-01,NN,,,2008-01-04T18:49:42,false,3,,,,PL,DES TROIS COMMUNES,69210,L'ARBRESLE,,,69010,,,,,,,,,,,,,,,,,,,2008-01-01,A,DEVELOPPEMENT Â¿CONOMIQUE,,,,42.99Z,NAFRev2,N,4.605596,45.822808,0.55,street,Place des 3 Communes 69210 L'Arbresle,69010_1181,G,PLACE DES 3 COMMUNES,
246900625,00038,24690062500038,O,2005-03-24,,,,2008-01-04T18:49:42,false,2,,117,,RUE,PIERRE PASSEMARD,69210,L'ARBRESLE,,,69010,,,,,,,,,,,,,,,,,,,2008-01-01,A,SPANC,,,,84.12Z,NAFRev2,N,4.610219,45.827811,0.95,housenumber,117 Rue Pierre Passemard 69210 L'Arbresle,69010_0940_00117,G,117 RUE PIERRE PASSEMARD,
246900625,00053,24690062500053,O,2015-06-25,,,,2023-05-17T15:58:52,false,1,,117,,RUE,PIERRE PASSEMARD,69210,L'ARBRESLE,,,69010,,,,,,,,,,,,,,,,,,,2015-06-25,A,OFFICE DE TOURISME DU PAYS DE L'ARBRESLE,,,,79.90Z,NAFRev2,N,4.610219,45.827811,0.95,housenumber,117 Rue Pierre Passemard 69210 L'Arbresle,69010_0940_00117,G,117 RUE PIERRE PASSEMARD,
246900625,00061,24690062500061,O,2019-01-01,,,,2023-05-17T15:59:41,false,1,,117,,RUE,PIERRE PASSEMARD,69210,L'ARBRESLE,,,69010,,,,,,,,,,,,,,,,,,,2019-01-01,A,ASSAINISSEMENT COLLECTIF,,,,37.00Z,NAFRev2,N,4.610219,45.827811,0.95,housenumber,117 Rue Pierre Passemard 69210 L'Arbresle,69010_0940_00117,G,117 RUE PIERRE PASSEMARD,
246900625,00079,24690062500079,O,2019-07-01,,,,2023-05-17T16:00:35,false,1,,117,,RUE,PIERRE PASSEMARD,69210,L'ARBRESLE,,,69010,,,,,,,,,,,,,,,,,,,2019-07-01,A,COWORKING,,,,82.99Z,NAFRev2,N,4.610219,45.827811,0.95,housenumber,117 Rue Pierre Passemard 69210 L'Arbresle,69010_0940_00117,G,117 RUE PIERRE PASSEMARD,
246900625,00087,24690062500087,O,2022-01-01,,,,2023-05-17T16:02:13,false,1,,117,,RUE,PIERRE PASSEMARD,69210,L'ARBRESLE,,,69010,,,,,,,,,,,,,,,,,,,2022-01-01,A,DECHETS,,,,38.11Z,NAFRev2,N,4.610219,45.827811,0.95,housenumber,117 Rue Pierre Passemard 69210 L'Arbresle,69010_0940_00117,G,117 RUE PIERRE PASSEMARD,
256900044,00015,25690004400015,O,1983-03-01,NN,,,,true,1,,,,PL,PIERRE MARIE DURAND,69210,L'ARBRESLE,,,69010,,,,,,,,,,,,,,,,,,,2002-12-30,F,,,,,75.1E,NAF1993,N,4.6152,45.835446,0.88,street,Place Pierre Marie Durand 69210 L'Arbresle,69010_0920,G,PLACE PIERRE MARIE DURAND,
256900051,00036,25690005100036,O,1993-01-01,NN,,,,true,1,,,,PL,PIERRE MARIE DURAND,69210,L'ARBRESLE,,,69010,,,,,,,,,,,,,,,,,,,2002-04-01,F,,,,,75.1C,NAF1993,N,4.6152,45.835446,0.88,street,Place Pierre Marie Durand 69210 L'Arbresle,69010_0920,G,PLACE PIERRE MARIE DURAND,
256910233,00012,25691023300012,O,1998-04-20,NN,,,,false,4,,,,RUE,DE LA MAIRIE,69210,L'ARBRESLE,,,69010,,,,,,,,,,,,,,,,,,,2002-02-18,F,,,,,75.1E,NAF1993,N,4.615759,45.835685,0.96,street,Rue de la Mairie 69210 L'Arbresle,69010_0640,G,RUE DE LA MAIRIE,
256910233,00038,25691023300038,O,2002-01-01,,,,2008-06-27T14:46:13,false,4,MAIRIE,6,,PL,PIERRE MARIE DURAND,69210,L'ARBRESLE,,,69010,,,,,,,,,,,,,,,,,,,2008-06-26,F,BUDGET INSTALLATIONS AFFERMEES,,,,38.11Z,NAFRev2,N,4.614854,45.834965,0.88,housenumber,6 Place Pierre Marie Durand 69210 L'Arbresle,69010_0920_00006,G,6 PLACE PIERRE MARIE DURAND,
256910233,00053,25691023300053,O,2010-10-11,NN,,,2021-10-27T08:12:24,true,2,,117,,RUE,PIERRE PASSEMARD,69210,L'ARBRESLE,,,69010,,,,,,,,,,,,,,,,,,,2019-12-18,F,,,,,84.13Z,NAFRev2,O,4.610219,45.827811,0.95,housenumber,117 Rue Pierre Passemard 69210 L'Arbresle,69010_0940_00117,G,117 RUE PIERRE PASSEMARD,
266900190,00072,26690019000072,O,1904-04-04,NN,,,2021-10-27T08:13:12,false,3,,,,IMP,CHARRASSIN,69210,L'ARBRESLE,,,69010,,,,,,,,,,,,,,,,,,,2008-01-01,A,CTRE MEDICO PSYCHO CMP,,,,88.99B,NAFRev2,N,4.61742,45.834901,0.71,street,Impasse Charassin 69210 L'Arbresle,69010_0240,G,IMPASSE CHARASSIN,
266900190,00189,26690019000189,O,1904-04-04,NN,,,2021-10-27T08:13:12,false,3,,,,IMP,CHARRASSIN,69210,L'ARBRESLE,,,69010,,,,,,,,,,,,,,,,,,,2008-01-01,A,C.A.T.T.P.,,,,88.99B,NAFRev2,N,4.61742,45.834901,0.71,street,Impasse Charassin 69210 L'Arbresle,69010_0240,G,IMPASSE CHARASSIN,
266900190,00486,26690019000486,O,2000-01-01,NN,,,2022-01-07T10:39:21,false,5,,74,,RUE,CLAUDE TERRASSE,69210,L'ARBRESLE,,,69010,,,,,,,,,,,,,,,,,,,2022-01-01,F,CATTP L'ARBRESLE,,,,86.10Z,NAFRev2,N,4.616421,45.834569,0.97,housenumber,74 Rue Claude Terrasse 69210 L'Arbresle,69010_0280_00074,G,74 RUE CLAUDE TERRASSE,
266900190,00494,26690019000494,O,2000-01-01,NN,,,2012-05-05T00:38:59,false,5,,19,,RUE,CLAUDE TERRASSE,69210,L'ARBRESLE,,,69010,,,,,,,,,,,,,,,,,,,2010-01-29,A,CMP CATTP L'ARBRESLE,,,,86.10Z,NAFRev2,N,4.617315,45.834395,0.97,housenumber,19 Rue Claude Terrasse 69210 L'Arbresle,69010_0280_00019,G,19 RUE CLAUDE TERRASSE,
266900190,00684,26690019000684,O,2008-03-18,NN,,,2011-04-23T04:22:01,false,2,,,,RUE,CLAUDE TERRASSE,69210,L'ARBRESLE,,,69010,,,,,,,,,,,,,,,,,,,2009-06-01,F,CATTP - CMP L'ARBRESLE,,,,86.10Z,NAFRev2,N,4.613072,45.829946,0.97,street,Rue Claude Terrasse 69210 L'Arbresle,69010_0280,G,RUE CLAUDE TERRASSE,
266900190,00833,26690019000833,O,2022-01-01,,,,2022-02-05T13:30:44,false,1,,,,RUE,LOUIS FOUCRE,69210,L'ARBRESLE,,,69010,,,,,,,,,,,,,,,,,,,2022-01-01,A,CATTP L'ARBRESLE - ENFANTS,,,,86.10Z,NAFRev2,N,4.614453,45.841492,0.96,street,Rue Louis Foucre 69210 L'Arbresle,69010_0565,G,RUE LOUIS FOUCRE,
266900315,00018,26690031500018,O,1983-03-01,NN,,,2017-05-04T01:40:29,false,5,,141,,AV,ANDRE LASSAGNE,69210,L'ARBRESLE,,BP 71,69010,,,,,,,,,,,,,,,,,,,2015-04-30,F,,,,,87.10A,NAFRev2,O,4.61336,45.834261,0.87,housenumber,141 Avenue André Lassagne 69210 L'Arbresle,69010_0008_00141,G,141 AVENUE ANDRE LASSAGNE,
266900315,00026,26690031500026,O,2003-01-01,,,,2013-10-01T09:03:56,false,4,,141,,AV,ANDRE LASSAGNE,69210,L'ARBRESLE,,BP 71,69010,,,,,,,,,,,,,,,,,,,2011-01-01,F,HEBERGEMENT TEMPORAIRE MDR LES COLLONGES,,,,87.10A,NAFRev2,N,4.61336,45.834261,0.87,housenumber,141 Avenue André Lassagne 69210 L'Arbresle,69010_0008_00141,G,141 AVENUE ANDRE LASSAGNE,
266900406,00015,26690040600015,O,1984-05-22,01,2021,,2023-11-30T10:19:12,true,3,,,,PL,PIERRE MARIE DURAND,69210,L'ARBRESLE,,,69010,,,,,,,,,,,,,,,,,,,2008-01-01,A,CCAS,,,,88.99B,NAFRev2,O,4.6152,45.835446,0.88,street,Place Pierre Marie Durand 69210 L'Arbresle,69010_0920,G,PLACE PIERRE MARIE DURAND,
266900406,00023,26690040600023,O,1997-01-01,03,2021,,2023-11-30T10:19:12,false,4,,2,,RUE,DE LYON,69210,L'ARBRESLE,,,69010,,,,,,,,,,,,,,,,,,,2017-12-25,A,FOYER RESIDENCE LA MADELEINE,,,,87.30A,NAFRev2,N,4.618916,45.834845,0.76,housenumber,2 Route de Lyon 69210 L'Arbresle,69010_0580_00002,G,2 ROUTE DE LYON,
266900406,00031,26690040600031,O,1984-04-24,NN,,,2018-03-13T15:56:55,false,4,,9,,RUE,DE LYON,69210,L'ARBRESLE,,,69010,,,,,,,,,,,,,,,,,,,2017-12-25,A,FOYER SOLEIL LA MADELEINE,,,,87.30A,NAFRev2,N,4.619251,45.834818,0.76,housenumber,9 Route de Lyon 69210 L'Arbresle,69010_0580_00009,G,9 ROUTE DE LYON,
266911122,00015,26691112200015,O,1985-10-14,NN,,,,true,1,,5,,AV,PIERRE SEMARD,69210,L'ARBRESLE,,,69010,,,,,,,,,,,,,,,,,,,1999-01-01,F,,,,,85.3J,NAF1993,N,4.618784,45.834397,0.76,housenumber,5 Rue Pierre Semard 69210 L'Arbresle,69010_7b4ilx_00005,G,5 RUE PIERRE SEMARD,
300214509,00014,30021450900014,O,1964-01-01,NN,,,2012-11-09T00:11:12,false,7,,11,,RUE,PIERRE BROSSOLETTE,69210,L'ARBRESLE,,,69010,,,,,,,,,,,,,,,,,,,2011-06-20,F,,,,,85.59B,NAFRev2,O,4.617203,45.835664,0.96,housenumber,11 Rue Pierre Brossolette 69210 L'Arbresle,69010_0900_00011,G,11 RUE PIERRE BROSSOLETTE,
300529815,00015,30052981500015,O,,NN,,,,true,1,,35,,RUE,DE PARIS,69210,L'ARBRESLE,,,69010,,,,,,,,,,,,,,,,,,,1997-12-22,F,,,,,24.1L,NAF1993,O,4.611922,45.83744,0.8,housenumber,35 Route de Paris 69210 L'Arbresle,69010_0860_00035,G,35 ROUTE DE PARIS,
300789047,00010,30078904700010,O,,,,,,true,1,,,,RUE,GABRIEL PERI,69210,L'ARBRESLE,,,69010,,,,,,,,,,,,,,,,,,,1984-12-25,F,,,,,62.21,NAP,N,4.612344,45.831711,0.97,street,Rue Gabriel Péri 69210 L'Arbresle,69010_0480,G,RUE GABRIEL PERI,
300794781,00017,30079478100017,O,,,,,,true,1,,35,,RTE,DE PARIS,69210,L'ARBRESLE,,,69010,,,,,,,,,,,,,,,,,,,1984-12-25,F,,,,,53.01,NAP,N,4.611922,45.83744,0.85,housenumber,35 Route de Paris 69210 L'Arbresle,69010_0860_00035,G,35 ROUTE DE PARIS,
300875176,00038,30087517600038,O,,NN,,,,true,1,,1,,RUE,CLAUDE TERRASSE,69210,L'ARBRESLE,,,69010,,,,,,,,,,,,,,,,,,,1989-07-01,F,,,,,84.10,NAP,N,4.613072,45.829946,0.89,street,Rue Claude Terrasse 69210 L'Arbresle,69010_0280,G,RUE CLAUDE TERRASSE,
300881141,00026,30088114100026,O,,NN,,,,true,1,,18,,RUE,DU DOC DUSSERRE,69210,L'ARBRESLE,,,69010,,,,,,,,,,,,,,,,,,,,F,,,,,47.02,NAP,N,4.616777,45.833532,0.87,housenumber,18 Rue du Docteur Dusserre 69210 L'Arbresle,69010_0320_00018,G,18 RUE DU DOCTEUR DUSSERRE,
301098224,00167,30109822400167,O,1991-01-01,NN,,,,false,4,,8,,RUE,PIERRE BROSSOLETTE,69210,L'ARBRESLE,,BP 92,69010,,,,,,,,,,,,,,,,,,,2000-09-01,F,,,,,74.1C,NAF1993,O,4.617342,45.835578,0.96,housenumber,8 Rue Pierre Brossolette 69210 L'Arbresle,69010_0900_00008,G,8 RUE PIERRE BROSSOLETTE,
301098224,00407,30109822400407,O,2000-09-01,NN,,,2009-06-27T03:35:30,false,3,,20,,RUE,GABRIEL PERI,69210,L'ARBRESLE,,,69010,,,,,,,,,,,,,,,,,,,2007-01-31,F,,,,,74.1C,NAFRev1,O,4.615074,45.834286,0.97,housenumber,20 Rue Gabriel Péri 69210 L'Arbresle,69010_0480_00020,G,20 RUE GABRIEL PERI,
301148870,00027,30114887000027,O,,NN,,,,true,1,,4,,RUE,EMILE FOURNIER,69210,L'ARBRESLE,,,69010,,,,,,,,,,,,,,,,,,,1994-06-30,F,,,,,45.2V,NAF1993,O,4.613396,45.831891,0.96,housenumber,4 Rue Emile Fournier 69210 L'Arbresle,69010_0380_00004,G,4 RUE EMILE FOURNIER,
301205209,00036,30120520900036,O,2001-01-11,NN,,,2006-10-26T23:51:03,true,4,,27,,RUE,DE PARIS,69210,L'ARBRESLE,,,69010,,,,,,,,,,,,,,,,,,,2004-09-27,F,,,,,70.2C,NAFRev1,N,4.613625,45.83717,0.8,housenumber,27 Route de Paris 69210 L'Arbresle,69010_0860_00027,G,27 ROUTE DE PARIS,
301267258,00012,30126725800012,O,,,,,,true,1,,27,,RUE,GABRIEL PERI,69210,L'ARBRESLE,,,69010,,,,,,,,,,,,,,,,,,,1997-03-25,F,,,,,85.1E,NAF1993,N,4.614207,45.833443,0.97,housenumber,27 Rue Gabriel Péri 69210 L'Arbresle,69010_0480_00027,G,27 RUE GABRIEL PERI,
301492757,00010,30149275700010,O,,,,,,true,1,,,,RUE,GABRIEL PERI,69210,L'ARBRESLE,,,69010,,,,,,,,,,,,,,,,,,,1984-12-25,F,,,,,67.04,NAP,N,4.612344,45.831711,0.97,street,Rue Gabriel Péri 69210 L'Arbresle,69010_0480,G,RUE GABRIEL PERI,
301710810,00021,30171081000021,O,1900-01-01,NN,,,,false,4,,18,,RUE,PIERRE BROSSOLETTE,69210,L'ARBRESLE,,,69010,,,,,,,,,,,,,,,,,,,1997-12-04,F,,,,,52.4C,NAF1993,O,4.617277,45.83607,0.96,housenumber,18 Rue Pierre Brossolette 69210 L'Arbresle,69010_0900_00018,G,18 RUE PIERRE BROSSOLETTE,
301755476,00027,30175547600027,O,1991-10-01,NN,,,2006-10-26T23:53:40,false,3,,6,,RUE,DU DOC DUSSERRE,69210,L'ARBRESLE,,,69010,,,,,,,,,,,,,,,,,,,2005-09-05,F,,,,,85.1G,NAFRev1,N,4.615788,45.834198,0.87,housenumber,6 Rue du Docteur Dusserre 69210 L'Arbresle,69010_0320_00006,G,6 RUE DU DOCTEUR DUSSERRE,
301763686,00195,30176368600195,O,1980-06-30,NN,,,,false,4,,33,,RUE,DE PARIS,69210,L'ARBRESLE,,,69010,,,,,,,,,,,,,,,,,,,1997-09-25,F,RELAIS DE LA TURDINE,,,,70.2C,NAF1993,N,4.612574,45.837181,0.8,housenumber,33 Route de Paris 69210 L'Arbresle,69010_0860_00033,G,33 ROUTE DE PARIS,
301816187,00019,30181618700019,O,,NN,,,,true,1,,,,RUE,B THIMONNIER,69210,L'ARBRESLE,,,69010,,,,,,,,,,,,,,,,,,,,F,,,,,55.73,NAP,N,4.611753,45.830123,0.84,street,Rue Barthélémy Thimonnier 69210 L'Arbresle,69010_0020,G,RUE BARTHELEMY THIMONNIER,
301886164,00013,30188616400013,O,,,,,,true,1,,12,,RUE,DE PARIS,69210,L'ARBRESLE,,,69010,,,,,,,,,,,,,,,,,,,1987-09-30,F,,,,,38.40,NAP,N,4.616406,45.837521,0.8,housenumber,12 Route de Paris 69210 L'Arbresle,69010_0860_00012,G,12 ROUTE DE PARIS,
301919668,00014,30191966800014,O,,NN,,,2006-11-25T09:13:53,true,1,,2,,RUE,DU DOC DUSSERRE,69210,L'ARBRESLE,,,69010,,,,,,,,,,,,,,,,,,,1992-06-17,F,,,,,92.3D,NAF1993,N,4.615555,45.834352,0.87,housenumber,2 Rue du Docteur Dusserre 69210 L'Arbresle,69010_0320_00002,G,2 RUE DU DOCTEUR DUSSERRE,
302325519,00023,30232551900023,O,1994-07-11,NN,,,2012-04-24T03:40:16,true,4,,9,,RUE,PIERRE BROSSOLETTE,69210,L'ARBRESLE,,,69010,,,,,,,,,,,,,,,,,,,2012-01-26,F,,,,,68.20B,NAFRev2,N,4.617256,45.835585,0.96,housenumber,9 Rue Pierre Brossolette 69210 L'Arbresle,69010_0900_00009,G,9 RUE PIERRE BROSSOLETTE,