siren,nic,siret,statutDiffusionEtablissement,dateCreationEtablissement,trancheEffectifsEtablissement,anneeEffectifsEtablissement,activitePrincipaleRegistreMetiersEtablissement,dateDernierTraitementEtablissement,etablissementSiege,nombrePeriodesEtablissement,complementAdresseEtablissement,numeroVoieEtablissement,indiceRepetitionEtablissement,typeVoieEtablissement,libelleVoieEtablissement,codePostalEtablissement,libelleCommuneEtablissement,libelleCommuneEtrangerEtablissement,distributionSpecialeEtablissement,codeCommuneEtablissement,codeCedexEtablissement,libelleCedexEtablissement,codePaysEtrangerEtablissement,libellePaysEtrangerEtablissement,complementAdresse2Etablissement,numeroVoie2Etablissement,indiceRepetition2Etablissement,typeVoie2Etablissement,libelleVoie2Etablissement,codePostal2Etablissement,libelleCommune2Etablissement,libelleCommuneEtranger2Etablissement,distributionSpeciale2Etablissement,codeCommune2Etablissement,codeCedex2Etablissement,libelleCedex2Etablissement,codePaysEtranger2Etablissement,libellePaysEtranger2Etablissement,dateDebut,etatAdministratifEtablissement,enseigne1Etablissement,enseigne2Etablissement,enseigne3Etablissement,denominationUsuelleEtablissement,activitePrincipaleEtablissement,nomenclatureActivitePrincipaleEtablissement,caractereEmployeurEtablissement,longitude,latitude,geo_score,geo_type,geo_adresse,geo_id,geo_ligne,geo_l4,geo_l5
130025216,00297,13002521600297,O,2019-07-01,,,,2019-11-14T14:00:58,false,1,,,,RTE,DEPARTEMENTALE 940,76930,OCTEVILLE-SUR-MER,,,76481,,,,,,,,,,,,,,,,,,,2019-07-01,A,BRIGADE DE SURVEILLANCE AEROMARITIME DU HAVRE,,,,84.11Z,NAFRev2,N,0.115195,49.562115,0.91,street,Route Départementale 940 76930 Octeville-sur-Mer,76481_q2bwsf,G,ROUTE DEPARTEMENTALE 940,
177602307,00049,17760230700049,O,1989-02-09,NN,,,2019-11-14T14:00:58,false,3,,,,RTE,DEPARTEMENTALE 940,76930,OCTEVILLE-SUR-MER,,,76481,,,,,,,,,,,,,,,,,,,2008-01-01,A,BRIGADE DE SURVEILLANCE AERIENNE,,,,84.11Z,NAFRev2,N,0.115195,49.562115,0.91,street,Route Départementale 940 76930 Octeville-sur-Mer,76481_q2bwsf,G,ROUTE DEPARTEMENTALE 940,
179106406,00376,17910640600376,O,1983-03-16,NN,,,2020-02-06T09:39:43,false,4,,,,,,76930,OCTEVILLE-SUR-MER,,,76481,,,,,,,,,,,,,,,,,,,2009-01-01,F,SERV NAVIGATION AERIENNE,,,,52.23Z,NAFRev2,N,,,0,,,,,,
217604818,00013,21760481800013,O,1983-03-01,21,2021,,2023-11-30T10:18:37,true,4,,,,PL,DU GENERAL DE GAULLE,76930,OCTEVILLE-SUR-MER,,,76481,,,,,,,,,,,,,,,,,,,2008-01-01,A,MAIRIE,,,,84.11Z,NAFRev2,O,7.7140308,48.5260102,0.86,poi.park,Place du Général de Gaulle (Parc) Illkirch-Graffenstaden,https://osm.org/way/50381281,G,,
217604818,00021,21760481800021,O,1983-03-16,NN,,,2021-10-27T08:10:32,false,3,,,,PL,DU GENERAL DE GAULLE,76930,OCTEVILLE-SUR-MER,,,76481,,,,,,,,,,,,,,,,,,,2008-01-01,A,CANTINE SCOLAIRE,,,,56.29B,NAFRev2,N,7.7140308,48.5260102,0.86,poi.park,Place du Général de Gaulle (Parc) Illkirch-Graffenstaden,https://osm.org/way/50381281,G,,
217604818,00039,21760481800039,O,1983-12-21,03,2021,,2023-11-30T10:18:37,false,3,,,,AV,MICHEL ADAM,76930,OCTEVILLE-SUR-MER,,,76481,,,,,,,,,,,,,,,,,,,2008-01-01,A,ECOLE MATERNELLE PUBLIQUE LES LUTINS,,,,85.10Z,NAFRev2,N,0.117729,49.558013,0.83,street,Avenue Michel Adam 76930 Octeville-sur-Mer,76481_0129,G,AVENUE MICHEL ADAM,
217604818,00047,21760481800047,O,1983-12-21,11,2021,,2023-11-30T10:18:37,false,4,,7,,RTE,DE MONTIVILLIERS,76930,OCTEVILLE-SUR-MER,,,76481,,,,,,,,,,,,,,,,,,,2023-07-12,A,ECOLE ELEMENTAIRE JULES VERNE,,,,85.20Z,NAFRev2,N,0.117144,49.556404,0.88,housenumber,7 Route de Montivilliers 76930 Octeville-sur-Mer,76481_0075_00007,G,7 ROUTE DE MONTIVILLIERS,
217604818,00054,21760481800054,O,1983-12-21,NN,,,2019-11-14T14:00:58,false,4,,,,,ROUTE DE MONTIVILLIERS,76930,OCTEVILLE-SUR-MER,,,76481,,,,,,,,,,,,,,,,,,,1996-12-25,F,ECOL PRIM GROUPE 2,,,,80.1Z,NAF1993,N,0.12431,49.555726,0.96,street,Route de Montivilliers 76930 Octeville-sur-Mer,76481_0075,G,ROUTE DE MONTIVILLIERS,
217604818,00062,21760481800062,O,1988-11-02,NN,,,2020-05-12T10:01:22,false,3,MAIRIE,,,PL,DU GENERAL DE GAULLE,76930,OCTEVILLE-SUR-MER,,,76481,,,,,,,,,,,,,,,,,,,2008-01-01,A,FOYER DES AINES,,,,88.10A,NAFRev2,N,7.7140308,48.5260102,0.86,poi.park,Place du Général de Gaulle (Parc) Illkirch-Graffenstaden,https://osm.org/way/50381281,G,,
217604818,00070,21760481800070,O,2002-01-01,,,,2019-11-14T14:00:58,false,1,,,,AV,MICHEL ADAM,76930,OCTEVILLE-SUR-MER,,,76481,,,,,,,,,,,,,,,,,,,2002-01-01,A,HALTE-GARDERIE LES 1000 PATTES,,,,88.91A,NAFRev2,N,0.117729,49.558013,0.83,street,Avenue Michel Adam 76930 Octeville-sur-Mer,76481_0129,G,AVENUE MICHEL ADAM,
217604818,00088,21760481800088,O,2021-09-14,,,,2023-12-11T11:12:27,false,2,,,,PL,DU GENERAL DE GAULLE,76930,OCTEVILLE-SUR-MER,,,76481,,,,,,,,,,,,,,,,,,,2023-11-27,F,ZONE DE L'ESTRAN,,,,42.99Z,NAFRev2,N,7.7140308,48.5260102,0.86,poi.park,Place du Général de Gaulle (Parc) Illkirch-Graffenstaden,https://osm.org/way/50381281,G,,
267605756,00019,26760575600019,O,1993-04-09,NN,,,2019-11-14T14:00:58,true,3,MAIRIE,,,PL,DU GENERAL DE GAULLE,76930,OCTEVILLE-SUR-MER,,,76481,,,,,,,,,,,,,,,,,,,2008-01-01,A,CCAS,,,,88.99B,NAFRev2,N,7.7140308,48.5260102,0.86,poi.park,Place du Général de Gaulle (Parc) Illkirch-Graffenstaden,https://osm.org/way/50381281,G,,
297600264,00016,29760026400016,O,1983-12-19,NN,,,2019-11-14T14:00:58,true,3,MAIRIE,,,PL,DU GENERAL DE GAULLE,76930,OCTEVILLE-SUR-MER,,,76481,,,,,,,,,,,,,,,,,,,2007-02-12,F,,,,,70.1C,NAFRev1,N,7.7140308,48.5260102,0.86,poi.park,Place du Général de Gaulle (Parc) Illkirch-Graffenstaden,https://osm.org/way/50381281,G,,
300029220,00054,30002922000054,O,1997-04-15,NN,,,2019-11-14T14:00:58,false,4,,6,,CHE,DE LA MER,76930,OCTEVILLE-SUR-MER,,,76481,,,,,,,,,,,,,,,,,,,2003-06-01,F,,,,,74.2A,NAFRev1,O,0.109359,49.55546,0.83,housenumber,6 Chemin de la Mer et du Croquet 76930 Octeville-sur-Mer,76481_0140_00006,G,6 CHEMIN DE LA MER ET DU CROQUET,
300194156,00018,30019415600018,O,,,,,2019-11-14T14:00:58,true,1,,,,RUE,AUGUSTE LECONTE,76930,OCTEVILLE-SUR-MER,,,76481,,,,,,,,,,,,,,,,,,,1984-12-25,F,,,,,34.06,NAP,N,0.114372,49.553156,0.87,street,Rue Auguste Le Conte 76930 Octeville-sur-Mer,76481_0014,G,RUE AUGUSTE LE CONTE,
300526977,00032,30052697700032,O,,,,,2019-11-14T14:00:58,true,1,,,,HAM,DU MOULIN,76930,OCTEVILLE-SUR-MER,,,76481,,,,,,,,,,,,,,,,,,,,F,,,,,65.03,NAP,N,0.103117,49.54825,0.94,street,Chemin du Moulin 76930 Octeville-sur-Mer,76481_0144,G,CHEMIN DU MOULIN,
301690780,00384,30169078000384,O,1998-10-01,NN,,,2019-11-14T14:00:58,false,3,,15,,RUE,ASSELIN DE VILLEQUIERS,76930,OCTEVILLE-SUR-MER,,,76481,,,,,,,,,,,,,,,,,,,2003-12-31,F,PAROISSE N D DE LA POINTE DE CAUX,,,,91.3A,NAFRev1,O,0.118085,49.555854,0.9,housenumber,15 Rue Asselin de Villequier 76930 Octeville-sur-Mer,76481_0011_00015,G,15 RUE ASSELIN DE VILLEQUIER,
302277025,00011,30227702500011,O,,,,,2019-11-14T14:00:58,true,1,,,,,HAMEAU DU CAFE BLANC,76930,OCTEVILLE-SUR-MER,,,76481,,,,,,,,,,,,,,,,,,,1984-12-25,F,,,,,,,N,0.120292,49.578656,0.67,street,Rue du Café Blanc 76930 Octeville-sur-Mer,76481_0035,G,RUE DU CAFE BLANC,
302663091,00064,30266309100064,O,2008-02-01,,,,2019-11-14T14:00:58,false,2,,13,B,CHE,RENE FANONEL,76930,OCTEVILLE-SUR-MER,,,76481,,,,,,,,,,,,,,,,,,,2010-04-22,F,,,,,47.81Z,NAFRev2,N,0.116091,49.572021,0.75,housenumber,13bis Chemin René Fanonnel 76930 Octeville-sur-Mer,76481_0167_00013_bis,G,13BIS CHEMIN RENE FANONNEL,
303209910,00023,30320991000023,O,1975-02-01,NN,,,2019-11-14T14:00:58,true,3,,20,,RUE,RENE RAAS,76930,OCTEVILLE-SUR-MER,,,76481,,,,,,,,,,,,,,,,,,,2007-12-31,F,,,,,60.2E,NAFRev1,N,0.117837,49.550381,0.96,housenumber,20 Rue René Raas 76930 Octeville-sur-Mer,76481_0169_00020,G,20 RUE RENE RAAS,
303292965,00041,30329296500041,O,2004-09-15,NN,,,2019-11-14T14:00:58,false,4,AEROPORT DU HAVRE,,,,,76930,OCTEVILLE-SUR-MER,,,76481,,,,,,,,,,,,,,,,,,,2007-05-10,F,,,,,29.1A,NAFRev1,O,,,0,,,,,,
303310650,00013,30331065000013,O,,,,,2019-11-14T14:00:58,true,1,,,,RTE,SAINT SUPPLICE,76930,OCTEVILLE-SUR-MER,,,76481,,,,,,,,,,,,,,,,,,,1989-12-31,F,,,,,01.10,NAP,N,0.12818,49.567599,0.67,street,Chemin de Saint-Supplix 76930 Octeville-sur-Mer,76481_0180,G,CHEMIN DE SAINT SUPPLIX,
303445845,00033,30344584500033,O,1991-09-17,NN,,,2019-11-14T14:00:58,false,4,,,,,HAMEAU CRAMOLET,76930,OCTEVILLE-SUR-MER,,,76481,,,,,,,,,,,,,,,,,,,2008-01-02,F,,,,,46.18Z,NAFRev2,N,0.108825,49.562411,0.61,street,Chemin du Cramolet 76930 Octeville-sur-Mer,76481_0045,G,CHEMIN DU CRAMOLET,
303445845,00058,30344584500058,O,2008-01-02,,,,2019-11-14T14:00:58,true,2,,18,,CHE,DE LA BRIERE,76930,OCTEVILLE-SUR-MER,,,76481,,,,,,,,,,,,,,,,,,,2013-12-31,F,,,,,46.18Z,NAFRev2,N,0.107881,49.55959,0.87,housenumber,18 Chemin de la Brière 76930 Octeville-sur-Mer,76481_0034_00018,G,18 CHEMIN DE LA BRIERE,
303656847,01411,30365684701411,O,1998-01-19,,,,2019-11-14T14:00:58,false,2,,,,,AEROPORT,76930,OCTEVILLE-SUR-MER,,,76481,,,,,,,,,,,,,,,,,,,1998-12-25,F,,,,,71.1Z,NAF1993,N,3.9536428,43.5799326,0.89,poi.hotel,Aéroport Hôtel Mauguio,https://osm.org/node/4035558628,G,,
303799365,00018,30379936500018,O,,,,,2019-11-14T14:00:58,true,1,,,,HAM,DE LA BRIERE,76930,OCTEVILLE-SUR-MER,,,76481,,,,,,,,,,,,,,,,,,,1984-12-25,F,,,,,62.41,NAP,N,0.105713,49.560262,0.95,street,Chemin de la Brière 76930 Octeville-sur-Mer,76481_0034,G,CHEMIN DE LA BRIERE,
303810956,00027,30381095600027,O,2011-01-01,,,,2019-11-14T14:00:58,false,2,,24,,RTE,D'ETRETAT,76930,OCTEVILLE-SUR-MER,,,76481,,,,,,,,,,,,,,,,,,,2014-12-31,F,,,,,95.23Z,NAFRev2,N,0.124557,49.581672,0.43,housenumber,24 Route Départementale 940 76930 Octeville-sur-Mer,76481_q2bwsf_00024,G,24 ROUTE DEPARTEMENTALE 940,
304186422,00024,30418642200024,O,1989-11-06,NN,,,2019-11-14T14:00:58,true,3,,,,RUE,DU VIEUX PUITS,76930,OCTEVILLE-SUR-MER,,,76481,,,,,,,,,,,,,,,,,,,2003-12-22,F,,,,,60.2E,NAFRev1,N,0.11334,49.553129,0.95,street,Rue du Vieux Puits 76930 Octeville-sur-Mer,76481_0196,G,RUE DU VIEUX PUITS,
304814536,00013,30481453600013,O,,,,,2019-11-14T14:00:58,true,1,,,,RUE,FELIX FAURE,76930,OCTEVILLE-SUR-MER,,,76481,,,,,,,,,,,,,,,,,,,1995-04-01,F,,,,,52.3A,NAF1993,N,0.116062,49.554748,0.96,street,Rue Félix Faure 76930 Octeville-sur-Mer,76481_0071,G,RUE FELIX FAURE,
305441859,00017,30544185900017,O,,,,,2019-11-14T14:00:58,true,1,,,,RUE,EMILE AUBOURG,76930,OCTEVILLE-SUR-MER,,,76481,,,,,,,,,,,,,,,,,,,1992-06-29,F,,,,,55.3A,NAF1993,N,0.116625,49.555282,0.96,street,Rue Emile Aubourg 76930 Octeville-sur-Mer,76481_0058,G,RUE EMILE AUBOURG,
305587347,00017,30558734700017,O,,,,,2019-11-14T14:00:58,true,1,,,,,HAM DU CAFE BLANC,76930,OCTEVILLE-SUR-MER,,,76481,,,,,,,,,,,,,,,,,,,,F,,,,,55.60,NAP,N,0.120292,49.578656,0.95,street,Rue du Café Blanc 76930 Octeville-sur-Mer,76481_0035,G,RUE DU CAFE BLANC,
306086570,00026,30608657000026,O,1986-11-11,NN,,,2019-11-14T14:00:58,true,1,,,,RTE,DE MONTIVILLIERS,76930,OCTEVILLE-SUR-MER,,,76481,,,,,,,,,,,,,,,,,,,1998-06-30,F,,,,,45.4C,NAF1993,O,0.12431,49.555726,0.88,street,Route de Montivilliers 76930 Octeville-sur-Mer,76481_0075,G,ROUTE DE MONTIVILLIERS,
306091109,00018,30609110900018,O,,NN,,,2019-11-14T14:00:58,true,1,,,,HAM,DU CAFE BLANC,76930,OCTEVILLE-SUR-MER,,,76481,,,,,,,,,,,,,,,,,,,,F,,,,,55.60,NAP,N,0.120292,49.578656,0.95,street,Rue du Café Blanc 76930 Octeville-sur-Mer,76481_0035,G,RUE DU CAFE BLANC,
306093543,00016,30609354300016,O,1900-01-01,NN,,,2019-11-14T14:00:58,false,4,,,,,MAIRIE,76930,OCTEVILLE-SUR-MER,,,76481,,,,,,,,,,,,,,,,,,,2003-04-11,F,,,,,91.3E,NAFRev1,O,0.123865,49.557793,0.66,street,Chemin de la Prairie 76930 Octeville-sur-Mer,76481_0158,G,CHEMIN DE LA PRAIRIE,
306093543,00040,30609354300040,O,2003-04-11,11,2021,,2023-11-30T10:20:02,true,3,SALLE HUART,2,,RUE,AUGUSTE HUART,76930,OCTEVILLE-SUR-MER,,,76481,,,,,,,,,,,,,,,,,,,2008-01-01,A,,,,,94.99Z,NAFRev2,O,0.116245,49.556361,0.96,housenumber,2 Rue Auguste Huart 76930 Octeville-sur-Mer,76481_0013_00002,G,2 RUE AUGUSTE HUART,
306200940,00063,30620094000063,O,2014-01-27,,,,2022-09-20T08:55:09,false,2,,20,,CHE,DU CHAMP D'AVIATION,76930,OCTEVILLE-SUR-MER,,,76481,,,,,,,,,,,,,,,,,,,2018-06-27,F,,,,,70.10Z,NAFRev2,N,0.091757,49.542719,0.89,housenumber,20 Chemin du Champ d'Aviation 76930 Octeville-sur-Mer,76481_0036_00020,G,20 CHEMIN DU CHAMP D AVIATION,
307727883,00026,30772788300026,O,1978-12-31,NN,,,2019-11-14T14:00:58,true,1,,40,,RUE,FELIX FAURE,76930,OCTEVILLE-SUR-MER,,,76481,,,,,,,,,,,,,,,,,,,2002-03-31,F,,,,,55.4B,NAF1993,N,0.11582,49.554195,0.96,housenumber,40 Rue Félix Faure 76930 Octeville-sur-Mer,76481_0071_00040,G,40 RUE FELIX FAURE,
308023761,00023,30802376100023,O,,NN,,,2019-11-14T14:00:58,true,1,,,,,LES HAUTES VALLEES,76930,OCTEVILLE-SUR-MER,,,76481,,,,,,,,,,,,,,,,,,,1992-12-31,F,,,,,20.1A,NAF1993,N,0.131221,49.554186,0.84,street,Rue des Hautes Vallées 76930 Octeville-sur-Mer,76481_0095,G,RUE DES HAUTES VALLEES,
308583640,00062,30858364000062,O,2011-08-10,,,,2019-11-14T14:00:58,true,2,,3,,RTE,DE SAINT BARTHELEMY,76930,OCTEVILLE-SUR-MER,,,76481,,,,,,,,,,,,,,,,,,,2015-09-30,F,,,,,86.90E,NAFRev2,N,0.132582,49.555486,0.89,housenumber,3 Route de Saint-Barthélémy 76930 Octeville-sur-Mer,76481_0176_00003,G,3 ROUTE DE SAINT BARTHELEMY,
309566651,00019,30956665100019,O,1977-01-01,NN,,,2019-11-14T14:00:58,true,4,,,,HAM,DU MOULIN,76930,OCTEVILLE-SUR-MER,,,76481,,,,,,,,,,,,,,,,,,,1997-09-05,F,,,,,51.3A,NAF1993,O,0.103117,49.54825,0.94,street,Chemin du Moulin 76930 Octeville-sur-Mer,76481_0144,G,CHEMIN DU MOULIN,
309737443,00015,30973744300015,O,1900-01-01,NN,,,2019-11-14T14:00:58,true,6,,13,,RTE,DE SAINT BARTHELEMY,76930,OCTEVILLE-SUR-MER,,,76481,,,,,,,,,,,,,,,,,,,2015-12-31,F,,,,,86.21Z,NAFRev2,N,0.145073,49.561385,0.8,street,Route de Saint-Barthélémy 76930 Octeville-sur-Mer,76481_0176,G,ROUTE DE SAINT BARTHELEMY,
309750156,00049,30975015600049,P,2023-07-10,,,,2023-12-11T10:04:32,true,1,[ND],[ND],[ND],[ND],[ND],[ND],OCTEVILLE-SUR-MER,,[ND],76481,[ND],[ND],,,[ND],[ND],[ND],[ND],[ND],[ND],,,[ND],,[ND],[ND],,,2023-07-10,A,[ND],[ND],[ND],[ND],45.20A,NAFRev2,N,,,0,,,,,,
310031406,00021,31003140600021,O,1991-01-01,,,,2019-11-14T14:00:58,false,3,,,,HAM,DE SAINT BARTHELEMY,76930,OCTEVILLE-SUR-MER,,,76481,,,,,,,,,,,,,,,,,,,1999-06-30,F,MABIRE PAYSAGE,,,,01.4B,NAF1993,N,0.145073,49.561385,0.95,street,Route de Saint-Barthélémy 76930 Octeville-sur-Mer,76481_0176,G,ROUTE DE SAINT BARTHELEMY,
310456793,00010,31045679300010,O,1977-01-01,NN,,,2019-11-14T14:00:58,false,4,,,,AV,DE LA PATROUILLE DE FRANCE,76930,OCTEVILLE-SUR-MER,,BP 8,76481,,,,,,,,,,,,,,,,,,,1998-12-31,F,,,,,51.6J,NAF1993,O,0.132183,49.554475,0.44,street,Clos de la Bienveillance 76930 Octeville-sur-Mer,76481_A018,G,CLOS DE LA BIENVEILLANCE,
310799291,00045,31079929100045,O,,NN,,,2019-11-14T14:00:58,true,1,,79,,CHE,DEPARTEMENTAL,76930,OCTEVILLE-SUR-MER,,,76481,,,,,,,,,,,,,,,,,,,1988-03-21,F,,,,,31.12,NAP,N,0.115195,49.562115,0.64,street,Route Départementale 940 76930 Octeville-sur-Mer,76481_q2bwsf,G,ROUTE DEPARTEMENTALE 940,
310883954,00011,31088395400011,O,1977-01-01,NN,,,2019-11-14T14:00:58,false,3,,,,RUE,AUGUSTE HUARD,76930,OCTEVILLE-SUR-MER,,,76481,,,,,,,,,,,,,,,,,,,2004-05-27,F,,,,,60.2E,NAFRev1,N,0.115942,49.556969,0.86,street,Rue Auguste Huart 76930 Octeville-sur-Mer,76481_0013,G,RUE AUGUSTE HUART,
310883954,00029,31088395400029,O,2019-01-01,,,,2019-11-14T14:00:58,true,1,,52,,RUE,D'ECQUEVILLE,76930,OCTEVILLE-SUR-MER,,,76481,,,,,,,,,,,,,,,,,,,2019-01-01,A,,,,,68.20A,NAFRev2,N,0.114677,49.573897,0.97,housenumber,52 Rue d'Ecqueville 76930 Octeville-sur-Mer,76481_0029_00052,G,52 RUE D ECQUEVILLE,
311186696,00010,31118669600010,O,1977-01-01,NN,,,2023-05-05T20:11:04,true,4,,,,HAM,D EDREVILLE,76930,OCTEVILLE-SUR-MER,,,76481,,,,,,,,,,,,,,,,,,,2019-12-25,F,,,,,68.20B,NAFRev2,N,0.102705,49.535074,0.94,street,Chemin d'Edreville 76930 Octeville-sur-Mer,76481_0062,G,CHEMIN D EDREVILLE,
311361711,00048,31136171100048,O,1991-07-01,NN,,,2019-11-14T14:00:58,true,1,,,,,ZI DES HAUTES VALLEES,76930,OCTEVILLE-SUR-MER,,,76481,,,,,,,,,,,,,,,,,,,1999-10-01,F,,,,,51.5L,NAF1993,O,,,0,,,,,,
311414163,00031,31141416300031,O,2003-04-08,02,2021,,2023-11-30T10:20:43,true,3,,4,,AV,DE LA PATROUILLE DE FRANCE,76930,OCTEVILLE-SUR-MER,,CS60627,76481,76059,LE HAVRE CEDEX,,,,,,,,,,,,,,,,,2008-01-01,A,,,,,94.20Z,NAFRev2,O,0.132765,49.554655,0.45,housenumber,4 Clos de la Bienveillance 76930 Octeville-sur-Mer,76481_a018_00004,G,4 CLOS DE LA BIENVEILLANCE,
311691687,00033,31169168700033,O,1995-01-01,NN,,,2023-12-15T13:19:18,true,9,,20,,RUE,FELIX FAURE,76930,OCTEVILLE-SUR-MER,,,76481,,,,,,,,,,,,,,,,,,,2012-06-26,F,8 A HUIT,,,,47.11C,NAFRev2,O,0.115895,49.555198,0.96,housenumber,20 Rue Félix Faure 76930 Octeville-sur-Mer,76481_0071_00020,G,20 RUE FELIX FAURE,
312350929,00039,31235092900039,O,2000-12-01,NN,,,2019-11-14T14:00:58,false,4,,2,,RTE,DE MONTIVILLIERS,76930,OCTEVILLE-SUR-MER,,,76481,,,,,,,,,,,,,,,,,,,2001-03-05,F,,,,,70.3A,NAF1993,N,0.116473,49.555905,0.88,housenumber,2 Route de Montivilliers 76930 Octeville-sur-Mer,76481_0075_00002,G,2 ROUTE DE MONTIVILLIERS,
312669468,00042,31266946800042,O,1996-08-01,NN,,,2019-11-14T14:00:58,false,4,,,,CHE,DU FOND DES VALLEES,76930,OCTEVILLE-SUR-MER,,,76481,,,,,,,,,,,,,,,,,,,2000-03-31,F,,,,,52.1A,NAF1993,O,0.119994,49.543722,0.88,street,Chemin du Fond des Vallées 76930 Octeville-sur-Mer,76481_0076,G,CHEMIN DU FOND DES VALLEES,
312901291,00012,31290129100012,O,,,,,2019-11-14T14:00:58,true,1,,,,CHE,DU TOT,76930,OCTEVILLE-SUR-MER,,,76481,,,,,,,,,,,,,,,,,,,1984-12-25,F,,,,,67.04,NAP,N,0.104496,49.551523,0.79,street,Chemin du Tot 76930 Octeville-sur-Mer,76481_0186,G,CHEMIN DU TOT,
313706913,00016,31370691300016,O,,NN,,,2019-11-14T14:00:58,true,1,,,,RUE,FELIX FAURE,76930,OCTEVILLE-SUR-MER,,,76481,,,,,,,,,,,,,,,,,,,1990-06-10,F,,,,,64.42,NAP,N,0.116062,49.554748,0.96,street,Rue Félix Faure 76930 Octeville-sur-Mer,76481_0071,G,RUE FELIX FAURE,
313897738,00040,31389773800040,O,1999-06-01,11,2021,4322BA,2023-11-30T10:21:07,false,5,,,,CHE,DU CLOS,76930,OCTEVILLE-SUR-MER,,,76481,,,,,,,,,,,,,,,,,,,2022-05-18,F,,,,,43.22A,NAFRev2,O,0.118986,49.544448,0.8,street,Chemin du Clos 76930 Octeville-sur-Mer,76481_0047,G,CHEMIN DU CLOS,
313902959,00029,31390295900029,O,,,,,2019-11-14T14:00:58,true,1,,,,RTE,DE SAINT BARTHELEMY,76930,OCTEVILLE-SUR-MER,,,76481,,,,,,,,,,,,,,,,,,,1984-12-25,F,,,,,69.23,NAP,N,0.145073,49.561385,0.89,street,Route de Saint-Barthélémy 76930 Octeville-sur-Mer,76481_0176,G,ROUTE DE SAINT BARTHELEMY,
314063074,00038,31406307400038,O,,NN,,,2019-11-14T14:00:58,true,1,,,,RTE,DE MONTIVILLIERS,76930,OCTEVILLE-SUR-MER,,,76481,,,,,,,,,,,,,,,,,,,1993-12-31,F,,,,,45.2B,NAF1993,O,0.12431,49.555726,0.88,street,Route de Montivilliers 76930 Octeville-sur-Mer,76481_0075,G,ROUTE DE MONTIVILLIERS,
314622069,00024,31462206900024,O,,NN,,,2019-11-14T14:00:58,true,1,,,,RUE,FELIX FAURE,76930,OCTEVILLE-SUR-MER,,,76481,,,,,,,,,,,,,,,,,,,1988-05-10,F,,,,,64.43,NAP,N,0.116062,49.554748,0.96,street,Rue Félix Faure 76930 Octeville-sur-Mer,76481_0071,G,RUE FELIX FAURE,
314870643,00033,31487064300033,O,1979-01-15,NN,,,2019-11-14T14:00:58,false,4,,3,,CHE,DE SAINT SULPICE,76930,OCTEVILLE-SUR-MER,,,76481,,,,,,,,,,,,,,,,,,,2019-09-12,F,,,,,68.20A,NAFRev2,N,0.124852,49.561873,0.65,housenumber,3 Chemin de Saint-Supplix 76930 Octeville-sur-Mer,76481_0180_00003,G,3 CHEMIN DE SAINT SUPPLIX,
315123174,00031,31512317400031,O,,,,,2019-11-14T14:00:58,true,1,,,,,ZONE INDUSTRIELLE LES VALL,76930,OCTEVILLE-SUR-MER,,,76481,,,,,,,,,,,,,,,,,,,1992-05-22,F,,,,,45.4D,NAF1993,N,5.3654304,43.402753,0.86,poi.industrial,Zone d'Activité Pré de l'Aube (Zone industrielle) Septèmes-les-Vallons,https://osm.org/way/547697527,G,,
315452904,00032,31545290400032,O,2010-01-11,,,,2019-11-14T14:00:58,true,2,,13,,CHE,DES QUATRE FERMES,76930,OCTEVILLE-SUR-MER,,,76481,,,,,,,,,,,,,,,,,,,2014-07-31,F,,,,,46.19B,NAFRev2,N,0.117813,49.545802,0.89,housenumber,13 Chemin des Quatre Fermes 76930 Octeville-sur-Mer,76481_0164_00013,G,13 CHEMIN DES QUATRE FERMES,
316249788,00027,31624978800027,P,2005-09-06,,,,2023-05-17T03:34:34,true,4,[ND],[ND],[ND],[ND],[ND],[ND],OCTEVILLE-SUR-MER,,[ND],76481,[ND],[ND],,,[ND],[ND],[ND],[ND],[ND],[ND],,,[ND],,[ND],[ND],,,2023-05-31,F,[ND],[ND],[ND],[ND],01.11Z,NAFRev2,N,,,0,,,,,,
316325265,00023,31632526500023,O,1991-01-02,,,,2019-11-14T14:00:58,false,4,,,,RUE,AUGUSTE LECONTE,76930,OCTEVILLE-SUR-MER,,,76481,,,,,,,,,,,,,,,,,,,1997-01-01,F,,,,,85.1G,NAF1993,N,0.114372,49.553156,0.87,street,Rue Auguste Le Conte 76930 Octeville-sur-Mer,76481_0014,G,RUE AUGUSTE LE CONTE,
316325273,00019,31632527300019,O,,,,,2019-11-14T14:00:58,true,1,,,,RUE,ASSELIN DE VILLEQUIER,76930,OCTEVILLE-SUR-MER,,,76481,,,,,,,,,,,,,,,,,,,1984-12-25,F,,,,,84.12,NAP,N,0.118111,49.55589,0.96,street,Rue Asselin de Villequier 76930 Octeville-sur-Mer,76481_0011,G,RUE ASSELIN DE VILLEQUIER,
316474220,00027,31647422000027,O,,,,,2019-11-14T14:00:58,true,1,,,,RTE,MONTIVILLIERS,76930,OCTEVILLE-SUR-MER,,,76481,,,,,,,,,,,,,,,,,,,1989-04-28,F,,,,,77.01,NAP,N,0.12431,49.555726,0.86,street,Route de Montivilliers 76930 Octeville-sur-Mer,76481_0075,G,ROUTE DE MONTIVILLIERS,
317450856,00032,31745085600032,O,,NN,,,2019-11-14T14:00:58,true,1,,,,HAM,DE BUGLISE,76930,OCTEVILLE-SUR-MER,,,76481,,,,,,,,,,,,,,,,,,,,F,,,,,84.12,NAP,N,0.127808,49.554447,0.37,street,Impasse de la Découverte 76930 Octeville-sur-Mer,76481_0051,G,IMPASSE DE LA DECOUVERTE,
317491926,00018,31749192600018,O,,,,,2019-11-14T14:00:58,true,1,,,,LD,LA COUCOUNETTE,76930,OCTEVILLE-SUR-MER,,,76481,,,,,,,,,,,,,,,,,,,1985-12-25,F,,,,,55.73,NAP,N,0.127808,49.554447,0.37,street,Impasse de la Découverte 76930 Octeville-sur-Mer,76481_0051,G,IMPASSE DE LA DECOUVERTE,
317730901,00012,31773090100012,O,,NN,,,2019-11-14T14:00:58,true,1,,,,RUE,FELIX FAURE,76930,OCTEVILLE-SUR-MER,,,76481,,,,,,,,,,,,,,,,,,,,F,,,,,64.46,NAP,N,0.116062,49.554748,0.96,street,Rue Félix Faure 76930 Octeville-sur-Mer,76481_0071,G,RUE FELIX FAURE,
317875722,00025,31787572200025,O,1979-05-15,NN,,,2019-11-14T14:00:58,false,3,,,,HAM,BARTHELEMY,76930,OCTEVILLE-SUR-MER,,,76481,,,,,,,,,,,,,,,,,,,2004-12-31,F,ASSOCIE SDF DELAUNAY LUCIEN ET GERARD,,,,05.0A,NAFRev1,N,0.145073,49.561385,0.93,street,Route de Saint-Barthélémy 76930 Octeville-sur-Mer,76481_0176,G,ROUTE DE SAINT BARTHELEMY,
317875722,00033,31787572200033,O,2003-06-01,,,,2019-11-14T14:00:58,true,3,,5,,IMP,DE MERINVILLE,76930,OCTEVILLE-SUR-MER,,,76481,,,,,,,,,,,,,,,,,,,2004-12-31,F,,,,,05.0A,NAFRev1,O,0.150407,49.572055,0.86,housenumber,5 Impasse de Merinville 76930 Octeville-sur-Mer,76481_0134_00005,G,5 IMPASSE DE MERINVILLE,
318072105,00063,31807210500063,O,2004-11-30,NN,,,2019-11-14T14:00:58,true,6,,,,RTE,DE SAINT SUPPLIX,76930,OCTEVILLE-SUR-MER,,,76481,,,,,,,,,,,,,,,,,,,2008-12-31,F,,,,,55.10Z,NAFRev2,N,0.12818,49.567599,0.78,street,Chemin de Saint-Supplix 76930 Octeville-sur-Mer,76481_0180,G,CHEMIN DE SAINT SUPPLIX,
318172558,00047,31817255800047,O,,NN,,,2019-11-14T14:00:58,true,1,,,,,,76930,OCTEVILLE-SUR-MER,,,76481,,,,,,,,,,,,,,,,,,,1988-03-16,F,,,,,60.09,NAP,N,,,0,,,,,,
318596848,00016,31859684800016,O,,,,,2019-11-14T14:00:58,true,1,,,,RUE,ASSELIN DE VILLEQUIER,76930,OCTEVILLE-SUR-MER,,,76481,,,,,,,,,,,,,,,,,,,1984-12-25,F,,,,,59.08,NAP,N,0.118111,49.55589,0.96,street,Rue Asselin de Villequier 76930 Octeville-sur-Mer,76481_0011,G,RUE ASSELIN DE VILLEQUIER,
318610565,00042,31861056500042,O,1998-04-18,,,,2019-11-14T14:00:58,true,3,,9,,RUE,DES HAUTES VALLES,76930,OCTEVILLE-SUR-MER,,,76481,,,,,,,,,,,,,,,,,,,2000-02-07,F,,,,,31.5C,NAF1993,N,0.129879,49.554333,0.91,housenumber,9 Rue des Hautes Vallées 76930 Octeville-sur-Mer,76481_0095_00009,G,9 RUE DES HAUTES VALLEES,
318972684,00019,31897268400019,O,,NN,,,2019-11-14T14:00:58,true,1,,,,RUE,AUGUSTE LECONTE,76930,OCTEVILLE-SUR-MER,,,76481,,,,,,,,,,,,,,,,,,,,F,,,,,52.4N,NAFRev1,N,0.114372,49.553156,0.87,street,Rue Auguste Le Conte 76930 Octeville-sur-Mer,76481_0014,G,RUE AUGUSTE LE CONTE,