siren,nic,siret,statutDiffusionEtablissement,dateCreationEtablissement,trancheEffectifsEtablissement,anneeEffectifsEtablissement,activitePrincipaleRegistreMetiersEtablissement,dateDernierTraitementEtablissement,etablissementSiege,nombrePeriodesEtablissement,complementAdresseEtablissement,numeroVoieEtablissement,indiceRepetitionEtablissement,typeVoieEtablissement,libelleVoieEtablissement,codePostalEtablissement,libelleCommuneEtablissement,libelleCommuneEtrangerEtablissement,distributionSpecialeEtablissement,codeCommuneEtablissement,codeCedexEtablissement,libelleCedexEtablissement,codePaysEtrangerEtablissement,libellePaysEtrangerEtablissement,complementAdresse2Etablissement,numeroVoie2Etablissement,indiceRepetition2Etablissement,typeVoie2Etablissement,libelleVoie2Etablissement,codePostal2Etablissement,libelleCommune2Etablissement,libelleCommuneEtranger2Etablissement,distributionSpeciale2Etablissement,codeCommune2Etablissement,codeCedex2Etablissement,libelleCedex2Etablissement,codePaysEtranger2Etablissement,libellePaysEtranger2Etablissement,dateDebut,etatAdministratifEtablissement,enseigne1Etablissement,enseigne2Etablissement,enseigne3Etablissement,denominationUsuelleEtablissement,activitePrincipaleEtablissement,nomenclatureActivitePrincipaleEtablissement,caractereEmployeurEtablissement,longitude,latitude,geo_score,geo_type,geo_adresse,geo_id,geo_ligne,geo_l4,geo_l5
218702306,00018,21870230600018,O,1983-03-01,02,2021,,2023-11-30T10:18:46,true,4,HOTEL DE VILLE,,,,,87140,LE BUIS,,,87023,,,,,,,,,,,,,,,,,,,2008-01-01,A,MAIRIE,,,,84.11Z,NAFRev2,O,1.202261,46.028296,0.39,street,Rue des 2 Villages 87140 Le Buis,87023_0040,D,RUE DES 2 VILLAGES,
218702306,00034,21870230600034,O,1997-01-01,NN,,,2008-01-04T18:44:33,false,3,,,,IMP,DES ECOLIERS,87140,LE BUIS,,,87023,,,,,,,,,,,,,,,,,,,2008-01-01,A,SERVICE EAUX,,,,36.00Z,NAFRev2,N,1.201044,46.036837,0.82,street,Impasse des Écoliers 87140 Le Buis,87023_0050,G,IMPASSE DES ECOLIERS,
268700390,00019,26870039000019,O,1995-12-25,,,,2006-10-26T23:45:59,true,2,MAIRIE,,,,,87140,LE BUIS,,,87023,,,,,,,,,,,,,,,,,,,2006-04-03,F,CDE,,,,85.3K,NAFRev1,N,1.203872,46.025947,0.38,street,Maison Vieille 87140 Le Buis,87023_B030,D,MAISON VIEILLE,
268702305,00015,26870230500015,O,1983-08-10,NN,,,2010-06-26T03:17:22,true,3,HOTEL DE VILLE,,,,,87140,LE BUIS,,,87023,,,,,,,,,,,,,,,,,,,2008-01-01,A,CCAS,,,,88.99B,NAFRev2,N,1.202261,46.028296,0.39,street,Rue des 2 Villages 87140 Le Buis,87023_0040,D,RUE DES 2 VILLAGES,
304273543,00013,30427354300013,O,,NN,,,,true,1,,,,,LES BARRIERES,87140,LE BUIS,,,87023,,,,,,,,,,,,,,,,,,,1989-11-21,F,,,,,41.07,NAP,N,1.203513,46.0261,0.94,street,Les Barrieres 87140 Le Buis,87023_0r3ryl,G,LES BARRIERES,
313640260,00037,31364026000037,O,,NN,,,,true,1,,,,LD,LE MAZEIREIX,87140,LE BUIS,,,87023,,,,,,,,,,,,,,,,,,,,F,,,,,55.73,NAP,N,1.218578,46.039965,0.83,street,Mazeireix 87140 Le Buis,87023_1gq1pe,G,MAZEIREIX,
315634626,00024,31563462600024,O,,NN,,,,true,1,,,,,PISSEAU,87140,LE BUIS,,,87023,,,,,,,,,,,,,,,,,,,,F,,,,,64.47,NAP,N,1.203484,46.030853,0.45,street,Pissaud 87140 Le Buis,87023_bylyxu,G,PISSAUD,
322743063,00016,32274306300016,O,,,,,,true,1,,,,,A PISSAUD,87140,LE BUIS,,,87023,,,,,,,,,,,,,,,,,,,1984-12-25,F,,,,,55.60,NAP,N,1.203484,46.030853,0.76,street,Pissaud 87140 Le Buis,87023_bylyxu,G,PISSAUD,
324288190,00030,32428819000030,O,2008-07-01,,,,2021-02-23T10:47:20,true,1,,15,,RUE,DU LAVOIR,87140,LE BUIS,,,87023,,,,,,,,,,,,,,,,,,,2008-07-01,A,,,,,01.43Z,NAFRev2,N,1.203308,46.035379,0.94,housenumber,15 Rue du Lavoir 87140 Le Buis,87023_0080_00015,G,15 RUE DU LAVOIR,
333229219,00014,33322921900014,O,1985-06-12,NN,,,2008-01-04T20:36:09,true,3,,,,,LE BOURG,87140,LE BUIS,,,87023,,,,,,,,,,,,,,,,,,,2008-01-01,A,,,,,01.42Z,NAFRev2,N,1.203769,46.029382,0.41,street,Allée de l'Arbre Sans Branches 87140 Le Buis,87023_0010,G,ALLEE DE L ARBRE SANS BRANCHES,
334453602,00024,33445360200024,O,,NN,,,,true,1,,,,LD,MAZEIREIX,87140,LE BUIS,,,87023,,,,,,,,,,,,,,,,,,,1987-05-25,F,,,,,55.60,NAP,N,1.218578,46.039965,0.94,street,Mazeireix 87140 Le Buis,87023_1gq1pe,G,MAZEIREIX,
335259875,00011,33525987500011,O,1986-03-01,00,2021,,2023-11-30T10:26:29,true,3,,16,,RUE,DES ERABLES,87140,LE BUIS,,,87023,,,,,,,,,,,,,,,,,,,2008-01-01,A,,,,,01.50Z,NAFRev2,N,1.200957,46.037219,0.78,housenumber,16 Avenue des Erables 87140 Le Buis,87023_0055_00016,G,16 AVENUE DES ERABLES,
344884044,00019,34488404400019,O,1981-11-01,NN,,,,true,1,,,,,,87140,LE BUIS,,,87023,,,,,,,,,,,,,,,,,,,2002-03-04,F,,,,,01.2C,NAF1993,N,,,0,,,,,,
344884101,00017,34488410100017,O,1985-01-01,NN,,,2008-01-04T22:33:37,true,3,,,,,LEYCURAS,87140,LE BUIS,,,87023,,,,,,,,,,,,,,,,,,,2008-01-01,A,,,,,01.42Z,NAFRev2,N,1.18916,46.031797,0.94,street,Leycuras 87140 Le Buis,87023_4637uj,G,LEYCURAS,
345157986,00018,34515798600018,O,,,,,,true,1,,,,,LE BOURG,87140,LE BUIS,,,87023,,,,,,,,,,,,,,,,,,,1996-02-28,F,,,,,01.2A,NAF1993,N,1.203769,46.029382,0.41,street,Allée de l'Arbre Sans Branches 87140 Le Buis,87023_0010,G,ALLEE DE L ARBRE SANS BRANCHES,
347569121,00010,34756912100010,O,,NN,,,,true,1,,,,LD,PISSEAU,87140,LE BUIS,,,87023,,,,,,,,,,,,,,,,,,,1991-12-31,F,,,,,55.60,NAP,N,1.203484,46.030853,0.45,street,Pissaud 87140 Le Buis,87023_bylyxu,G,PISSAUD,
353181456,00024,35318145600024,O,2017-08-31,,,,2021-10-14T03:32:42,true,1,LA RECLAUDIE,,,,,87140,LE BUIS,,,87023,,,,,,,,,,,,,,,,,,,2017-08-31,A,,,,,68.20B,NAFRev2,N,1.198662,46.03525,0.58,street,Rue du Reclaudis 87140 Le Buis,87023_0120,D,RUE DU RECLAUDIS,
379243017,00017,37924301700017,O,1990-08-31,NN,,,,true,4,,,,,MAZEIREIX,87140,LE BUIS,,,87023,,,,,,,,,,,,,,,,,,,1998-02-25,F,,,,,01.2A,NAF1993,N,1.218578,46.039965,0.94,street,Mazeireix 87140 Le Buis,87023_1gq1pe,G,MAZEIREIX,
392065124,00027,39206512400027,O,,,,,,true,1,,,,,PISSAUD,87140,LE BUIS,,,87023,,,,,,,,,,,,,,,,,,,1997-10-31,F,,,,,52.6E,NAF1993,N,1.203484,46.030853,0.93,street,Pissaud 87140 Le Buis,87023_bylyxu,G,PISSAUD,
404904906,00017,40490490600017,O,1996-02-28,NN,,,2006-10-28T03:25:07,true,3,,,,,LE BOURG,87140,LE BUIS,,,87023,,,,,,,,,,,,,,,,,,,2005-12-31,F,,,,,01.2A,NAFRev1,N,1.203769,46.029382,0.41,street,Allée de l'Arbre Sans Branches 87140 Le Buis,87023_0010,G,ALLEE DE L ARBRE SANS BRANCHES,
409532256,00016,40953225600016,O,1980-01-01,NN,,,,true,4,,,,,,87140,LE BUIS,,,87023,,,,,,,,,,,,,,,,,,,1999-12-31,F,,,,,01.3Z,NAF1993,N,,,0,,,,,,
409532264,00010,40953226400010,O,1981-01-01,NN,,,,true,1,,,,,LEYCURAS,87140,LE BUIS,,,87023,,,,,,,,,,,,,,,,,,,2000-05-31,F,,,,,01.3Z,NAF1993,N,1.18916,46.031797,0.94,street,Leycuras 87140 Le Buis,87023_4637uj,G,LEYCURAS,
410470421,00018,41047042100018,O,1996-12-01,,,,2008-04-15T14:04:51,true,3,,,,,LEYCURAS,87140,LE BUIS,,,87023,,,,,,,,,,,,,,,,,,,2008-01-01,A,,,,,01.42Z,NAFRev2,N,1.18916,46.031797,0.94,street,Leycuras 87140 Le Buis,87023_4637uj,G,LEYCURAS,
417519279,00018,41751927900018,O,,,,,,true,1,,,,,LE BOURG,87140,LE BUIS,,,87023,,,,,,,,,,,,,,,,,,,1998-01-30,F,,,,,01.1A,NAF1993,N,1.203769,46.029382,0.41,street,Allée de l'Arbre Sans Branches 87140 Le Buis,87023_0010,G,ALLEE DE L ARBRE SANS BRANCHES,
429213713,00036,42921371300036,P,2006-03-15,,,,2006-12-15T01:15:17,false,1,[ND],[ND],[ND],[ND],[ND],[ND],LE BUIS,,[ND],87023,[ND],[ND],,,[ND],[ND],[ND],[ND],[ND],[ND],,,[ND],,[ND],[ND],,,2006-03-15,F,[ND],[ND],[ND],[ND],01.2A,NAFRev1,N,,,0,,,,,,
430892414,00011,43089241400011,O,1984-01-01,NN,,,2008-01-05T01:57:04,true,3,,,,,,87140,LE BUIS,,,87023,,,,,,,,,,,,,,,,,,,2008-01-01,A,,,,,01.42Z,NAFRev2,N,,,0,,,,,,
432188423,00011,43218842300011,O,2000-06-01,NN,,,2009-12-09T06:02:06,true,4,,,,,LEYCURAS,87140,LE BUIS,,,87023,,,,,,,,,,,,,,,,,,,2009-12-31,F,,,,,01.45Z,NAFRev2,N,1.18916,46.031797,0.94,street,Leycuras 87140 Le Buis,87023_4637uj,G,LEYCURAS,
434493284,00013,43449328400013,O,2001-02-08,NN,,,2011-12-02T14:33:10,false,4,TIXEUIL GEORGES,,,,PISSAUD,87140,LE BUIS,,,87023,,,,,,,,,,,,,,,,,,,2010-08-01,F,,,,,68.20B,NAFRev2,N,1.203484,46.030853,0.93,street,Pissaud 87140 Le Buis,87023_bylyxu,G,PISSAUD,
484033253,00010,48403325300010,O,2005-08-01,,,,2016-08-31T04:02:30,false,3,,4,,AV,DES BRABLES,87140,LE BUIS,,,87023,,,,,,,,,,,,,,,,,,,2016-07-01,F,,,,,68.20B,NAFRev2,N,1.201343,46.040505,0.66,housenumber,4 Avenue des Erables 87140 Le Buis,87023_0055_00004,G,4 AVENUE DES ERABLES,
484532619,00042,48453261900042,O,2021-11-15,,,,2021-12-04T14:40:24,true,1,LE PUY DE SEUIL,,,,,87140,LE BUIS,,,87023,,,,,,,,,,,,,,,,,,,2021-11-15,A,,,,,46.19B,NAFRev2,N,1.205593,46.046196,0.6,street,Le Puy de Hors 87140 Le Buis,87023_B043,D,LE PUY DE HORS,
491907192,00018,49190719200018,O,1992-01-08,,,,2010-12-07T15:20:49,true,2,,,,,MAIRIE,87140,LE BUIS,,,87023,,,,,,,,,,,,,,,,,,,2008-01-01,A,,,,,94.99Z,NAFRev2,N,1.203872,46.025947,0.38,street,Maison Vieille 87140 Le Buis,87023_B030,G,MAISON VIEILLE,
493996821,00010,49399682100010,O,2007-01-26,,,,2012-07-09T09:32:46,false,3,,,,,MAZEIREIX,87140,LE BUIS,,,87023,,,,,,,,,,,,,,,,,,,2012-06-18,F,,,,,68.20B,NAFRev2,N,1.218578,46.039965,0.94,street,Mazeireix 87140 Le Buis,87023_1gq1pe,G,MAZEIREIX,
507867174,00017,50786717400017,O,2008-07-01,,,,2011-01-21T04:41:19,false,2,,3,,RUE,DES DEUX VILLAGES PISSEAU,87140,LE BUIS,,,87023,,,,,,,,,,,,,,,,,,,2010-08-01,F,,,,,01.11Z,NAFRev2,N,1.202572,46.028767,0.58,housenumber,3 Rue des 2 Villages 87140 Le Buis,87023_0040_00003,G,3 RUE DES 2 VILLAGES,
510102197,00033,51010219700033,O,2016-01-01,,,,2022-07-19T08:43:11,false,2,PISSAUD,3,,IMP,DU PUITS,87140,LE BUIS,,,87023,,,,,,,,,,,,,,,,,,,2022-05-30,F,,,,,96.09Z,NAFRev2,N,1.202469,46.028158,0.81,housenumber,3 Impasse du Puits 87140 Le Buis,87023_0100_00003,G,3 IMPASSE DU PUITS,
518456421,00024,51845642100024,O,2014-11-14,,,,2021-02-23T15:29:47,true,1,PISSAUD,2,,IMP,DU PUIT,87140,LE BUIS,,,87023,,,,,,,,,,,,,,,,,,,2014-11-14,A,,,,,85.51Z,NAFRev2,N,1.202327,46.028096,0.74,housenumber,2 Impasse du Puits 87140 Le Buis,87023_0100_00002,G,2 IMPASSE DU PUITS,
518676317,00010,51867631700010,O,2010-01-01,,,,2009-12-09T06:02:06,true,1,,,,,LEYCURAS,87140,LE BUIS,,,87023,,,,,,,,,,,,,,,,,,,2010-01-01,A,,,,,01.45Z,NAFRev2,N,1.18916,46.031797,0.94,street,Leycuras 87140 Le Buis,87023_4637uj,G,LEYCURAS,
523466175,00016,52346617500016,O,2010-07-01,,,,2022-09-23T09:05:07,true,5,PISSAUD,3,,ALL,DE L'ARBRE SANS BRANCHE,87140,LE BUIS,,,87023,,,,,,,,,,,,,,,,,,,2022-09-20,A,,,,L'ECOLE DU CHAT NOIR,85.52Z,NAFRev2,N,1.203531,46.029422,0.85,housenumber,3 Allée de l'Arbre Sans Branches 87140 Le Buis,87023_0010_00003,G,3 ALLEE DE L ARBRE SANS BRANCHES,
527579296,00015,52757929600015,O,2010-10-06,,,,2013-03-05T09:43:13,false,2,,,,,LE MAZEIREIX,87140,LE BUIS,,,87023,,,,,,,,,,,,,,,,,,,2013-02-11,F,,,,,68.20B,NAFRev2,N,1.218578,46.039965,0.83,street,Mazeireix 87140 Le Buis,87023_1gq1pe,G,MAZEIREIX,
529026965,00010,52902696500010,O,2011-01-01,,,,2010-12-16T07:54:02,true,1,,1,,RUE,DU LAVOIR,87140,LE BUIS,,,87023,,,,,,,,,,,,,,,,,,,2011-01-01,A,,,,,86.90E,NAFRev2,N,1.201672,46.036613,0.94,housenumber,1 Rue du Lavoir 87140 Le Buis,87023_0080_00001,G,1 RUE DU LAVOIR,
533215521,00022,53321552100022,O,2016-02-27,,,,2021-02-23T15:53:50,true,1,,3,,IMP,DU PUITS,87140,LE BUIS,,,87023,,,,,,,,,,,,,,,,,,,2016-02-27,A,,,,,68.20B,NAFRev2,N,1.202469,46.028158,0.81,housenumber,3 Impasse du Puits 87140 Le Buis,87023_0100_00003,G,3 IMPASSE DU PUITS,
538717554,00017,53871755400017,O,2011-12-13,,,7420ZR,2021-02-23T16:00:16,true,1,,5,,RUE,DES 2 VILLAGES,87140,LE BUIS,,,87023,,,,,,,,,,,,,,,,,,,2011-12-13,A,,,,,74.20Z,NAFRev2,N,1.202657,46.027927,0.94,housenumber,5 Rue des 2 Villages 87140 Le Buis,87023_0040_00005,G,5 RUE DES 2 VILLAGES,
767500069,00020,76750006900020,O,2006-12-09,,,,2021-11-06T08:33:08,true,2,LE RECLAUDIS,,,,,87140,LE BUIS,,,87023,,,,,,,,,,,,,,,,,,,2008-01-01,A,,,,,03.22Z,NAFRev2,N,1.198662,46.03525,0.84,street,Rue du Reclaudis 87140 Le Buis,87023_0120,D,RUE DU RECLAUDIS,
771400496,00010,77140049600010,O,,NN,,,,true,1,,,,,,87140,LE BUIS,,,87023,,,,,,,,,,,,,,,,,,,1992-12-31,F,,,,,55.4A,NAF1993,N,,,0,,,,,,
778052779,00031,77805277900031,O,1981-09-01,NN,,,,true,1,,,,,LES BARRIERES,87140,LE BUIS,,,87023,,,,,,,,,,,,,,,,,,,1998-12-31,F,,,,,45.4J,NAF1993,O,1.203513,46.0261,0.94,street,Les Barrieres 87140 Le Buis,87023_0r3ryl,G,LES BARRIERES,
793836842,00013,79383684200013,O,2013-06-17,,,,2014-05-12T08:35:58,false,2,,2,,RUE,LES RENARDIERES,87140,LE BUIS,,,87023,,,,,,,,,,,,,,,,,,,2014-04-01,F,,,,,86.90D,NAFRev2,N,1.210781,46.019932,0.74,housenumber,2 les Renardières 87140 Le Buis,87023_dwn3fi_00002,G,2 LES RENARDIERES,
794251645,00014,79425164500014,O,2013-07-07,,,,2013-07-15T13:47:25,true,1,,6,,,LEYCURAS,87140,LE BUIS,,,87023,,,,,,,,,,,,,,,,,,,2013-07-07,A,,,,,55.20Z,NAFRev2,N,1.188729,46.031427,0.94,housenumber,6 Leycuras 87140 Le Buis,87023_4637uj_00006,G,6 LEYCURAS,
794587121,00011,79458712100011,P,2013-08-01,,,4331ZB,2023-07-12T07:52:23,false,2,[ND],[ND],[ND],[ND],[ND],[ND],LE BUIS,,[ND],87023,[ND],[ND],,,[ND],[ND],[ND],[ND],[ND],[ND],,,[ND],,[ND],[ND],,,2020-12-31,F,[ND],[ND],[ND],[ND],43.31Z,NAFRev2,N,,,0,,,,,,
798332458,00024,79833245800024,O,2017-06-01,,,,2023-05-12T08:50:25,true,2,,6,,RUE,DE LA FONTAINE,87140,LE BUIS,,,87023,,,,,,,,,,,,,,,,,,,2022-08-31,F,,,,,55.20Z,NAFRev2,N,1.202245,46.035314,0.93,housenumber,6 Rue de la Fontaine 87140 Le Buis,87023_0065_00006,G,6 RUE DE LA FONTAINE,
799032719,00012,79903271900012,O,2013-12-06,,,,2015-05-10T04:08:36,true,2,,6,,RTE,DE LA FONTAINE,87140,LE BUIS,,,87023,,,,,,,,,,,,,,,,,,,2015-05-07,F,,,,,32.13Z,NAFRev2,N,1.202245,46.035314,0.81,housenumber,6 Rue de la Fontaine 87140 Le Buis,87023_0065_00006,G,6 RUE DE LA FONTAINE,
817602279,00017,81760227900017,O,2016-01-18,,,4333ZZ,2021-09-23T03:35:28,false,2,,2,,,PUY DES HORS,87140,LE BUIS,,,87023,,,,,,,,,,,,,,,,,,,2021-09-16,F,,,,TENDANCE CARRELAGE 87,43.33Z,NAFRev2,N,1.20654,46.04661,0.69,housenumber,2 Le Puy de Hors 87140 Le Buis,87023_b043_00002,G,2 LE PUY DE HORS,
818079493,00016,81807949300016,O,2016-01-28,,,,2016-09-15T08:22:49,true,2,,4,,AV,DES ERABLES,87140,LE BUIS,,,87023,,,,,,,,,,,,,,,,,,,2016-09-13,F,,,,,85.52Z,NAFRev2,N,1.201343,46.040505,0.82,housenumber,4 Avenue des Erables 87140 Le Buis,87023_0055_00004,G,4 AVENUE DES ERABLES,
830014262,00018,83001426200018,O,2017-06-06,,,9602AB,2019-05-01T04:01:29,true,2,,10,,RUE,DES DEUX VILLAGES,87140,LE BUIS,,,87023,,,,,,,,,,,,,,,,,,,2019-05-01,F,,,,SARAH COIFF',96.02A,NAFRev2,N,1.201864,46.028747,0.75,housenumber,10 Rue des 2 Villages 87140 Le Buis,87023_0040_00010,G,10 RUE DES 2 VILLAGES,
832066328,00010,83206632800010,O,2017-08-17,,,,2022-04-09T03:52:26,false,2,,3,,IMP,DU PUITS PISSAUD,87140,LE BUIS,,,87023,,,,,,,,,,,,,,,,,,,2018-10-30,F,,,,,82.20Z,NAFRev2,N,1.203484,46.030853,0.4,street,Pissaud 87140 Le Buis,87023_bylyxu,G,PISSAUD,
832066328,00028,83206632800028,O,2022-04-25,,,,2022-09-07T03:57:42,true,2,,3,,IMP,DU PUITS,87140,LE BUIS,,,87023,,,,,,,,,,,,,,,,,,,2022-08-01,F,LUDOVIC AUGROS,,,LUDOVIC AUGROS,82.99Z,NAFRev2,N,1.202469,46.028158,0.81,housenumber,3 Impasse du Puits 87140 Le Buis,87023_0100_00003,G,3 IMPASSE DU PUITS,
842977233,00019,84297723300019,O,2018-10-10,,,8211ZP,2020-10-20T08:06:27,true,2,,16,,,LES GOUTTES DE LEYCURAS,87140,LE BUIS,,,87023,,,,,,,,,,,,,,,,,,,2020-09-01,F,,,,JULIE TELESECRETAIRE,82.19Z,NAFRev2,N,1.191455,46.03229,0.93,housenumber,16 Les Gouttes de Leycuras 87140 Le Buis,87023_naao5k_00016,G,16 LES GOUTTES DE LEYCURAS,
848299871,00014,84829987100014,P,2019-02-15,,,,2019-02-14T12:00:58,true,1,[ND],[ND],[ND],[ND],[ND],[ND],LE BUIS,,[ND],87023,[ND],[ND],,,[ND],[ND],[ND],[ND],[ND],[ND],,,[ND],,[ND],[ND],,,2019-02-15,A,[ND],[ND],[ND],[ND],70.22Z,NAFRev2,N,,,0,,,,,,
848649372,00010,84864937200010,P,2019-02-25,,,,2019-02-27T08:36:16,true,1,[ND],[ND],[ND],[ND],[ND],[ND],LE BUIS,,[ND],87023,[ND],[ND],,,[ND],[ND],[ND],[ND],[ND],[ND],,,[ND],,[ND],[ND],,,2019-02-25,A,[ND],[ND],[ND],[ND],18.13Z,NAFRev2,N,,,0,,,,,,
848730651,00017,84873065100017,P,2019-03-01,,,,2019-03-01T08:35:33,true,1,[ND],[ND],[ND],[ND],[ND],[ND],LE BUIS,,[ND],87023,[ND],[ND],,,[ND],[ND],[ND],[ND],[ND],[ND],,,[ND],,[ND],[ND],,,2019-03-01,A,[ND],[ND],[ND],[ND],93.29Z,NAFRev2,N,,,0,,,,,,
849816962,00013,84981696200013,O,2019-04-01,,,,2020-04-17T03:38:42,false,2,,3,,,MAISONS VIEILLES,87140,LE BUIS,,,87023,,,,,,,,,,,,,,,,,,,2020-04-10,F,,,,,01.11Z,NAFRev2,N,1.203964,46.026203,0.71,housenumber,3 Maison Vieille 87140 Le Buis,87023_b030_00003,G,3 MAISON VIEILLE,
850600115,00016,85060011500016,O,2019-05-01,,,,2021-04-30T17:09:05,false,2,,9,,RUE,DE LA MONNAIE,87140,LE BUIS,,,87023,,,,,,,,,,,,,,,,,,,2021-03-30,F,,,,,70.22Z,NAFRev2,N,1.203643,46.027632,0.94,housenumber,9 Rue de la Monnaie 87140 Le Buis,87023_0090_00009,G,9 RUE DE LA MONNAIE,
850600115,00024,85060011500024,O,2021-04-01,,,,2021-05-08T13:18:56,true,1,,9,,RUE,DE LA MONNAIE,87140,LE BUIS,,,87023,,,,,,,,,,,,,,,,,,,2021-04-01,A,,,,,01.45Z,NAFRev2,N,1.203643,46.027632,0.94,housenumber,9 Rue de la Monnaie 87140 Le Buis,87023_0090_00009,G,9 RUE DE LA MONNAIE,
879609550,00014,87960955000014,O,2019-10-15,,,,2022-02-16T04:22:05,true,2,4 LES BARRIERES,,,,,87140,LE BUIS,,,87023,,,,,,,,,,,,,,,,,,,2022-02-14,F,,,,,46.19B,NAFRev2,N,1.202352,46.026181,0.94,housenumber,4 Les Barrieres 87140 Le Buis,87023_0r3ryl_00004,D,4 LES BARRIERES,
889266201,00017,88926620100017,O,2020-09-01,01,2021,,2023-11-30T11:34:18,true,1,LEYCURAS,16,,,LES GOUTTES,87140,LE BUIS,,,87023,,,,,,,,,,,,,,,,,,,2020-09-01,A,,,,,70.22Z,NAFRev2,O,1.191455,46.03229,0.91,housenumber,16 Les Gouttes de Leycuras 87140 Le Buis,87023_naao5k_00016,G,16 LES GOUTTES DE LEYCURAS,
902428234,00014,90242823400014,P,2021-09-06,,,4399CZ,2021-08-20T08:51:31,true,1,[ND],[ND],[ND],[ND],[ND],[ND],LE BUIS,,[ND],87023,[ND],[ND],,,[ND],[ND],[ND],[ND],[ND],[ND],,,[ND],,[ND],[ND],,,2021-09-06,A,[ND],[ND],[ND],[ND],43.99C,NAFRev2,N,,,0,,,,,,
905386462,00014,90538646200014,O,2021-12-01,,,1623ZZ,2021-12-03T14:58:17,true,1,,8,B,,MAZEIREIX,87140,LE BUIS,,,87023,,,,,,,,,,,,,,,,,,,2021-12-01,A,,,,METAL CONCEPT 87,25.62B,NAFRev2,N,1.21957,46.040203,0.8,housenumber,8bis Mazeireix 87140 Le Buis,87023_1gq1pe_00008_bis,G,8BIS MAZEIREIX,
907749907,00016,90774990700016,O,2021-11-08,,,,2021-12-02T04:15:06,true,1,,6,,RUE,DES DEUX VILLAGES,87140,LE BUIS,,,87023,,,,,,,,,,,,,,,,,,,2021-11-08,A,,,,,46.19B,NAFRev2,N,1.20238,46.028918,0.74,housenumber,6 Rue des 2 Villages 87140 Le Buis,87023_0040_00006,G,6 RUE DES 2 VILLAGES,
909952996,00017,90995299600017,O,2021-05-05,,,,2022-02-04T03:52:59,true,1,,2,,IMP,DES ECOLIERS,87140,LE BUIS,,,87023,,,,,,,,,,,,,,,,,,,2021-05-05,A,,,,,94.99Z,NAFRev2,N,1.201044,46.036837,0.83,housenumber,2 Impasse des Écoliers 87140 Le Buis,87023_0050_00002,G,2 IMPASSE DES ECOLIERS,
914311931,00010,91431193100010,P,2022-06-13,,,,2023-09-05T08:11:36,true,2,[ND],[ND],[ND],[ND],[ND],[ND],LE BUIS,,[ND],87023,[ND],[ND],,,[ND],[ND],[ND],[ND],[ND],[ND],,,[ND],,[ND],[ND],,,2022-11-07,A,[ND],[ND],[ND],[ND],90.03A,NAFRev2,N,,,0,,,,,,
919961466,00019,91996146600019,O,2022-09-09,,,,2022-10-04T09:38:09,true,1,,8,,,PONT DE MONT SIGOU,87140,LE BUIS,,,87023,,,,,,,,,,,,,,,,,,,2022-09-09,A,,,,,96.09Z,NAFRev2,N,1.200379,46.023249,0.89,housenumber,8 Le Pont de Mont Sigou 87140 Le Buis,87023_b039_00008,G,8 LE PONT DE MONT SIGOU,
