siren,nic,siret,statutDiffusionEtablissement,dateCreationEtablissement,trancheEffectifsEtablissement,anneeEffectifsEtablissement,activitePrincipaleRegistreMetiersEtablissement,dateDernierTraitementEtablissement,etablissementSiege,nombrePeriodesEtablissement,complementAdresseEtablissement,numeroVoieEtablissement,indiceRepetitionEtablissement,typeVoieEtablissement,libelleVoieEtablissement,codePostalEtablissement,libelleCommuneEtablissement,libelleCommuneEtrangerEtablissement,distributionSpecialeEtablissement,codeCommuneEtablissement,codeCedexEtablissement,libelleCedexEtablissement,codePaysEtrangerEtablissement,libellePaysEtrangerEtablissement,complementAdresse2Etablissement,numeroVoie2Etablissement,indiceRepetition2Etablissement,typeVoie2Etablissement,libelleVoie2Etablissement,codePostal2Etablissement,libelleCommune2Etablissement,libelleCommuneEtranger2Etablissement,distributionSpeciale2Etablissement,codeCommune2Etablissement,codeCedex2Etablissement,libelleCedex2Etablissement,codePaysEtranger2Etablissement,libellePaysEtranger2Etablissement,dateDebut,etatAdministratifEtablissement,enseigne1Etablissement,enseigne2Etablissement,enseigne3Etablissement,denominationUsuelleEtablissement,activitePrincipaleEtablissement,nomenclatureActivitePrincipaleEtablissement,caractereEmployeurEtablissement,longitude,latitude,geo_score,geo_type,geo_adresse,geo_id,geo_ligne,geo_l4,geo_l5
218709509,00010,21870950900010,O,1983-03-01,11,2021,,2023-11-30T10:18:46,true,4,,,,,LE BOURG,87380,MEUZAC,,,87095,,,,,,,,,,,,,,,,,,,2008-01-01,A,MAIRIE,,,,84.11Z,NAFRev2,O,1.441693,45.552921,0.92,street,Le Bourg Nord 87380 Meuzac,87095_B027,G,LE BOURG NORD,
218709509,00036,21870950900036,O,1983-12-21,01,2021,,2023-11-30T10:18:46,false,3,,,,,,87380,MEUZAC,,,87095,,,,,,,,,,,,,,,,,,,2008-01-01,A,ECOLE PRIMAIRE PUBLIQUE,,,,85.20Z,NAFRev2,N,,,0,,,,,,
218709509,00044,21870950900044,O,1996-01-01,NN,,,2008-01-04T18:44:39,false,3,MAIRIE,,,,LE BOURG,87380,MEUZAC,,,87095,,,,,,,,,,,,,,,,,,,2008-01-01,A,SERVICE EAUX ET ASSAINISSEMENT,,,,36.00Z,NAFRev2,N,1.441693,45.552921,0.92,street,Le Bourg Nord 87380 Meuzac,87095_B027,G,LE BOURG NORD,
218709509,00051,21870950900051,O,1997-05-01,NN,,,2008-01-04T18:44:39,false,3,MAIRIE,,,,,87380,MEUZAC,,,87095,,,,,,,,,,,,,,,,,,,2008-01-01,A,COMMERCE MULTI SERVICE,,,,68.20B,NAFRev2,N,1.437952,45.552069,0.38,street,Place du 8 Mai 1945 87380 Meuzac,87095_0070,D,PLACE DU 8 MAI 1945,
218709509,00069,21870950900069,O,2001-01-01,NN,,,2008-01-04T18:44:39,false,3,MAIRIE,,,,LE BOURG,87380,MEUZAC,,,87095,,,,,,,,,,,,,,,,,,,2008-01-01,A,LOTISSEMENT  RESIDENCE DU LAC,,,,42.99Z,NAFRev2,N,1.441693,45.552921,0.92,street,Le Bourg Nord 87380 Meuzac,87095_B027,G,LE BOURG NORD,
218709509,00077,21870950900077,O,2003-05-01,NN,,,2008-01-04T18:44:39,false,3,,,,,,87380,MEUZAC,,,87095,,,,,,,,,,,,,,,,,,,2008-01-01,A,CAMPING MUNICIPAL DES BOUVREUILS,,,,55.30Z,NAFRev2,N,,,0,,,,,,
218709509,00085,21870950900085,O,2007-01-01,,,,2023-07-10T16:34:54,false,2,MAIRIE,,,,LE BOURG,87380,MEUZAC,,,87095,,,,,,,,,,,,,,,,,,,2008-01-01,A,LOTISSEMENT LE HAMEAU VERGNES,,,,42.99Z,NAFRev2,N,1.441693,45.552921,0.92,street,Le Bourg Nord 87380 Meuzac,87095_B027,G,LE BOURG NORD,
258728583,00018,25872858300018,O,1999-01-22,NN,,,2015-05-14T03:48:17,true,5,MAIRIE,,,,,87380,MEUZAC,,,87095,,,,,,,,,,,,,,,,,,,2013-12-31,F,,,,,91.01Z,NAFRev2,O,1.437952,45.552069,0.38,street,Place du 8 Mai 1945 87380 Meuzac,87095_0070,D,PLACE DU 8 MAI 1945,
268709508,00017,26870950800017,O,1983-08-10,NN,,,2010-06-26T03:17:24,true,3,HOTEL DE VILLE,,,,MAIRIE,87380,MEUZAC,,,87095,,,,,,,,,,,,,,,,,,,2008-01-01,A,CCAS,,,,88.99B,NAFRev2,N,1.437952,45.552069,0.38,street,Place du 8 Mai 1945 87380 Meuzac,87095_0070,G,PLACE DU 8 MAI 1945,
300007994,00019,30000799400019,O,1974-01-01,12,2021,,2023-11-30T10:19:18,true,6,LE BOURG MEUZAC,,,,LE BOURG,87380,MEUZAC,,,87095,,,,,,,,,,,,,,,,,,,2022-02-07,A,,,,,19.20Z,NAFRev2,O,1.441693,45.552921,0.92,street,Le Bourg Nord 87380 Meuzac,87095_B027,G,LE BOURG NORD,
302418702,00015,30241870200015,O,,NN,,,,true,1,,,,LD,LA BERNARDIERE,87380,MEUZAC,,,87095,,,,,,,,,,,,,,,,,,,1986-12-25,F,,,,,48.01,NAP,N,1.380763,45.558763,0.77,locality,La Bernardie 87380 Meuzac,87095_f0poav,G,LA BERNARDIE,
302449137,00017,30244913700017,O,,NN,,,,true,1,,,,,,87380,MEUZAC,,,87095,,,,,,,,,,,,,,,,,,,,F,,,,,55.40,NAP,N,,,0,,,,,,
302542162,00037,30254216200037,O,2008-05-06,,,4722ZB,2015-03-17T00:11:08,true,2,,,,,PLACE DU 8 MAI 1945,87380,MEUZAC,,,87095,,,,,,,,,,,,,,,,,,,2013-09-30,F,,,,,47.22Z,NAFRev2,N,1.437952,45.552069,0.94,street,Place du 8 Mai 1945 87380 Meuzac,87095_0070,G,PLACE DU 8 MAI 1945,
303687339,00018,30368733900018,O,1967-01-01,NN,,,2008-11-07T00:19:20,false,3,,,,,,87380,MEUZAC,,,87095,,,,,,,,,,,,,,,,,,,2003-09-22,F,,,,,14.2A,NAFRev1,,,,0,,,,,,
303933220,00012,30393322000012,O,,,,,,true,1,,,,,CHATAIGNOL,87380,MEUZAC,,,87095,,,,,,,,,,,,,,,,,,,1997-03-28,F,,,,,02.0B,NAF1993,N,1.412864,45.55135,0.94,street,Châtaignol 87380 Meuzac,87095_q9ul0o,G,CHATAIGNOL,
304557465,00016,30455746500016,O,1900-01-01,NN,,,2006-11-25T09:17:37,true,4,,,,,LE BOURG,87380,MEUZAC,,,87095,,,,,,,,,,,,,,,,,,,1991-12-25,F,,,,,86.06,NAP,N,1.441693,45.552921,0.92,street,Le Bourg Nord 87380 Meuzac,87095_B027,G,LE BOURG NORD,
305185035,00030,30518503500030,O,1990-05-04,NN,,9602AA,2015-03-18T00:59:14,true,4,,,,,LE BOURG,87380,MEUZAC,,,87095,,,,,,,,,,,,,,,,,,,2014-12-31,F,,,,,96.02A,NAFRev2,N,1.441693,45.552921,0.92,street,Le Bourg Nord 87380 Meuzac,87095_B027,G,LE BOURG NORD,
306089384,00011,30608938400011,O,1975-01-01,NN,,,2010-11-24T09:53:50,false,4,,,,,FORGENEUVE,87380,MEUZAC,,,87095,,,,,,,,,,,,,,,,,,,2008-01-01,F,AUBERGE DE L'ETANG,,,,68.20B,NAFRev2,N,1.427803,45.545206,0.94,locality,Forgeneuve 87380 Meuzac,87095_ptb164,G,FORGENEUVE,
306089384,00029,30608938400029,O,1979-07-01,NN,,,2016-03-17T11:41:06,true,4,,,,,,87380,MEUZAC,,,87095,,,,,,,,,,,,,,,,,,,2015-10-30,F,,,,,01.42Z,NAFRev2,N,,,0,,,,,,
306089517,00016,30608951700016,O,,NN,,,,true,1,,,,,FORGENEUVE,87380,MEUZAC,,,87095,,,,,,,,,,,,,,,,,,,1991-02-28,F,,,,,81.21,NAP,N,1.427803,45.545206,0.94,locality,Forgeneuve 87380 Meuzac,87095_ptb164,G,FORGENEUVE,
306313891,00013,30631389100013,O,,NN,,,,true,1,,,,,,87380,MEUZAC,,,87095,,,,,,,,,,,,,,,,,,,1991-02-28,F,,,,,81.21,NAP,N,,,0,,,,,,
306588690,00017,30658869000017,O,,NN,,,,true,1,,,,,MUSTANG RANCH,87380,MEUZAC,,,87095,,,,,,,,,,,,,,,,,,,,F,,,,,86.10,NAP,N,,,0,,,,,,
306704198,00028,30670419800028,O,1985-06-08,NN,,,,true,1,,,,LD,LE BOURG,87380,MEUZAC,,,87095,,,,,,,,,,,,,,,,,,,1999-06-30,F,,,,,52.2J,NAF1993,N,1.441693,45.552921,0.92,street,Le Bourg Nord 87380 Meuzac,87095_B027,G,LE BOURG NORD,
309102275,00018,30910227500018,O,1977-01-01,NN,,,2008-11-07T00:23:51,true,3,,,,,LOTISSEMENT DU LAC,87380,MEUZAC,,,87095,,,,,,,,,,,,,,,,,,,2005-11-30,F,,,,,45.2V,NAFRev1,N,1.441355,45.548936,0.4,street,Allée du Lac 87380 Meuzac,87095_0090,G,ALLEE DU LAC,
309259620,00024,30925962000024,O,,,,,,true,1,,,,LD,FORGENEUVE,87380,MEUZAC,,,87095,,,,,,,,,,,,,,,,,,,1991-03-13,F,,,,,67.08,NAP,N,1.427803,45.545206,0.94,locality,Forgeneuve 87380 Meuzac,87095_ptb164,G,FORGENEUVE,
310014246,00014,31001424600014,O,1977-01-01,NN,,,2016-04-26T01:59:12,true,5,,,,,LE BOURG,87380,MEUZAC,,,87095,,,,,,,,,,,,,,,,,,,2014-09-30,F,,,,,55.10Z,NAFRev2,O,1.441693,45.552921,0.92,street,Le Bourg Nord 87380 Meuzac,87095_B027,G,LE BOURG NORD,
312011935,00045,31201193500045,O,1998-03-01,,,,,true,1,,,,,MAIRIE,87380,MEUZAC,,,87095,,,,,,,,,,,,,,,,,,,1998-12-31,F,,,,,92.3F,NAF1993,N,1.437952,45.552069,0.38,street,Place du 8 Mai 1945 87380 Meuzac,87095_0070,G,PLACE DU 8 MAI 1945,
312132848,00010,31213284800010,O,,NN,,,,true,1,,,,,,87380,MEUZAC,,,87095,,,,,,,,,,,,,,,,,,,1995-12-25,F,,,,,70.2C,NAF1993,N,,,0,,,,,,
313640211,00022,31364021100022,O,1995-06-07,NN,,,2020-08-27T08:32:49,false,4,,,,RTE,DU LAC,87380,MEUZAC,,,87095,,,,,,,,,,,,,,,,,,,2020-06-30,F,,,,,86.90E,NAFRev2,N,1.441355,45.548936,0.68,street,Allée du Lac 87380 Meuzac,87095_0090,G,ALLEE DU LAC,
315645630,00023,31564563000023,O,1984-09-01,NN,,3831ZA,2015-03-17T00:13:48,true,3,,,,,LIEU DIT CHATAIGNOL,87380,MEUZAC,,,87095,,,,,,,,,,,,,,,,,,,2008-01-01,A,,,,,93.21Z,NAFRev2,N,1.412864,45.55135,0.94,street,Châtaignol 87380 Meuzac,87095_q9ul0o,G,CHATAIGNOL,
317024495,00010,31702449500010,O,,NN,,,,true,1,,,,,,87380,MEUZAC,,,87095,,,,,,,,,,,,,,,,,,,1992-12-31,F,,,,,51.3C,NAF1993,N,,,0,,,,,,
317158061,00026,31715806100026,O,1900-01-01,NN,,,2011-04-28T00:16:39,false,4,,,,RUE,DU 11 NOVEMBRE,87380,MEUZAC,,,87095,,,,,,,,,,,,,,,,,,,1995-03-25,F,,,,,52.2C,NAF1993,N,1.439347,45.55255,0.94,street,Rue du 11 Novembre 1918 87380 Meuzac,87095_0500,G,RUE DU 11 NOVEMBRE 1918,
317743516,00013,31774351600013,O,,NN,,,,true,1,,,,LD,LE REVEIL,87380,MEUZAC,,,87095,,,,,,,,,,,,,,,,,,,1987-06-30,F,,,,,60.01,NAP,N,1.434133,45.547168,0.94,street,Le Reveil 87380 Meuzac,87095_w4bu9g,G,LE REVEIL,
320643372,00016,32064337200016,O,,,,,,true,1,,,,,VILLENEUVE,87380,MEUZAC,,,87095,,,,,,,,,,,,,,,,,,,1984-12-25,F,,,,,02.20,NAP,N,1.420279,45.556464,0.94,locality,Villeneuve 87380 Meuzac,87095_339f33,G,VILLENEUVE,
321734006,00018,32173400600018,O,,NN,,,,true,1,,,,RTE,RUE PRINCIPALE,87380,MEUZAC,,,87095,,,,,,,,,,,,,,,,,,,1987-07-29,F,,,,,00.10,NAP,N,,,0,,,,,,
322129362,00016,32212936200016,O,,,,,,true,1,,,,,PIERRELAINE,87380,MEUZAC,,,87095,,,,,,,,,,,,,,,,,,,1990-12-19,F,,,,,62.42,NAP,N,1.45103,45.563661,0.79,locality,Pierre Laine 87380 Meuzac,87095_3jz2gk,G,PIERRE LAINE,
322466137,00161,32246613700161,O,2021-01-02,,,4334ZC,2021-11-20T03:35:26,false,4,,2,,,LE REVEIL,87380,MEUZAC,,,87095,,,,,,,,,,,,,,,,,,,2021-10-21,F,,,,DAVID RENOVATION,43.34Z,NAFRev2,N,1.435374,45.548383,0.94,housenumber,2 Le Reveil 87380 Meuzac,87095_w4bu9g_00002,G,2 LE REVEIL,
324041052,00014,32404105200014,O,,NN,,,,true,1,,,,,BOURG,87380,MEUZAC,,,87095,,,,,,,,,,,,,,,,,,,1997-10-31,F,,,,,50.1Z,NAF1993,O,1.441693,45.552921,0.91,street,Le Bourg Nord 87380 Meuzac,87095_B027,G,LE BOURG NORD,
325014371,00018,32501437100018,O,,,,,,true,1,,,,,FORGENEUVE,87380,MEUZAC,,,87095,,,,,,,,,,,,,,,,,,,1984-12-25,F,,,,,67.08,NAP,N,1.427803,45.545206,0.94,locality,Forgeneuve 87380 Meuzac,87095_ptb164,G,FORGENEUVE,
325525335,00015,32552533500015,O,1982-07-06,NN,,,2009-06-27T04:34:29,true,3,,,,,,87380,MEUZAC,,,87095,,,,,,,,,,,,,,,,,,,2007-06-23,F,,,,,85.1C,NAFRev1,N,,,0,,,,,,
325949030,00010,32594903000010,O,1900-01-01,NN,,,2011-04-28T00:22:19,false,3,,,,RUE,DU 11 NOVEMBRE,87380,MEUZAC,,,87095,,,,,,,,,,,,,,,,,,,1991-12-25,F,,,,,55.60,NAP,N,1.439347,45.55255,0.94,street,Rue du 11 Novembre 1918 87380 Meuzac,87095_0500,G,RUE DU 11 NOVEMBRE 1918,
325949030,00028,32594903000028,O,2010-06-29,,,4332AA,2021-02-23T10:48:12,true,1,,,,,LES PLANCHES,87380,MEUZAC,,,87095,,,,,,,,,,,,,,,,,,,2010-06-29,A,,,,,43.32A,NAFRev2,N,1.384153,45.554164,0.94,street,Les Planches 87380 Meuzac,87095_gc9yd9,G,LES PLANCHES,
325999563,00027,32599956300027,O,1999-09-10,NN,,,2009-06-27T04:35:54,true,3,,,,,LES BESSAILLES,87380,MEUZAC,,,87095,,,,,,,,,,,,,,,,,,,2007-12-31,F,,,,,01.4A,NAFRev1,N,1.365846,45.537161,0.94,locality,Les Bessailles 87380 Meuzac,87095_dspxaf,G,LES BESSAILLES,
326957248,00023,32695724800023,O,1992-04-01,NN,,,2022-02-17T14:16:44,false,4,,,,,LE REVEIL,87380,MEUZAC,,,87095,,,,,,,,,,,,,,,,,,,2008-01-01,F,,,,,47.89Z,NAFRev2,O,1.434133,45.547168,0.94,street,Le Reveil 87380 Meuzac,87095_w4bu9g,G,LE REVEIL,
326957248,00049,32695724800049,O,2022-02-16,,,,2022-03-05T12:54:52,true,1,,4,,RUE,DU 19 MARS 1962,87380,MEUZAC,,,87095,,,,,,,,,,,,,,,,,,,2022-02-16,A,,,,,47.89Z,NAFRev2,O,1.437827,45.550433,0.95,housenumber,4 Rue du 19 Mars 1962 87380 Meuzac,87095_0047_00004,G,4 RUE DU 19 MARS 1962,
327577276,00014,32757727600014,O,,,,,,true,1,,,,,LE LAC,87380,MEUZAC,,,87095,,,,,,,,,,,,,,,,,,,1985-12-25,F,,,,,00.97,NAP,N,1.441355,45.548936,0.53,street,Allée du Lac 87380 Meuzac,87095_0090,G,ALLEE DU LAC,
329183495,00012,32918349500012,O,1984-02-21,NN,,9602AA,2019-12-06T13:08:20,true,7,,,,RUE,DU 11 NOVEMBRE,87380,MEUZAC,,,87095,,,,,,,,,,,,,,,,,,,2019-11-30,F,,,,,96.02A,NAFRev2,O,1.439347,45.55255,0.94,street,Rue du 11 Novembre 1918 87380 Meuzac,87095_0500,G,RUE DU 11 NOVEMBRE 1918,
329892624,00019,32989262400019,O,,NN,,,,true,1,,,,,,87380,MEUZAC,,,87095,,,,,,,,,,,,,,,,,,,1996-01-01,F,,,,,70.2C,NAF1993,N,,,0,,,,,,
330791617,00013,33079161700013,O,1984-10-01,NN,,,,true,1,,,,,,87380,MEUZAC,,,87095,,,,,,,,,,,,,,,,,,,1998-12-31,F,,,,,15.8C,NAF1993,O,,,0,,,,,,
332208818,00010,33220881800010,O,1985-04-02,NN,,,2006-11-25T10:19:01,true,3,,,,,LE BOURG,87380,MEUZAC,,,87095,,,,,,,,,,,,,,,,,,,2005-12-24,F,,,,,55.4B,NAFRev1,N,1.441693,45.552921,0.92,street,Le Bourg Nord 87380 Meuzac,87095_B027,G,LE BOURG NORD,
333370898,00012,33337089800012,O,1984-12-10,NN,,,2010-12-21T08:52:18,true,4,,,,,,87380,MEUZAC,,,87095,,,,,,,,,,,,,,,,,,,2009-12-25,F,,,,,68.20B,NAFRev2,N,,,0,,,,,,
334363827,00034,33436382700034,O,2004-09-14,NN,,,2006-10-27T02:37:39,true,1,,,,,BESSAILLES,87380,MEUZAC,,,87095,,,,,,,,,,,,,,,,,,,2004-09-14,F,,,,,,,N,1.365846,45.537161,0.93,locality,Les Bessailles 87380 Meuzac,87095_dspxaf,G,LES BESSAILLES,
334815859,00015,33481585900015,O,,NN,,,,true,1,,,,,,87380,MEUZAC,,,87095,,,,,,,,,,,,,,,,,,,1990-01-23,F,,,,,49.01,NAP,N,,,0,,,,,,
338665615,00021,33866561500021,O,,NN,,,,true,1,,,,,LOTISSEMENT DE LA RES DU L,87380,MEUZAC,,,87095,,,,,,,,,,,,,,,,,,,1993-12-31,F,,,,,70.1F,NAF1993,N,,,0,,,,,,
339033177,00017,33903317700017,O,1900-01-01,NN,,,2013-09-17T15:00:29,false,3,,,,RTE,DE LUBERSAC,87380,MEUZAC,,,87095,,,,,,,,,,,,,,,,,,,1994-10-26,F,,,,,45.1A,NAF1993,N,1.412429,45.541624,0.44,street,Route de la Vache Orange 87380 Meuzac,87095_0146,G,ROUTE DE LA VACHE ORANGE,
339033177,00025,33903317700025,O,2013-10-01,,,,2023-01-06T03:35:20,true,2,,,,,RESIDENCE DU LAC,87380,MEUZAC,,,87095,,,,,,,,,,,,,,,,,,,2023-01-02,F,,,,,43.12A,NAFRev2,N,1.441355,45.548936,0.48,street,Allée du Lac 87380 Meuzac,87095_0090,G,ALLEE DU LAC,
340551498,00025,34055149800025,O,2014-03-01,,,,2015-06-26T11:02:52,false,1,LE BOURG,,,RUE,DE L'EGLISE,87380,MEUZAC,,,87095,,,,,,,,,,,,,,,,,,,2014-03-01,F,,,,,16.29Z,NAFRev2,N,1.412453,45.570083,0.76,street,Impasse de l’Eglise 87380 Meuzac,87095_0185,G,IMPASSE DE L EGLISE,
340551498,00033,34055149800033,O,2015-07-01,,,1629ZA,2018-02-02T04:43:25,true,2,,5,,RTE,DU PONT,87380,MEUZAC,,,87095,,,,,,,,,,,,,,,,,,,2018-01-31,F,,,,LA GRAVURE LIMOUSINE,16.29Z,NAFRev2,N,1.438139,45.553595,0.81,housenumber,5 Route du Pont 87380 Meuzac,87095_0115_00005,G,5 ROUTE DU PONT,
342058773,00017,34205877300017,O,1987-08-01,NN,,,,true,1,,,,,LA FAYOLLE,87380,MEUZAC,,,87095,,,,,,,,,,,,,,,,,,,2001-09-30,F,,,,,51.2A,NAF1993,N,1.388757,45.532364,0.94,locality,La Fayolle 87380 Meuzac,87095_abr9xg,G,LA FAYOLLE,
342223427,00010,34222342700010,O,,NN,,,,true,1,,,,LD,ROYER,87380,MEUZAC,,,87095,,,,,,,,,,,,,,,,,,,1988-05-18,F,,,,,64.11,NAP,N,1.399281,45.525635,0.94,locality,Royer 87380 Meuzac,87095_pqc3f1,G,ROYER,
348238387,00016,34823838700016,O,1988-10-07,NN,,,,true,1,,,,,CHATAIGNOL,87380,MEUZAC,,,87095,,,,,,,,,,,,,,,,,,,2001-04-13,F,,,,,02.0D,NAF1993,N,1.412864,45.55135,0.94,street,Châtaignol 87380 Meuzac,87095_q9ul0o,G,CHATAIGNOL,
349520460,00024,34952046000024,O,1991-09-04,NN,,,2006-10-27T03:50:55,false,3,,,,,,87380,MEUZAC,,,87095,,,,,,,,,,,,,,,,,,,2005-02-10,F,,,,,60.2A,NAFRev1,N,,,0,,,,,,
350453361,00023,35045336100023,O,1995-01-10,NN,,,,true,1,,,,,VILLENEUVE,87380,MEUZAC,,,87095,,,,,,,,,,,,,,,,,,,2001-05-31,F,,,,,85.1G,NAF1993,N,1.420279,45.556464,0.94,locality,Villeneuve 87380 Meuzac,87095_339f33,G,VILLENEUVE,
350723854,00013,35072385400013,O,1988-01-01,NN,,,2011-04-26T03:10:20,true,4,,,,,LA RIBIERE,87380,MEUZAC,,,87095,,,,,,,,,,,,,,,,,,,2011-03-29,F,,,,,01.42Z,NAFRev2,N,1.391778,45.556386,0.94,locality,La Ribière 87380 Meuzac,87095_1m7lfs,G,LA RIBIERE,
353179468,00015,35317946800015,O,1990-01-15,NN,,,,false,2,,,,,LE BOURG,87380,MEUZAC,,,87095,,,,,,,,,,,,,,,,,,,1996-12-01,F,,,,,,,,1.441693,45.552921,0.92,street,Le Bourg Nord 87380 Meuzac,87095_B027,G,LE BOURG NORD,
353572670,00019,35357267000019,O,1990-01-02,NN,,,2008-11-08T00:31:18,false,4,,,,,LE BOURG,87380,MEUZAC,,,87095,,,,,,,,,,,,,,,,,,,1998-07-01,F,,,,,52.4H,NAF1993,O,1.441693,45.552921,0.92,street,Le Bourg Nord 87380 Meuzac,87095_B027,G,LE BOURG NORD,
353819485,00015,35381948500015,O,1990-01-01,NN,,,2021-02-23T11:06:03,true,4,,,,,LA FORGE DE CHABRENAS,87380,MEUZAC,,,87095,,,,,,,,,,,,,,,,,,,2012-10-01,A,,,,,68.20B,NAFRev2,N,1.402552,45.549087,0.94,locality,La Forge de Chabrenas 87380 Meuzac,87095_B082,G,LA FORGE DE CHABRENAS,
356000745,00386,35600074500386,O,1991-01-01,NN,,,2007-08-09T09:09:28,false,3,,,,PL,EGLISE,87380,MEUZAC,,,87095,,,,,,,,,,,,,,,,,,,2007-07-31,F,BUREAU DE POSTE,,,,64.1A,NAFRev1,O,1.412453,45.570083,0.74,street,Impasse de l’Eglise 87380 Meuzac,87095_0185,G,IMPASSE DE L EGLISE,
378538011,00032,37853801100032,O,2009-04-25,,,,2021-02-23T11:07:14,true,1,,,,,ROYER,87380,MEUZAC,,,87095,,,,,,,,,,,,,,,,,,,2009-04-25,A,,,,,94.99Z,NAFRev2,N,1.399281,45.525635,0.94,locality,Royer 87380 Meuzac,87095_pqc3f1,G,ROYER,
378563985,00019,37856398500019,O,1990-07-03,NN,,,2007-01-17T14:46:14,true,4,,,,,LES QUATRE ROUTES,87380,MEUZAC,,,87095,,,,,,,,,,,,,,,,,,,2006-12-31,F,,,,,52.4H,NAFRev1,N,1.41863,45.559474,0.94,locality,Les Quatre Routes 87380 Meuzac,87095_6mnelb,G,LES QUATRE ROUTES,
378570980,00011,37857098000011,O,1990-07-03,NN,,,2008-11-08T00:34:13,true,3,,,,,ROYER,87380,MEUZAC,,,87095,,,,,,,,,,,,,,,,,,,2007-12-31,F,,,,,45.2L,NAFRev1,N,1.399281,45.525635,0.94,locality,Royer 87380 Meuzac,87095_pqc3f1,G,ROYER,
378949416,00010,37894941600010,O,1990-07-10,NN,,,2008-01-04T21:22:48,true,3,,,,,LE BOURG,87380,MEUZAC,,,87095,,,,,,,,,,,,,,,,,,,2008-01-01,A,,,,,68.20A,NAFRev2,N,1.441693,45.552921,0.92,street,Le Bourg Nord 87380 Meuzac,87095_B027,G,LE BOURG NORD,
379638067,00015,37963806700015,O,1900-01-01,NN,,,2021-03-01T08:35:55,true,6,,11,,,LA CROIX,87380,MEUZAC,,,87095,,,,,,,,,,,,,,,,,,,2021-03-01,A,,,,MB CONSEIL,70.22Z,NAFRev2,N,1.445328,45.558096,0.94,housenumber,11 La Croix 87380 Meuzac,87095_3c3g6m_00011,G,11 LA CROIX,
380207423,00019,38020742300019,O,1990-09-18,NN,,,2018-12-03T14:57:22,true,3,GERAUD ALAIN,,,,MAIRIE,87380,MEUZAC,,,87095,,,,,,,,,,,,,,,,,,,2008-01-01,A,,,,,77.31Z,NAFRev2,N,1.437952,45.552069,0.38,street,Place du 8 Mai 1945 87380 Meuzac,87095_0070,G,PLACE DU 8 MAI 1945,
380370841,00021,38037084100021,O,1991-03-04,NN,,,,true,1,,,,RUE,DU 11 NOVEMBRE,87380,MEUZAC,,,87095,,,,,,,,,,,,,,,,,,,2000-12-31,F,,,,,85.1G,NAF1993,N,1.439347,45.55255,0.94,street,Rue du 11 Novembre 1918 87380 Meuzac,87095_0500,G,RUE DU 11 NOVEMBRE 1918,
381103647,00016,38110364700016,O,,NN,,,,true,1,,,,,,87380,MEUZAC,,,87095,,,,,,,,,,,,,,,,,,,1994-05-17,F,,,,,20.1A,NAF1993,N,,,0,,,,,,
381441633,00017,38144163300017,O,,NN,,,,true,1,,,,,FORGENEUVE,87380,MEUZAC,,,87095,,,,,,,,,,,,,,,,,,,1996-12-31,F,,,,,55.3A,NAF1993,N,1.427803,45.545206,0.94,locality,Forgeneuve 87380 Meuzac,87095_ptb164,G,FORGENEUVE,
381902634,00017,38190263400017,O,1991-01-01,NN,,4312BA,2021-11-06T14:39:52,true,5,LE MAZAUD,2302,,,RTE DES THIERS,87380,MEUZAC,,,87095,,,,,,,,,,,,,,,,,,,2020-10-13,A,,,,,01.61Z,NAFRev2,N,1.392938,45.543467,0.86,housenumber,2302 Route des Thiers 87380 Meuzac,87095_0139_02302,G,2302 ROUTE DES THIERS,
381902758,00014,38190275800014,O,1991-01-01,NN,,,2015-05-14T04:44:14,true,3,,,,,FRIOUL,87380,MEUZAC,,,87095,,,,,,,,,,,,,,,,,,,2008-01-01,A,,,,,01.42Z,NAFRev2,N,1.459464,45.569716,0.94,locality,Frioul 87380 Meuzac,87095_qh0u9m,G,FRIOUL,
382117828,00014,38211782800014,O,1990-09-01,NN,,,2007-01-18T09:29:54,true,3,,,,,LE MAZAUD,87380,MEUZAC,,,87095,,,,,,,,,,,,,,,,,,,1998-12-25,F,,,,,01.2A,NAF1993,N,1.394483,45.544399,0.94,locality,Le Mazaud 87380 Meuzac,87095_rppcmp,G,LE MAZAUD,
384346565,00011,38434656500011,O,,NN,,,,true,1,,,,,VILLENEUVE,87380,MEUZAC,,,87095,,,,,,,,,,,,,,,,,,,1994-05-20,F,,,,,45.4F,NAF1993,N,1.420279,45.556464,0.94,locality,Villeneuve 87380 Meuzac,87095_339f33,G,VILLENEUVE,
384893798,00031,38489379800031,O,1983-12-31,NN,,,2006-10-28T01:09:48,false,3,,,,,,87380,MEUZAC,,,87095,,,,,,,,,,,,,,,,,,,2004-12-31,F,,,,,01.1A,NAFRev1,N,,,0,,,,,,
384920245,00014,38492024500014,O,1992-01-01,NN,,,,true,4,,,,,ROYER,87380,MEUZAC,,,87095,,,,,,,,,,,,,,,,,,,2003-04-01,F,,,,,01.3Z,NAFRev1,N,1.399281,45.525635,0.94,locality,Royer 87380 Meuzac,87095_pqc3f1,G,ROYER,
384922373,00012,38492237300012,O,1992-01-01,NN,,,2022-05-11T11:03:10,true,5,,,,,LA VERINE,87380,MEUZAC,,,87095,,,,,,,,,,,,,,,,,,,2022-01-01,A,,,,,01.45Z,NAFRev2,N,1.3793,45.569042,0.94,locality,La Vérine 87380 Meuzac,87095_0vv9e7,G,LA VERINE,
387738206,00011,38773820600011,O,1992-06-16,,,,2006-09-06T09:29:52,true,4,,,,,CHAVAGNAC,87380,MEUZAC,,,87095,,,,,,,,,,,,,,,,,,,2000-01-12,F,,,,,51.4A,NAF1993,N,1.416391,45.571269,0.94,street,Chavagnac 87380 Meuzac,87095_iqauxj,G,CHAVAGNAC,
388081002,00023,38808100200023,O,1995-10-30,NN,,,,false,4,,4,,,RESIDENCE DU LAC,87380,MEUZAC,,,87095,,,,,,,,,,,,,,,,,,,1999-03-24,F,,,,,85.1G,NAF1993,N,1.440458,45.547385,0.49,housenumber,4 Allée du Lac 87380 Meuzac,87095_0090_00004,G,4 ALLEE DU LAC,
388500225,00023,38850022500023,O,,,,,,true,1,,,,,LE BOURG,87380,MEUZAC,,,87095,,,,,,,,,,,,,,,,,,,1997-05-12,F,,,,,02.0B,NAF1993,N,1.441693,45.552921,0.92,street,Le Bourg Nord 87380 Meuzac,87095_B027,G,LE BOURG NORD,
389782392,00010,38978239200010,O,1993-01-01,NN,,,2021-02-23T11:15:42,true,4,,,,,LA ROCHE,87380,MEUZAC,,,87095,,,,,,,,,,,,,,,,,,,2008-01-01,A,,,,,68.20B,NAFRev2,N,1.440358,45.541817,0.94,locality,La Roche 87380 Meuzac,87095_xm1dc5,G,LA ROCHE,
390328086,00017,39032808600017,O,1980-01-01,NN,,,2011-04-23T08:03:35,true,4,,,,,FRIOUL,87380,MEUZAC,,,87095,,,,,,,,,,,,,,,,,,,2010-08-31,F,,,,,01.42Z,NAFRev2,N,1.459464,45.569716,0.94,locality,Frioul 87380 Meuzac,87095_qh0u9m,G,FRIOUL,
390455871,00017,39045587100017,O,1980-01-01,NN,,,2008-01-04T23:40:20,true,3,,,,,CONDAMINE,87380,MEUZAC,,,87095,,,,,,,,,,,,,,,,,,,2008-01-01,A,,,,,01.42Z,NAFRev2,N,1.414913,45.585894,0.91,street,Allee de Condamine 87380 Meuzac,87095_0174,G,ALLEE DE CONDAMINE,
390456044,00010,39045604400010,O,1979-01-01,NN,,,,true,1,,,,,BORDIER,87380,MEUZAC,,,87095,,,,,,,,,,,,,,,,,,,2002-12-31,F,,,,,01.2A,NAF1993,N,1.429165,45.534937,0.94,locality,Bordier 87380 Meuzac,87095_kzmx5r,G,BORDIER,
390464014,00013,39046401400013,O,1992-01-01,NN,,,2009-06-07T05:06:42,true,4,,,,,LE MOULIN NOIR,87380,MEUZAC,,,87095,,,,,,,,,,,,,,,,,,,2008-12-31,F,,,,,01.42Z,NAFRev2,N,1.425619,45.542952,0.94,locality,Le Moulin Noir 87380 Meuzac,87095_B139,G,LE MOULIN NOIR,
390868222,00071,39086822200071,O,2015-08-12,,,,2017-04-24T19:29:41,true,3,,,,,LES GARABOEUFS,87380,MEUZAC,,,87095,,,,,,,,,,,,,,,,,,,2017-03-29,F,,,,,47.79Z,NAFRev2,N,1.375407,45.532827,0.33,street,Les Grands Pres 87380 Meuzac,87095_B108,G,LES GRANDS PRES,
391087533,00017,39108753300017,O,1986-07-01,NN,,,2016-07-22T13:49:35,true,4,,,,,HAUTE FAYE,87380,MEUZAC,,,87095,,,,,,,,,,,,,,,,,,,2016-05-31,F,,,,,01.42Z,NAFRev2,N,1.464467,45.558415,0.94,locality,Haute-Faye 87380 Meuzac,87095_B109,G,HAUTE FAYE,
391087822,00014,39108782200014,O,1984-01-01,01,2021,,2023-11-30T10:23:28,true,4,,,,,LES PLANCHES,87380,MEUZAC,,,87095,,,,,,,,,,,,,,,,,,,2013-01-01,A,,,,,01.11Z,NAFRev2,O,1.384153,45.554164,0.94,street,Les Planches 87380 Meuzac,87095_gc9yd9,G,LES PLANCHES,
391285004,00019,39128500400019,O,1985-01-01,NN,,,,true,1,,,,,LA PETITE BOULESSIE,87380,MEUZAC,,,87095,,,,,,,,,,,,,,,,,,,2001-12-31,F,,,,,01.2A,NAF1993,N,1.425984,45.548648,0.94,locality,La Petite Boulessie 87380 Meuzac,87095_n2hd88,G,LA PETITE BOULESSIE,
391290459,00018,39129045900018,O,1993-05-10,NN,,,2017-02-24T09:39:50,true,3,MEUZAC,,,,LA ROCHE,87380,MEUZAC,,,87095,,,,,,,,,,,,,,,,,,,2008-01-01,A,,,,,68.20B,NAFRev2,N,1.440358,45.541817,0.94,locality,La Roche 87380 Meuzac,87095_xm1dc5,G,LA ROCHE,
391315967,00011,39131596700011,O,1993-05-01,NN,,3831ZA,2015-03-17T00:39:19,true,7,,,,,LA ROCHE,87380,MEUZAC,,,87095,,,,,,,,,,,,,,,,,,,2011-06-01,A,,,,,38.32Z,NAFRev2,N,1.440358,45.541817,0.94,locality,La Roche 87380 Meuzac,87095_xm1dc5,G,LA ROCHE,