siren,nic,siret,statutDiffusionEtablissement,dateCreationEtablissement,trancheEffectifsEtablissement,anneeEffectifsEtablissement,activitePrincipaleRegistreMetiersEtablissement,dateDernierTraitementEtablissement,etablissementSiege,nombrePeriodesEtablissement,complementAdresseEtablissement,numeroVoieEtablissement,indiceRepetitionEtablissement,typeVoieEtablissement,libelleVoieEtablissement,codePostalEtablissement,libelleCommuneEtablissement,libelleCommuneEtrangerEtablissement,distributionSpecialeEtablissement,codeCommuneEtablissement,codeCedexEtablissement,libelleCedexEtablissement,codePaysEtrangerEtablissement,libellePaysEtrangerEtablissement,complementAdresse2Etablissement,numeroVoie2Etablissement,indiceRepetition2Etablissement,typeVoie2Etablissement,libelleVoie2Etablissement,codePostal2Etablissement,libelleCommune2Etablissement,libelleCommuneEtranger2Etablissement,distributionSpeciale2Etablissement,codeCommune2Etablissement,codeCedex2Etablissement,libelleCedex2Etablissement,codePaysEtranger2Etablissement,libellePaysEtranger2Etablissement,dateDebut,etatAdministratifEtablissement,enseigne1Etablissement,enseigne2Etablissement,enseigne3Etablissement,denominationUsuelleEtablissement,activitePrincipaleEtablissement,nomenclatureActivitePrincipaleEtablissement,caractereEmployeurEtablissement,longitude,latitude,geo_score,geo_type,geo_adresse,geo_id,geo_ligne,geo_l4,geo_l5
218801009,00018,21880100900018,O,1983-03-01,01,2021,,2023-11-30T10:18:47,true,3,,,,,,88500,CHEF-HAUT,,,88100,,,,,,,,,,,,,,,,,,,2008-01-01,A,MAIRIE,,,,84.11Z,NAFRev2,N,,,0,,,,,,
268802030,00018,26880203000018,O,1992-01-01,NN,,,2019-11-14T14:01:03,true,4,MAIRIE,,,,,88500,CHEF-HAUT,,,88100,,,,,,,,,,,,,,,,,,,2016-01-01,F,CCAS,,,,88.99B,NAFRev2,N,,,0,,,,,,
298801903,00014,29880190300014,O,1985-10-28,NN,,,2019-11-14T14:01:03,true,4,MAIRIE,,,,,88500,CHEF-HAUT,,,88100,,,,,,,,,,,,,,,,,,,2013-07-25,F,,,,,42.99Z,NAFRev2,N,,,0,,,,,,
313605586,00012,31360558600012,O,1978-01-01,NN,,,2023-05-05T20:21:46,true,4,,,,,,88500,CHEF-HAUT,,,88100,,,,,,,,,,,,,,,,,,,2015-12-25,F,,,,,01.45Z,NAFRev2,N,,,0,,,,,,
314572793,00011,31457279300011,O,1978-01-01,NN,,,2022-03-05T03:49:13,true,4,,,,,,88500,CHEF-HAUT,,,88100,,,,,,,,,,,,,,,,,,,2022-03-04,F,,,,,01.50Z,NAFRev2,N,,,0,,,,,,
349381285,00015,34938128500015,O,1989-01-01,NN,,,2019-11-14T14:01:03,true,3,,,,,,88500,CHEF-HAUT,,,88100,,,,,,,,,,,,,,,,,,,2008-01-01,A,,,,,01.43Z,NAFRev2,N,,,0,,,,,,
382241974,00015,38224197400015,O,1991-05-01,01,2021,,2023-11-30T10:20:32,true,4,,,,,,88500,CHEF-HAUT,,,88100,,,,,,,,,,,,,,,,,,,2012-12-31,A,,,,,01.61Z,NAFRev2,O,,,0,,,,,,
391295581,00014,39129558100014,O,1992-07-01,NN,,,2019-11-14T14:01:03,true,5,,,,,,88500,CHEF-HAUT,,,88100,,,,,,,,,,,,,,,,,,,2011-12-31,F,,,,,78.30Z,NAFRev2,O,,,0,,,,,,
407922905,00010,40792290500010,O,,NN,,,2019-11-14T14:01:03,true,1,,,,,,88500,CHEF-HAUT,,,88100,,,,,,,,,,,,,,,,,,,1996-10-04,F,,,,,01.1A,NAF1993,N,,,0,,,,,,
429797533,00016,42979753300016,O,2000-04-03,NN,,,2019-11-14T14:01:03,false,4,,38,,RUE,DE COURCELLES,88500,CHEF-HAUT,,,88100,,,,,,,,,,,,,,,,,,,2007-04-01,F,,,,,74.2C,NAFRev1,O,6.016047,48.357424,0.8,housenumber,38 Route de Courcelles 88500 Chef-Haut,88100_0010_00038,G,38 ROUTE DE COURCELLES,
484330972,00056,48433097200056,O,2019-05-02,,,,2022-11-18T10:00:55,true,3,,11,,RUE,JUSSIEU,88500,CHEF-HAUT,,,88100,,,,,,,,,,,,,,,,,,,2022-12-01,A,CALIDOG,,,OBER DAISY,96.09Z,NAFRev2,N,6.014721,48.356482,0.32,street,Rue de la Poste 88500 Chef-Haut,88100_0035,G,RUE DE LA POSTE,
493866602,00029,49386660200029,P,2018-07-01,,,9529ZF,2021-06-16T08:39:30,false,2,[ND],[ND],[ND],[ND],[ND],[ND],CHEF-HAUT,,[ND],88100,[ND],[ND],,,[ND],[ND],[ND],[ND],[ND],[ND],,,[ND],,[ND],[ND],,,2021-01-11,F,[ND],[ND],[ND],[ND],95.29Z,NAFRev2,N,,,0,,,,,,
495229213,00014,49522921300014,O,2007-04-10,,,,2019-11-14T14:01:03,true,2,,15,,RUE,DE L EGLISE,88500,CHEF-HAUT,,,88100,,,,,,,,,,,,,,,,,,,2008-01-01,A,EN TETE A TETE,,,,96.02A,NAFRev2,N,6.014761,48.355981,0.93,housenumber,15 Rue de l'Eglise 88500 Chef-Haut,88100_0015_00015,G,15 RUE DE L EGLISE,
518010848,00043,51801084800043,O,2009-12-01,,,,2019-11-14T14:01:03,false,2,PARC DU SUD TOULOIS A,,,LD,SUR LES NAUVES,88500,CHEF-HAUT,,,88100,,,,,,,,,,,,,,,,,,,2015-12-31,F,,,,,35.11Z,NAFRev2,N,,,0,,,,,,
531582385,00021,53158238500021,O,2021-05-31,,,,2021-09-04T12:51:57,true,1,,10,,RUE,DE L'EGLISE,88500,CHEF-HAUT,,,88100,,,,,,,,,,,,,,,,,,,2021-05-31,A,,,,,01.50Z,NAFRev2,N,6.014722,48.355337,0.93,housenumber,10 Rue de l'Eglise 88500 Chef-Haut,88100_0015_00010,G,10 RUE DE L EGLISE,
533010302,00016,53301030200016,O,2011-07-01,,,,2019-11-14T14:01:03,true,1,,15,,RUE,DE L'EGLISE,88500,CHEF-HAUT,,,88100,,,,,,,,,,,,,,,,,,,2011-07-01,A,,,,,01.42Z,NAFRev2,N,6.014761,48.355981,0.93,housenumber,15 Rue de l'Eglise 88500 Chef-Haut,88100_0015_00015,G,15 RUE DE L EGLISE,
752706606,00015,75270660600015,O,2012-04-01,,,,2019-11-14T14:01:03,true,1,,15,,RUE,DE L EGLISE,88500,CHEF-HAUT,,,88100,,,,,,,,,,,,,,,,,,,2012-04-01,A,,,,,35.11Z,NAFRev2,N,6.014761,48.355981,0.93,housenumber,15 Rue de l'Eglise 88500 Chef-Haut,88100_0015_00015,G,15 RUE DE L EGLISE,
783427206,00017,78342720600017,O,,,,,2019-11-14T14:01:03,true,1,,,,,,88500,CHEF-HAUT,,,88100,,,,,,,,,,,,,,,,,,,1984-12-25,F,,,,,01.56,NAP,N,,,0,,,,,,
891601296,00017,89160129600017,O,2021-01-01,,,4399CZ,2020-12-18T13:32:51,true,1,,205,,RUE,DE L EGLISE,88500,CHEF-HAUT,,,88100,,,,,,,,,,,,,,,,,,,2021-01-01,A,,,,ALEX RENOV 88,43.99C,NAFRev2,N,6.016356,48.356535,0.93,housenumber,205 Rue de l'Eglise 88500 Chef-Haut,88100_0015_00205,G,205 RUE DE L EGLISE,
