siren,nic,siret,statutDiffusionEtablissement,dateCreationEtablissement,trancheEffectifsEtablissement,anneeEffectifsEtablissement,activitePrincipaleRegistreMetiersEtablissement,dateDernierTraitementEtablissement,etablissementSiege,nombrePeriodesEtablissement,complementAdresseEtablissement,numeroVoieEtablissement,indiceRepetitionEtablissement,typeVoieEtablissement,libelleVoieEtablissement,codePostalEtablissement,libelleCommuneEtablissement,libelleCommuneEtrangerEtablissement,distributionSpecialeEtablissement,codeCommuneEtablissement,codeCedexEtablissement,libelleCedexEtablissement,codePaysEtrangerEtablissement,libellePaysEtrangerEtablissement,complementAdresse2Etablissement,numeroVoie2Etablissement,indiceRepetition2Etablissement,typeVoie2Etablissement,libelleVoie2Etablissement,codePostal2Etablissement,libelleCommune2Etablissement,libelleCommuneEtranger2Etablissement,distributionSpeciale2Etablissement,codeCommune2Etablissement,codeCedex2Etablissement,libelleCedex2Etablissement,codePaysEtranger2Etablissement,libellePaysEtranger2Etablissement,dateDebut,etatAdministratifEtablissement,enseigne1Etablissement,enseigne2Etablissement,enseigne3Etablissement,denominationUsuelleEtablissement,activitePrincipaleEtablissement,nomenclatureActivitePrincipaleEtablissement,caractereEmployeurEtablissement,longitude,latitude,geo_score,geo_type,geo_adresse,geo_id,geo_ligne,geo_l4,geo_l5
130010267,00131,13001026700131,O,2010-01-28,NN,,,2021-10-27T08:03:49,false,2,CENTRE DES FINANCES PUBLIQUES,1,,RUE,DES CASERNES,90200,GIROMAGNY,,BP 26,90052,,,,,,,,,,,,,,,,,,,2021-01-01,F,TRESORERIE  GIROMAGNY,,,,84.11Z,NAFRev2,N,6.828047,47.742998,0.95,housenumber,1 Rue des Casernes 90200 Giromagny,90052_0100_00001,G,1 RUE DES CASERNES,
130010267,00347,13001026700347,O,2021-01-01,,,,2020-12-08T16:05:53,false,1,,1,,RUE,DES CASERNES,90200,GIROMAGNY,,,90052,,,,,,,,,,,,,,,,,,,2021-01-01,A,ANTENNE DE SGC - GIROMAGNY,,,,84.11Z,NAFRev2,N,6.828047,47.742998,0.95,housenumber,1 Rue des Casernes 90200 Giromagny,90052_0100_00001,G,1 RUE DES CASERNES,
179002118,00075,17900211800075,O,1987-08-27,,,,2013-04-29T22:36:51,false,4,,1,,RUE,DES CASERNES,90200,GIROMAGNY,,,90052,,,,,,,,,,,,,,,,,,,2010-01-28,F,TRESORERIE DE GIROMAGNY,,,,84.11Z,NAFRev2,N,6.828047,47.742998,0.95,housenumber,1 Rue des Casernes 90200 Giromagny,90052_0100_00001,G,1 RUE DES CASERNES,
179002217,00042,17900221700042,O,1990-09-01,,,,,false,3,,8,,FG,DE BELFORT,90200,GIROMAGNY,,,90052,,,,,,,,,,,,,,,,,,,1993-04-01,F,RECETTE LOCALE C.E.    GIROMAGNY,,,,75.1A,NAF1993,N,6.827349,47.740167,0.84,housenumber,8 Faubourg de Belfort 90200 Giromagny,90052_0060_00008,G,8 FAUBOURG DE BELFORT,
179006614,00053,17900661400053,O,1983-03-16,NN,,,2009-08-07T13:57:10,false,4,,,,FG,D ALSACE,90200,GIROMAGNY,,,90052,,,,,,,,,,,,,,,,,,,2009-01-01,F,DDE SUBDIVISION DE GIROMAGNY,,,,84.13Z,NAFRev2,N,6.834431,47.738647,0.8,street,Faubourg d'Alsace 90200 Giromagny,90052_0030,G,FAUBOURG D ALSACE,
199000092,00015,19900009200015,O,1983-03-01,12,2021,,2023-11-30T10:17:28,true,3,,,,AV,JEAN MOULIN,90200,GIROMAGNY,,BP 1,90052,,,,,,,,,,,,,,,,,,,2008-01-01,A,,,,,85.31Z,NAFRev2,N,6.834925,47.741043,0.83,street,Avenue Jean Moulin 90200 Giromagny,90052_0247,G,AVENUE JEAN MOULIN,
200069060,00016,20006906000016,O,2017-01-01,NN,,,2021-10-27T08:06:02,false,2,,,,,ALLEE DE LA GRANDE PRAIRIE,90200,GIROMAGNY,,BP 23,90052,,,,,,,,,,,,,,,,,,,2020-11-04,F,,,,,84.11Z,NAFRev2,O,6.831947,47.733225,0.94,street,Allee de la Grande Prairie 90200 Giromagny,90052_l2tcd4,G,ALLEE DE LA GRANDE PRAIRIE,
219000528,00014,21900052800014,O,1983-03-01,11,2021,,2023-11-30T10:18:47,true,4,,28,,,GRANDE RUE,90200,GIROMAGNY,,,90052,,,,,,,,,,,,,,,,,,,2008-01-01,A,MAIRIE,,,,84.11Z,NAFRev2,O,6.825412,47.741836,0.96,housenumber,28 Grande Rue 90200 Giromagny,90052_0240_00028,G,28 GRANDE RUE,
219000528,00022,21900052800022,O,1983-03-16,NN,,,2013-04-11T17:02:27,false,4,,,,,,90200,GIROMAGNY,,,90052,,,,,,,,,,,,,,,,,,,2008-01-01,F,CAMP MUNICIPAL CAMPING,,,,55.30Z,NAFRev2,N,,,0,,,,,,
219000528,00030,21900052800030,O,1983-12-21,NN,,,2023-11-09T16:18:55,false,4,,1,,RUE,HAUTE RIVE,90200,GIROMAGNY,,,90052,,,,,,,,,,,,,,,,,,,2023-09-01,A,ECOLE ELEMENTAIRE DOCTEUR BENOIT,,,,85.20Z,NAFRev2,N,6.831754,47.739677,0.8,housenumber,1 Rue Hauterive 90200 Giromagny,90052_0243_00001,G,1 RUE HAUTERIVE,
219000528,00048,21900052800048,O,1983-12-21,02,2021,,2023-11-30T10:18:47,false,3,,15,,RUE,DES ECOLES,90200,GIROMAGNY,,,90052,,,,,,,,,,,,,,,,,,,2008-01-01,A,ECOLE MATERNELLE DU CHANTOISEAU,,,,85.10Z,NAFRev2,N,6.82207,47.744792,0.96,housenumber,15 Rue des Ecoles 90200 Giromagny,90052_0160_00015,G,15 RUE DES ECOLES,
219000528,00055,21900052800055,O,1983-12-21,11,2021,,2023-11-30T10:18:47,false,5,,,,RUE,JOSEPH LHOMME,90200,GIROMAGNY,,,90052,,,,,,,,,,,,,,,,,,,2023-09-01,F,ECOLE ELEMENTAIRE  LHOMME-BENOIT,,,,85.20Z,NAFRev2,N,6.823876,47.741686,0.85,street,Rue Joseph l’Homme 90200 Giromagny,90052_8jl4v0,G,RUE JOSEPH L HOMME,
219000528,00063,21900052800063,O,1996-12-25,NN,,,2013-04-11T17:01:16,false,3,,28,,,GRANDE RUE,90200,GIROMAGNY,,,90052,,,,,,,,,,,,,,,,,,,2008-01-01,F,SERVICE ASSAINISSEMENT,,,,37.00Z,NAFRev2,N,6.825412,47.741836,0.96,housenumber,28 Grande Rue 90200 Giromagny,90052_0240_00028,G,28 GRANDE RUE,
219000528,00071,21900052800071,O,1999-01-01,NN,,,2014-01-21T15:42:59,false,3,MAIRIE,28,,,GRANDE RUE,90200,GIROMAGNY,,,90052,,,,,,,,,,,,,,,,,,,2008-01-01,A,BUDGET ANNEXE BOIS,,,,49.39A,NAFRev2,N,6.825412,47.741836,0.96,housenumber,28 Grande Rue 90200 Giromagny,90052_0240_00028,G,28 GRANDE RUE,
249000118,00011,24900011800011,O,1994-12-08,NN,,,,false,4,MAIRIE,28,,,GDE RUE,90200,GIROMAGNY,,,90052,,,,,,,,,,,,,,,,,,,2000-04-27,F,,,,,75.1A,NAF1993,O,6.825412,47.741836,0.79,housenumber,28 Grande Rue 90200 Giromagny,90052_0240_00028,G,28 GRANDE RUE,
249000118,00029,24900011800029,O,1995-01-01,NN,,,2018-09-29T12:07:34,false,4,LA GRANDE PRAIRIE,,,FG,DE BELFORT,90200,GIROMAGNY,,,90052,,,,,,,,,,,,,,,,,,,2017-01-01,F,SCE ASSAINISSEMENT DE LA HTE SAVOUREUSE,,,,37.00Z,NAFRev2,N,6.82887,47.737387,0.82,street,Faubourg de Belfort 90200 Giromagny,90052_0060,G,FAUBOURG DE BELFORT,
249000118,00037,24900011800037,O,2000-04-27,NN,,,2019-06-24T13:13:20,true,4,LA GRANDE PRAIRIE,,,FG,DE BELFORT,90200,GIROMAGNY,,,90052,,,,,,,,,,,,,,,,,,,2017-01-01,F,,,,,84.11Z,NAFRev2,O,6.82887,47.737387,0.82,street,Faubourg de Belfort 90200 Giromagny,90052_0060,G,FAUBOURG DE BELFORT,
249000118,00045,24900011800045,O,2005-01-02,NN,,,2019-06-24T13:13:20,false,2,RESIDENCE SAINT JOSEPH,9,,RUE,DU ROSEMONT,90200,GIROMAGNY,,,90052,,,,,,,,,,,,,,,,,,,2017-01-01,F,CRECHE HALTE-GARDERIE LES PAPY'LLONS,,,,88.91A,NAFRev2,N,6.83016,47.743032,0.96,housenumber,9 Rue du Rosemont 90200 Giromagny,90052_0440_00009,G,9 RUE DU ROSEMONT,
256802752,00053,25680275200053,O,2004-12-25,NN,,,2020-01-30T17:35:44,false,4,MAIRIE,28,,,GRANDE RUE,90200,GIROMAGNY,,,90052,,,,,,,,,,,,,,,,,,,2015-02-01,F,,,,,91.04Z,NAFRev2,O,6.825412,47.741836,0.96,housenumber,28 Grande Rue 90200 Giromagny,90052_0240_00028,G,28 GRANDE RUE,
259000180,00010,25900018000010,O,,NN,,,,true,1,,,,,MAIRIE,90200,GIROMAGNY,,,90052,,,,,,,,,,,,,,,,,,,1994-12-31,F,,,,,75.1E,NAF1993,N,6.825032,47.741538,0.92,street,Rue de la Mairie 90200 Giromagny,90052_bgczof,G,RUE DE LA MAIRIE,
259000206,00013,25900020600013,O,1983-03-01,NN,,,2017-03-02T09:07:42,true,4,MAIRIE,28,,,GRANDE RUE,90200,GIROMAGNY,,,90052,,,,,,,,,,,,,,,,,,,2017-02-23,F,,,,,84.12Z,NAFRev2,N,6.825412,47.741836,0.96,housenumber,28 Grande Rue 90200 Giromagny,90052_0240_00028,G,28 GRANDE RUE,
259000222,00010,25900022200010,O,1983-03-01,02,2020,,2022-08-29T09:10:14,true,4,MAIRIE,28,,,GRANDE RUE,90200,GIROMAGNY,,,90052,,,,,,,,,,,,,,,,,,,2008-01-01,A,,,,,84.12Z,NAFRev2,O,6.825412,47.741836,0.96,housenumber,28 Grande Rue 90200 Giromagny,90052_0240_00028,G,28 GRANDE RUE,
259000248,00015,25900024800015,O,1983-03-01,11,2021,,2023-11-30T10:19:04,true,4,,76,,,ALSACE,90200,GIROMAGNY,,,90052,,,,,,,,,,,,,,,,,,,2008-01-01,A,,,,,84.12Z,NAFRev2,O,6.837587,47.735215,0.85,housenumber,76 Faubourg d'Alsace 90200 Giromagny,90052_0030_00076,G,76 FAUBOURG D ALSACE,
259000727,00026,25900072700026,O,2015-01-22,NN,,,2020-08-25T10:20:43,true,3,,,,,COMMUNAUTE DE COMMUNES DE LA HAU,90200,GIROMAGNY,,,90052,,,,,,,,,,,,,,,,,,,2019-12-27,F,,,,,42.99Z,NAFRev2,O,6.8924041,48.0881544,0.82,poi.recycling,Déchèterie de la Communauté de Communes des Lacs et des Hauts Rupts (Point de recyclage) Gérardmer,https://osm.org/way/247680216,G,,
269000527,00011,26900052700011,O,1983-03-01,01,2021,,2023-11-30T10:19:15,true,4,MAIRIE,28,,,GRANDE RUE,90200,GIROMAGNY,,,90052,,,,,,,,,,,,,,,,,,,2020-09-14,A,CCAS,,,,88.99B,NAFRev2,O,6.825412,47.741836,0.96,housenumber,28 Grande Rue 90200 Giromagny,90052_0240_00028,G,28 GRANDE RUE,
269001202,00010,26900120200010,O,1986-09-18,NN,,,2010-06-26T03:17:53,true,3,MAIRIE,28,,,GRANDE RUE,90200,GIROMAGNY,,,90052,,,,,,,,,,,,,,,,,,,2008-01-01,A,CDE,,,,88.99B,NAFRev2,N,6.825412,47.741836,0.96,housenumber,28 Grande Rue 90200 Giromagny,90052_0240_00028,G,28 GRANDE RUE,
279000103,00010,27900010300010,O,,,,,,true,1,,,,,MAIRIE,90200,GIROMAGNY,,,90052,,,,,,,,,,,,,,,,,,,1995-12-25,F,,,,,41.0Z,NAF1993,N,6.825032,47.741538,0.92,street,Rue de la Mairie 90200 Giromagny,90052_bgczof,G,RUE DE LA MAIRIE,
299000166,00015,29900016600015,O,1985-12-17,NN,,,2014-01-21T15:54:03,true,3,MAIRIE,28,,,GRANDE RUE,90200,GIROMAGNY,,,90052,,,,,,,,,,,,,,,,,,,2008-01-01,A,,,,,42.99Z,NAFRev2,N,6.825412,47.741836,0.96,housenumber,28 Grande Rue 90200 Giromagny,90052_0240_00028,G,28 GRANDE RUE,
300845120,00025,30084512000025,O,2015-09-01,,,8121ZZ,2021-02-23T10:35:47,true,1,,5,,RUE,DES MINES,90200,GIROMAGNY,,,90052,,,,,,,,,,,,,,,,,,,2015-09-01,A,,,,,81.21Z,NAFRev2,N,6.819326,47.749121,0.95,housenumber,5 Rue des Mines 90200 Giromagny,90052_0280_00005,G,5 RUE DES MINES,
301072732,00011,30107273200011,O,1900-01-01,NN,,,2009-06-27T03:35:27,false,5,,9,,RUE,DES CASERNES,90200,GIROMAGNY,,,90052,,,,,,,,,,,,,,,,,,,2008-01-01,F,,,,,94.99Z,NAFRev2,O,6.827517,47.744346,0.95,housenumber,9 Rue des Casernes 90200 Giromagny,90052_0100_00009,G,9 RUE DES CASERNES,
301072732,00029,30107273200029,O,2000-05-16,NN,,,2013-05-18T02:24:32,false,2,,,,PL,DES COMMANDOS D'AFRIQUE,90200,GIROMAGNY,,,90052,,,,,,,,,,,,,,,,,,,2011-08-30,F,,,,,94.99Z,NAFRev2,O,6.827363,47.743449,0.88,street,Place des Commandos d’Afrique 90200 Giromagny,90052_2s0pr8,G,PLACE DES COMMANDOS D AFRIQUE,
301072732,00045,30107273200045,O,2018-01-01,11,2021,,2023-11-30T10:19:27,true,1,,7,,RUE,DES CASERNES,90200,GIROMAGNY,,BP 27,90052,,,,,,,,,,,,,,,,,,,2018-01-01,A,,,,,93.29Z,NAFRev2,O,6.82772,47.743872,0.95,housenumber,7 Rue des Casernes 90200 Giromagny,90052_0100_00007,G,7 RUE DES CASERNES,
301725487,00013,30172548700013,O,,,,,,true,1,,,,RUE,DES PLANCHETTES,90200,GIROMAGNY,,,90052,,,,,,,,,,,,,,,,,,,1985-12-25,F,,,,,47.04,NAP,N,6.828741,47.732104,0.94,street,Rue des Planchettes 90200 Giromagny,90052_0360,G,RUE DES PLANCHETTES,
301846093,00013,30184609300013,O,1975-01-01,NN,,,2018-09-29T12:09:47,true,5,,1,,FG,D'ALSACE,90200,GIROMAGNY,,,90052,,,,,,,,,,,,,,,,,,,2017-06-30,A,,,,,46.21Z,NAFRev2,N,6.828847,47.741907,0.82,housenumber,1 Faubourg d'Alsace 90200 Giromagny,90052_0030_00001,G,1 FAUBOURG D ALSACE,
301927422,00040,30192742200040,O,,,,,,true,1,,4,,RUE,DU COLLEGE,90200,GIROMAGNY,,,90052,,,,,,,,,,,,,,,,,,,1984-12-25,F,,,,,82.05,NAP,N,6.832945,47.742814,0.68,housenumber,4 Rue du Colonel Weber 90200 Giromagny,90052_0134_00004,G,4 RUE DU COLONEL WEBER,
303062152,00010,30306215200010,O,1900-01-01,NN,,,2008-01-04T19:23:05,true,3,,,,,,90200,GIROMAGNY,,,90052,,,,,,,,,,,,,,,,,,,2008-01-01,A,,,,,68.20B,NAFRev2,N,,,0,,,,,,
303262117,00029,30326211700029,O,,NN,,,,true,1,,5,,,GRAND RUE,90200,GIROMAGNY,,,90052,,,,,,,,,,,,,,,,,,,1992-01-13,F,,,,,02.0B,NAF1993,N,6.825452,47.74444,0.81,housenumber,5 Grande Rue 90200 Giromagny,90052_0240_00005,G,5 GRANDE RUE,
303374524,00013,30337452400013,O,,NN,,,,true,1,,4,,RUE,DE VESCEMONT,90200,GIROMAGNY,,,90052,,,,,,,,,,,,,,,,,,,,F,,,,,69.12,NAP,N,6.838512,47.7365,0.95,housenumber,4 Rue de Vescemont 90200 Giromagny,90052_0540_00004,G,4 RUE DE VESCEMONT,
303934004,00019,30393400400019,O,1900-01-01,,,,,false,4,,56,,RUE,DU TILLEUL,90200,GIROMAGNY,,,90052,,,,,,,,,,,,,,,,,,,1993-12-25,F,HOTEL DE LA SAPINIERE,,,,55.1A,NAF1993,N,6.821024,47.744892,0.96,housenumber,56 Rue du Tilleul 90200 Giromagny,90052_0510_00056,G,56 RUE DU TILLEUL,
303967699,00016,30396769900016,O,,NN,,,,true,1,,40,,,GRANDE RUE,90200,GIROMAGNY,,,90052,,,,,,,,,,,,,,,,,,,1989-06-23,F,,,,,00.10,NAP,N,6.826297,47.741575,0.96,housenumber,40 Grande Rue 90200 Giromagny,90052_0240_00040,G,40 GRANDE RUE,
304338890,00011,30433889000011,O,,NN,,,,true,1,,2,,RUE,THIERS,90200,GIROMAGNY,,,90052,,,,,,,,,,,,,,,,,,,1998-05-05,F,,,,,70.2C,NAF1993,N,6.824886,47.742091,0.96,housenumber,2 Rue Thiers 90200 Giromagny,90052_0490_00002,G,2 RUE THIERS,
304420771,00020,30442077100020,O,1900-01-01,NN,,,2019-07-15T08:56:33,false,3,,4,,,GRANDE PLACE,90200,GIROMAGNY,,,90052,,,,,,,,,,,,,,,,,,,1997-12-31,F,,,,,52.3A,NAF1993,O,6.831947,47.733225,0.51,street,Allee de la Grande Prairie 90200 Giromagny,90052_l2tcd4,G,ALLEE DE LA GRANDE PRAIRIE,
304462872,00017,30446287200017,O,,,,,,true,1,,4,,RUE,DE VESCEMONT,90200,GIROMAGNY,,,90052,,,,,,,,,,,,,,,,,,,1984-12-25,F,,,,,81.21,NAP,N,6.838512,47.7365,0.95,housenumber,4 Rue de Vescemont 90200 Giromagny,90052_0540_00004,G,4 RUE DE VESCEMONT,
304665631,00012,30466563100012,O,,,,1812ZA,2015-03-17T00:11:26,true,1,,7,,RUE,MAGINOT,90200,GIROMAGNY,,,90052,,,,,,,,,,,,,,,,,,,1984-12-25,F,,,,,51.10,NAP,N,6.827559,47.741839,0.94,housenumber,7 Rue André Maginot 90200 Giromagny,90052_0040_00007,G,7 RUE ANDRE MAGINOT,
304807704,00016,30480770400016,O,,,,,,true,1,,62,,RUE,DU TILLEUL,90200,GIROMAGNY,,,90052,,,,,,,,,,,,,,,,,,,1984-12-25,F,,,,,54.10,NAP,N,6.821082,47.743989,0.96,housenumber,62 Rue du Tilleul 90200 Giromagny,90052_0510_00062,G,62 RUE DU TILLEUL,
305003543,00017,30500354300017,O,1900-01-01,NN,,,2014-06-14T00:04:52,true,5,,53,,RUE,TILLEUL,90200,GIROMAGNY,,,90052,,,,,,,,,,,,,,,,,,,2012-10-31,A,,,,,86.21Z,NAFRev2,N,6.821338,47.744152,0.89,housenumber,53 Rue du Tilleul 90200 Giromagny,90052_0510_00053,G,53 RUE DU TILLEUL,
305862799,00023,30586279900023,O,,,,,,true,1,,,,RTE,DE LURE,90200,GIROMAGNY,,,90052,,,,,,,,,,,,,,,,,,,1984-12-25,F,,,,,55.60,NAP,N,6.810222,47.741342,0.79,street,Route de Lure 90200 Giromagny,90052_0265,G,ROUTE DE LURE,
306199217,00036,30619921700036,O,1993-10-01,NN,,,2011-05-03T00:11:22,false,4,,11,,AV,SCHWABMUNCHEN,90200,GIROMAGNY,,,90052,,,,,,,,,,,,,,,,,,,2002-05-30,F,,,,,26.7Z,NAF1993,O,6.829016,47.740146,0.86,housenumber,11 Avenue de Schwabmunchen 90200 Giromagny,90052_nrb4h4_00011,G,11 AVENUE DE SCHWABMUNCHEN,
306668260,00020,30666826000020,O,,,,,,true,1,,38,B,,GRAND RUE,90200,GIROMAGNY,,,90052,,,,,,,,,,,,,,,,,,,1984-12-25,F,,,,,55.40,NAP,N,6.826219,47.741609,0.82,interpolation,38 Grande Rue 90200 Giromagny,,G,36 GRANDE RUE,
306773219,00010,30677321900010,O,,,,,,true,1,,,,,LOTISSEMENT DES PLANCHETTE,90200,GIROMAGNY,,,90052,,,,,,,,,,,,,,,,,,,1984-12-25,F,,,,,64.11,NAP,N,6.83003,47.731127,0.63,street,Lot des Planchettes 90200 Giromagny,90052_0361,G,LOT DES PLANCHETTES,
306906397,00014,30690639700014,O,,,,,,true,1,,6,,RUE,DE LA 1ERE D F L,90200,GIROMAGNY,,,90052,,,,,,,,,,,,,,,,,,,1984-12-25,F,,,,,64.21,NAP,N,6.819827,47.749656,0.77,interpolation,6 Rue de la 1ere Dfl 90200 Giromagny,,G,4 RUE DE LA 1ERE DFL,
307008615,00014,30700861500014,O,,NN,,,,true,1,,25,,FG,D ALSACE,90200,GIROMAGNY,,,90052,,,,,,,,,,,,,,,,,,,1978-06-01,F,,,,,86.12,NAP,N,6.832316,47.740018,0.83,housenumber,25 Faubourg d'Alsace 90200 Giromagny,90052_0030_00025,G,25 FAUBOURG D ALSACE,
307186767,00017,30718676700017,O,,,,,,true,1,,76,,RUE,DE LA PREMIERE DFL,90200,GIROMAGNY,,,90052,,,,,,,,,,,,,,,,,,,1984-12-25,F,,,,,62.43,NAP,N,6.822164,47.747442,0.86,street,Rue de la Premiere Dfl 90200 Giromagny,90052_0380,G,RUE DE LA PREMIERE DFL,
308078690,00036,30807869000036,O,1987-02-11,NN,,,2018-09-29T12:12:05,false,5,,1,,,GRAND PLACE,90200,GIROMAGNY,,,90052,,,,,,,,,,,,,,,,,,,2015-06-01,F,,,,,69.10Z,NAFRev2,O,6.827363,47.743449,0.54,housenumber,1 Place des Commandos d’Afrique 90200 Giromagny,90052_2s0pr8_00001,G,1 PLACE DES COMMANDOS D AFRIQUE,
308078690,00077,30807869000077,O,2015-06-01,02,2021,,2023-11-30T10:20:14,false,1,,45,B,,GRANDE RUE,90200,GIROMAGNY,,,90052,,,,,,,,,,,,,,,,,,,2015-06-01,A,,,,,69.10Z,NAFRev2,O,6.826321,47.741685,0.84,housenumber,45bis Grande Rue 90200 Giromagny,90052_0240_00045_bis,G,45BIS GRANDE RUE,
308098383,00018,30809838300018,O,1900-01-01,,,1071DZ,2015-03-17T00:12:00,false,3,,1,,RUE,JOSEPH LHOMME,90200,GIROMAGNY,,,90052,,,,,,,,,,,,,,,,,,,1987-12-25,F,,,,,38.50,NAP,N,6.824509,47.741914,0.86,housenumber,1 Rue Joseph l’Homme 90200 Giromagny,90052_8jl4v0_00001,G,1 RUE JOSEPH L HOMME,
309161792,00010,30916179200010,O,1977-01-01,NN,,,,true,4,,14,,PL,GRANDE PLACE,90200,GIROMAGNY,,,90052,,,,,,,,,,,,,,,,,,,1996-12-25,F,,,,,55.1A,NAF1993,O,6.824997,47.742875,0.52,housenumber,14 Grande Rue 90200 Giromagny,90052_0240_00014,G,14 GRANDE RUE,
309378941,00038,30937894100038,O,,,,,,true,1,,13,A,RUE,DES PRES HEYD,90200,GIROMAGNY,,,90052,,,,,,,,,,,,,,,,,,,1984-12-25,F,,,,,55.70,NAP,N,6.821546,47.743129,0.96,housenumber,13a Rue des Pres Heyd 90200 Giromagny,90052_tlvfgy_00013_a,G,13A RUE DES PRES HEYD,
309504454,00013,30950445400013,O,,NN,,,,true,1,,10,,RUE,DES MINES,90200,GIROMAGNY,,,90052,,,,,,,,,,,,,,,,,,,1994-12-13,F,,,,,20.1A,NAF1993,N,6.818321,47.748876,0.95,housenumber,10 Rue des Mines 90200 Giromagny,90052_0280_00010,G,10 RUE DES MINES,
309887040,00025,30988704000025,O,,,,,,true,1,,11,,,GRANDE RUE,90200,GIROMAGNY,,,90052,,,,,,,,,,,,,,,,,,,1984-12-25,F,,,,,87.03,NAP,N,6.825799,47.743688,0.96,housenumber,11 Grande Rue 90200 Giromagny,90052_0240_00011,G,11 GRANDE RUE,
310103684,00059,31010368400059,O,2005-06-01,,,,2008-04-25T08:45:52,true,3,RES LE DOMAINE DES FOUGERE,2,B,RUE,DES FOUGERETS,90200,GIROMAGNY,,,90052,,,,,,,,,,,,,,,,,,,2008-02-13,F,,,,,71.12B,NAFRev2,N,6.82858,47.733493,0.87,housenumber,2bis Rue des Fougerets 90200 Giromagny,90052_0183_00002_bis,G,2BIS RUE DES FOUGERETS,
310104609,00014,31010460900014,P,1977-01-01,NN,,,2009-06-27T03:52:25,false,4,[ND],[ND],[ND],[ND],[ND],[ND],GIROMAGNY,,[ND],90052,[ND],[ND],,,[ND],[ND],[ND],[ND],[ND],[ND],,,[ND],,[ND],[ND],,,2007-01-01,F,[ND],[ND],[ND],[ND],52.4N,NAFRev1,O,,,0,,,,,,
310104609,00022,31010460900022,P,2007-01-01,NN,,4333ZZ,2020-11-24T19:35:48,false,3,[ND],[ND],[ND],[ND],[ND],[ND],GIROMAGNY,,[ND],90052,[ND],[ND],,,[ND],[ND],[ND],[ND],[ND],[ND],,,[ND],,[ND],[ND],,,2017-12-30,F,[ND],[ND],[ND],[ND],47.52A,NAFRev2,O,,,0,,,,,,
310182597,00016,31018259700016,O,1963-01-01,,,,,true,1,,2,,RUE,THIERS,90200,GIROMAGNY,,,90052,,,,,,,,,,,,,,,,,,,2000-02-29,F,,,,,70.2C,NAF1993,N,6.824886,47.742091,0.96,housenumber,2 Rue Thiers 90200 Giromagny,90052_0490_00002,G,2 RUE THIERS,
310687546,00013,31068754600013,O,1977-01-01,NN,,4322AZ,2019-06-24T13:17:14,true,5,,1,,RUE,ROSEMONT,90200,GIROMAGNY,,,90052,,,,,,,,,,,,,,,,,,,2017-06-30,F,,,,,43.22A,NAFRev2,O,6.828722,47.742055,0.89,housenumber,1 Rue du Rosemont 90200 Giromagny,90052_0440_00001,G,1 RUE DU ROSEMONT,
310771282,00012,31077128200012,O,,,,,,true,1,,13,,FG,BELFORT,90200,GIROMAGNY,,,90052,,,,,,,,,,,,,,,,,,,1995-12-25,F,,,,,70.2C,NAF1993,N,6.828364,47.738416,0.76,housenumber,13 Faubourg de Belfort 90200 Giromagny,90052_0060_00013,G,13 FAUBOURG DE BELFORT,
311133862,00020,31113386200020,O,1984-11-15,,,,2008-01-04T20:05:34,true,3,,18,,RUE,DU ROSEMONT,90200,GIROMAGNY,,,90052,,,,,,,,,,,,,,,,,,,2008-01-01,A,,,,,86.21Z,NAFRev2,N,6.831346,47.743022,0.96,housenumber,18 Rue du Rosemont 90200 Giromagny,90052_0440_00018,G,18 RUE DU ROSEMONT,
311211304,00010,31121130400010,O,,,,,,true,1,,19,,RUE,SOUS LA COTE,90200,GIROMAGNY,,,90052,,,,,,,,,,,,,,,,,,,1990-12-09,F,,,,,59.07,NAP,N,6.823049,47.734719,0.96,housenumber,19 Rue sous la Côte 90200 Giromagny,90052_0140_00019,G,19 RUE SOUS LA COTE,
311368823,00028,31136882300028,O,1998-11-09,NN,,1082ZZ,2020-03-26T03:36:52,true,4,,16,,,PETITE RUE DU TILLEUL,90200,GIROMAGNY,,,90052,,,,,,,,,,,,,,,,,,,2020-03-01,F,,,,,10.82Z,NAFRev2,N,6.818888,47.748385,0.96,housenumber,16 Petite Rue du Tilleul 90200 Giromagny,90052_0500_00016,G,16 PETITE RUE DU TILLEUL,
311371298,00010,31137129800010,O,,NN,,,,true,1,,24,,,GRANDE PLACE,90200,GIROMAGNY,,,90052,,,,,,,,,,,,,,,,,,,1993-03-26,F,,,,,55.3A,NAF1993,N,6.831947,47.733225,0.49,street,Allee de la Grande Prairie 90200 Giromagny,90052_l2tcd4,G,ALLEE DE LA GRANDE PRAIRIE,
311423289,00017,31142328900017,O,,NN,,,,true,1,,4,,RUE,THIERS,90200,GIROMAGNY,,,90052,,,,,,,,,,,,,,,,,,,1995-12-25,F,,,,,70.2C,NAF1993,N,6.824289,47.742224,0.96,housenumber,4 Rue Thiers 90200 Giromagny,90052_0490_00004,G,4 RUE THIERS,
311438949,00019,31143894900019,O,,,,,,true,1,,74,,RUE,DE LA 1ERE DFL,90200,GIROMAGNY,,,90052,,,,,,,,,,,,,,,,,,,1984-12-25,F,,,,,69.11,NAP,N,6.824642,47.744376,0.96,housenumber,74 Rue de la 1ere Dfl 90200 Giromagny,90052_j8z4no_00074,G,74 RUE DE LA 1ERE DFL,
311913230,00018,31191323000018,O,,,,,,true,1,,4,B,PL,GENERAL DE GAULLE,90200,GIROMAGNY,,,90052,,,,,,,,,,,,,,,,,,,1990-06-30,F,,,,,28.5A,NAF1993,N,6.828143,47.741509,0.71,street,Place General Charles de Gaulle 90200 Giromagny,90052_0150,G,PLACE GENERAL CHARLES DE GAULLE,
312077449,00014,31207744900014,O,1963-01-01,NN,,,2008-11-07T00:27:07,true,5,,39,,RUE,GRANDE RUE,90200,GIROMAGNY,,,90052,,,,,,,,,,,,,,,,,,,2005-11-30,F,,,,,93.0D,NAFRev1,O,6.825257,47.742242,0.85,housenumber,39 Grande Rue 90200 Giromagny,90052_0240_00039,G,39 GRANDE RUE,
312095896,00055,31209589600055,O,1993-04-01,NN,,,2011-04-23T04:43:52,false,5,,2,,,GRANDE PLACE,90200,GIROMAGNY,,,90052,,,,,,,,,,,,,,,,,,,2009-12-25,F,,,,,86.23Z,NAFRev2,O,6.831947,47.733225,0.51,street,Allee de la Grande Prairie 90200 Giromagny,90052_l2tcd4,G,ALLEE DE LA GRANDE PRAIRIE,
312095896,00063,31209589600063,O,2009-12-25,,,,2010-12-23T08:39:33,true,2,,46,,,GRANDE RUE,90200,GIROMAGNY,,,90052,,,,,,,,,,,,,,,,,,,2010-11-16,F,,,,,86.23Z,NAFRev2,O,6.826689,47.741379,0.96,housenumber,46 Grande Rue 90200 Giromagny,90052_0240_00046,G,46 GRANDE RUE,
312297252,00016,31229725200016,O,,,,,,true,1,,54,,FG,DE BELFORT,90200,GIROMAGNY,,,90052,,,,,,,,,,,,,,,,,,,1985-12-25,F,,,,,64.11,NAP,N,6.829152,47.73654,0.85,housenumber,54 Faubourg de Belfort 90200 Giromagny,90052_0060_00054,G,54 FAUBOURG DE BELFORT,
312663651,00023,31266365100023,O,1985-08-05,NN,,,2006-10-27T00:35:16,false,4,,9,,,GRANDE RUE,90200,GIROMAGNY,,,90052,,,,,,,,,,,,,,,,,,,2004-12-16,F,,,,,52.3A,NAFRev1,O,6.824979,47.743679,0.96,housenumber,9 Grande Rue 90200 Giromagny,90052_0240_00009,G,9 GRANDE RUE,
312663651,00031,31266365100031,O,2004-12-16,NN,,,2012-05-05T01:08:46,true,4,,2,,RUE,MAGINOT,90200,GIROMAGNY,,,90052,,,,,,,,,,,,,,,,,,,2010-07-31,F,,,,,47.73Z,NAFRev2,O,6.827904,47.741938,0.94,housenumber,2 Rue André Maginot 90200 Giromagny,90052_0040_00002,G,2 RUE ANDRE MAGINOT,
313162844,00028,31316284400028,O,1983-03-01,,,,2008-11-07T00:28:24,false,4,,11,,RUE,DE LA 1ERE D F L,90200,GIROMAGNY,,,90052,,,,,,,,,,,,,,,,,,,1999-07-01,F,SALON GYSLAINE,,,,93.0D,NAF1993,N,6.820855,47.748682,0.78,housenumber,11 Rue de la 1ere Dfl 90200 Giromagny,90052_j8z4no_00011,G,11 RUE DE LA 1ERE DFL,
313162885,00039,31316288500039,O,1994-11-01,NN,,,2008-11-07T00:28:24,true,4,,6,,RUE,DU QUARTIER NEUF,90200,GIROMAGNY,,,90052,,,,,,,,,,,,,,,,,,,2003-11-05,F,,,,,45.2J,NAFRev1,O,6.818151,47.748202,0.95,housenumber,6 Rue du Quartier Neuf 90200 Giromagny,90052_0420_00006,G,6 RUE DU QUARTIER NEUF,
313390254,00016,31339025400016,O,,,,,2006-11-25T09:32:11,true,1,,,,RUE,DE L EGLISE,90200,GIROMAGNY,,,90052,,,,,,,,,,,,,,,,,,,1997-05-27,F,,,,,85.1G,NAF1993,N,6.823448,47.743287,0.95,street,Rue de l'Eglise 90200 Giromagny,90052_0170,G,RUE DE L EGLISE,