siren,nic,siret,statutDiffusionEtablissement,dateCreationEtablissement,trancheEffectifsEtablissement,anneeEffectifsEtablissement,activitePrincipaleRegistreMetiersEtablissement,dateDernierTraitementEtablissement,etablissementSiege,nombrePeriodesEtablissement,complementAdresseEtablissement,numeroVoieEtablissement,indiceRepetitionEtablissement,typeVoieEtablissement,libelleVoieEtablissement,codePostalEtablissement,libelleCommuneEtablissement,libelleCommuneEtrangerEtablissement,distributionSpecialeEtablissement,codeCommuneEtablissement,codeCedexEtablissement,libelleCedexEtablissement,codePaysEtrangerEtablissement,libellePaysEtrangerEtablissement,complementAdresse2Etablissement,numeroVoie2Etablissement,indiceRepetition2Etablissement,typeVoie2Etablissement,libelleVoie2Etablissement,codePostal2Etablissement,libelleCommune2Etablissement,libelleCommuneEtranger2Etablissement,distributionSpeciale2Etablissement,codeCommune2Etablissement,codeCedex2Etablissement,libelleCedex2Etablissement,codePaysEtranger2Etablissement,libellePaysEtranger2Etablissement,dateDebut,etatAdministratifEtablissement,enseigne1Etablissement,enseigne2Etablissement,enseigne3Etablissement,denominationUsuelleEtablissement,activitePrincipaleEtablissement,nomenclatureActivitePrincipaleEtablissement,caractereEmployeurEtablissement,longitude,latitude,geo_score,geo_type,geo_adresse,geo_id,geo_ligne,geo_l4,geo_l5
210301529,00017,21030152900017,O,1983-03-01,02,2021,,2023-11-30T10:17:58,true,4,,,,,LE BOURG,03330,LOUROUX-DE-BOUBLE,,,03152,,,,,,,,,,,,,,,,,,,2008-01-01,A,MAIRIE,,,,84.11Z,NAFRev2,O,2.965064,46.21772,0.71,street,lieu-dit les bideaux 03330 Louroux-de-Bouble,03152_tc2p86,G,LIEU DIT LES BIDEAUX,
210301529,00025,21030152900025,O,1983-12-21,01,2021,,2023-11-30T10:17:58,false,3,LE BOURG,,,,,03330,LOUROUX-DE-BOUBLE,,,03152,,,,,,,,,,,,,,,,,,,2008-01-01,A,ECOLE ELEMENTAIRE PUBLIQUE,,,,85.20Z,NAFRev2,N,2.965064,46.21772,0.71,street,lieu-dit les bideaux 03330 Louroux-de-Bouble,03152_tc2p86,D,LIEU DIT LES BIDEAUX,
210301529,00033,21030152900033,O,1997-01-01,NN,,,2019-11-14T14:00:14,false,3,MAIRIE,,,,,03330,LOUROUX-DE-BOUBLE,,,03152,,,,,,,,,,,,,,,,,,,2008-01-01,A,SCE ASSAINISSEMENT,,,,37.00Z,NAFRev2,N,2.96787,46.240956,0.37,street,chemin de la verrerie 03330 Louroux-de-Bouble,03152_0195,D,CHEMIN DE LA VERRERIE,
210301529,00041,21030152900041,O,1982-05-01,NN,,,2019-11-14T14:00:14,false,3,,,,LD,LA GRAVIERE,03330,LOUROUX-DE-BOUBLE,,,03152,,,,,,,,,,,,,,,,,,,2008-01-01,A,CAMPING MUNICIPAL LA GRAVIERE,,,,55.30Z,NAFRev2,N,2.997495,46.22714,0.92,street,place de la gravière 03330 Louroux-de-Bouble,03152_0077,G,PLACE DE LA GRAVIERE,
250300621,00019,25030062100019,O,1983-03-01,03,2021,,2023-11-30T10:18:57,true,5,MAIRIE,,,,LE BOURG,03330,LOUROUX-DE-BOUBLE,,,03152,,,,,,,,,,,,,,,,,,,2008-09-18,A,,,,,84.11Z,NAFRev2,O,2.965064,46.21772,0.71,street,lieu-dit les bideaux 03330 Louroux-de-Bouble,03152_tc2p86,G,LIEU DIT LES BIDEAUX,
250300621,00027,25030062100027,O,1990-01-01,NN,,,2019-11-14T14:00:14,false,3,MAIRIE,,,,,03330,LOUROUX-DE-BOUBLE,,,03152,,,,,,,,,,,,,,,,,,,2008-01-01,A,TRANSPORTS DU RPRS,,,,49.39A,NAFRev2,N,2.96787,46.240956,0.37,street,chemin de la verrerie 03330 Louroux-de-Bouble,03152_0195,D,CHEMIN DE LA VERRERIE,
260301775,00011,26030177500011,O,1983-03-01,NN,,,2019-11-14T14:00:14,true,5,MAIRIE,,,,LE BOURG,03330,LOUROUX-DE-BOUBLE,,,03152,,,,,,,,,,,,,,,,,,,2016-01-01,F,,,,,88.99B,NAFRev2,N,2.965064,46.21772,0.71,street,lieu-dit les bideaux 03330 Louroux-de-Bouble,03152_tc2p86,G,LIEU DIT LES BIDEAUX,
290300250,00013,29030025000013,O,1983-08-10,NN,,,2019-11-14T14:00:14,true,3,,,,,HOTEL DE VILLE,03330,LOUROUX-DE-BOUBLE,,,03152,,,,,,,,,,,,,,,,,,,2007-11-23,F,,,,,70.1C,NAFRev1,N,2.967028,46.241498,0.39,street,place de marquefaille 03330 Louroux-de-Bouble,03152_0130,G,PLACE DE MARQUEFAILLE,
300692084,00019,30069208400019,O,,,,,2019-11-14T14:00:14,true,1,,,,LD,MAZET,03330,LOUROUX-DE-BOUBLE,,,03152,,,,,,,,,,,,,,,,,,,1984-12-25,F,,,,,,,N,2.98867,46.229214,0.42,street,Lieu Dit Luzet 03330 Louroux-de-Bouble,03152_a72k1m,G,LIEU DIT LUZET,
302567375,00019,30256737500019,O,,NN,,,2019-11-14T14:00:14,true,1,,,,,,03330,LOUROUX-DE-BOUBLE,,,03152,,,,,,,,,,,,,,,,,,,,F,,,,,69.12,NAP,N,,,0,,,,,,
304839343,00023,30483934300023,O,2011-04-14,,,,2022-03-11T10:31:46,false,2,,,,,LE CHASSIN,03330,LOUROUX-DE-BOUBLE,,,03152,,,,,,,,,,,,,,,,,,,2022-01-19,F,,,,,01.61Z,NAFRev2,N,2.959944,46.217985,0.91,street,lieu-dit le chassin 03330 Louroux-de-Bouble,03152_ty12un,G,LIEU DIT LE CHASSIN,
305999542,00015,30599954200015,O,1976-01-01,NN,,,2022-09-14T08:06:34,false,5,,,,,,03330,LOUROUX-DE-BOUBLE,,,03152,,,,,,,,,,,,,,,,,,,2012-05-01,F,,,,,68.20B,NAFRev2,N,,,0,,,,,,
305999542,00023,30599954200023,O,2009-01-01,,,,2019-11-14T14:00:14,true,3,,,,LD,LES BIOLLES,03330,LOUROUX-DE-BOUBLE,,,03152,,,,,,,,,,,,,,,,,,,2014-07-08,A,,,,,01.49Z,NAFRev2,N,2.965064,46.21772,0.55,street,lieu-dit les bideaux 03330 Louroux-de-Bouble,03152_tc2p86,G,LIEU DIT LES BIDEAUX,
309804862,00014,30980486200014,O,,NN,,,2019-11-14T14:00:14,true,1,,,,,,03330,LOUROUX-DE-BOUBLE,,,03152,,,,,,,,,,,,,,,,,,,1987-03-31,F,,,,,62.11,NAP,N,,,0,,,,,,
309934172,00011,30993417200011,O,,NN,,,2019-11-14T14:00:14,true,1,,,,,,03330,LOUROUX-DE-BOUBLE,,,03152,,,,,,,,,,,,,,,,,,,1988-12-31,F,,,,,77.14,NAP,N,,,0,,,,,,
310477351,00038,31047735100038,P,1974-01-01,NN,,,2024-01-17T20:49:27,true,5,[ND],[ND],[ND],[ND],[ND],[ND],LOUROUX-DE-BOUBLE,,[ND],03152,[ND],[ND],,,[ND],[ND],[ND],[ND],[ND],[ND],,,[ND],,[ND],[ND],,,2011-10-01,A,[ND],[ND],[ND],[ND],68.20B,NAFRev2,N,,,0,,,,,,
310700117,00016,31070011700016,O,,,,,2019-11-14T14:00:14,true,1,,,,,,03330,LOUROUX-DE-BOUBLE,,,03152,,,,,,,,,,,,,,,,,,,1987-04-30,F,,,,,55.60,NAP,N,,,0,,,,,,
311965768,00014,31196576800014,O,,NN,,,2019-11-14T14:00:14,true,1,,,,,LE BOURG,03330,LOUROUX-DE-BOUBLE,,,03152,,,,,,,,,,,,,,,,,,,1988-03-31,F,,,,,21.01,NAP,N,2.965064,46.21772,0.71,street,lieu-dit les bideaux 03330 Louroux-de-Bouble,03152_tc2p86,G,LIEU DIT LES BIDEAUX,
313749046,00014,31374904600014,O,1900-01-01,,,,2019-11-14T14:00:14,true,3,,,,,,03330,LOUROUX-DE-BOUBLE,,,03152,,,,,,,,,,,,,,,,,,,1993-12-25,F,,,,,01.2A,NAF1993,N,,,0,,,,,,
315965822,00028,31596582200028,O,1999-12-01,NN,,,2019-11-14T14:00:14,false,4,,,,,LE BOURG,03330,LOUROUX-DE-BOUBLE,,,03152,,,,,,,,,,,,,,,,,,,2008-01-01,A,,,,,16.24Z,NAFRev2,O,2.965064,46.21772,0.71,street,lieu-dit les bideaux 03330 Louroux-de-Bouble,03152_tc2p86,G,LIEU DIT LES BIDEAUX,
316311885,00081,31631188500081,O,2010-05-17,,,,2019-11-14T14:00:14,false,2,,,,,LE BOURG,03330,LOUROUX-DE-BOUBLE,,,03152,,,,,,,,,,,,,,,,,,,2011-02-17,F,,,,,47.89Z,NAFRev2,N,2.965064,46.21772,0.71,street,lieu-dit les bideaux 03330 Louroux-de-Bouble,03152_tc2p86,G,LIEU DIT LES BIDEAUX,
318508330,00012,31850833000012,O,,,,,2019-11-14T14:00:14,true,1,,,,,LES BRULARDS,03330,LOUROUX-DE-BOUBLE,,,03152,,,,,,,,,,,,,,,,,,,1984-12-25,F,,,,,64.46,NAP,N,2.976061,46.212547,0.92,street,Lieu Dit les Brulards 03330 Louroux-de-Bouble,03152_0lhwt3,G,LIEU DIT LES BRULARDS,
319171096,00062,31917109600062,O,2017-05-06,,,,2019-11-14T14:00:14,false,4,,,,LD,MANIFAIX,03330,LOUROUX-DE-BOUBLE,,,03152,,,,,,,,,,,,,,,,,,,2019-05-28,F,DOMAINE DE MANIFAIX,,,,01.47Z,NAFRev2,N,2.935302,46.224057,0.91,street,Lieu Dit Manifaix 03330 Louroux-de-Bouble,03152_z1qde7,G,LIEU DIT MANIFAIX,
319305538,00039,31930553800039,O,,NN,,,2019-11-14T14:00:14,true,1,,,,,LA GRAVIERE,03330,LOUROUX-DE-BOUBLE,,,03152,,,,,,,,,,,,,,,,,,,1995-12-15,F,,,,,60.2L,NAF1993,N,2.997495,46.22714,0.92,street,place de la gravière 03330 Louroux-de-Bouble,03152_0077,G,PLACE DE LA GRAVIERE,
321239683,00014,32123968300014,O,,,,,2019-11-14T14:00:14,true,1,,,,RTE,DE LA GARE,03330,LOUROUX-DE-BOUBLE,,,03152,,,,,,,,,,,,,,,,,,,1991-09-30,F,,,,,57.08,NAP,N,2.98465,46.223689,0.76,street,rue de la gare 03330 Louroux-de-Bouble,03152_0075,G,RUE DE LA GARE,
324560531,00018,32456053100018,O,,,,,2019-11-14T14:00:14,true,1,,,,,,03330,LOUROUX-DE-BOUBLE,,,03152,,,,,,,,,,,,,,,,,,,1985-12-25,F,,,,,67.08,NAP,N,,,0,,,,,,
325168284,00017,32516828400017,O,,NN,,,2019-11-14T14:00:14,true,1,,,,,,03330,LOUROUX-DE-BOUBLE,,,03152,,,,,,,,,,,,,,,,,,,1994-03-13,F,,,,,52.1B,NAF1993,O,,,0,,,,,,
332404672,00021,33240467200021,O,,NN,,,2019-11-14T14:00:14,true,1,,,,,,03330,LOUROUX-DE-BOUBLE,,,03152,,,,,,,,,,,,,,,,,,,1995-12-15,F,,,,,55.3A,NAF1993,N,,,0,,,,,,
341670404,00035,34167040400035,O,,NN,,,2019-11-14T14:00:14,true,1,,,,,MAIS FORESTIERE LA GRAVIER,03330,LOUROUX-DE-BOUBLE,,,03152,,,,,,,,,,,,,,,,,,,1996-03-31,F,,,,,85.1G,NAF1993,N,,,0,,,,,,
343196366,00011,34319636600011,O,1987-10-01,NN,,,2019-11-14T14:00:14,true,3,,,,,LES CHASSINS,03330,LOUROUX-DE-BOUBLE,,,03152,,,,,,,,,,,,,,,,,,,2008-01-01,A,,,,,01.50Z,NAFRev2,N,2.959944,46.217985,0.57,street,lieu-dit le chassin 03330 Louroux-de-Bouble,03152_ty12un,G,LIEU DIT LE CHASSIN,
344342084,00011,34434208400011,O,,NN,,,2019-11-14T14:00:14,true,1,,,,,LE BOURG,03330,LOUROUX-DE-BOUBLE,,,03152,,,,,,,,,,,,,,,,,,,1993-09-30,F,,,,,55.3A,NAF1993,N,2.965064,46.21772,0.71,street,lieu-dit les bideaux 03330 Louroux-de-Bouble,03152_tc2p86,G,LIEU DIT LES BIDEAUX,
344661681,00017,34466168100017,O,,NN,,,2019-11-14T14:00:14,true,1,,,,,,03330,LOUROUX-DE-BOUBLE,,,03152,,,,,,,,,,,,,,,,,,,1989-06-30,F,,,,,67.08,NAP,N,,,0,,,,,,
347670465,00017,34767046500017,O,,,,,2019-11-14T14:00:14,true,1,,,,AV,DE LA GARE,03330,LOUROUX-DE-BOUBLE,,,03152,,,,,,,,,,,,,,,,,,,1993-03-31,F,,,,,93.0D,NAF1993,N,2.98465,46.223689,0.74,street,rue de la gare 03330 Louroux-de-Bouble,03152_0075,G,RUE DE LA GARE,
352046817,00016,35204681700016,O,1989-01-01,NN,,,2019-11-14T14:00:14,true,3,,,,,LA GRAVIERE,03330,LOUROUX-DE-BOUBLE,,,03152,,,,,,,,,,,,,,,,,,,2008-01-01,A,,,,,68.20B,NAFRev2,N,2.997495,46.22714,0.92,street,place de la gravière 03330 Louroux-de-Bouble,03152_0077,G,PLACE DE LA GRAVIERE,
353292485,00011,35329248500011,O,1989-09-01,NN,,,2019-11-14T14:00:14,true,4,,,,,LE BOURG,03330,LOUROUX-DE-BOUBLE,,,03152,,,,,,,,,,,,,,,,,,,2008-01-01,A,,,,,01.42Z,NAFRev2,N,2.965064,46.21772,0.71,street,lieu-dit les bideaux 03330 Louroux-de-Bouble,03152_tc2p86,G,LIEU DIT LES BIDEAUX,
354045759,00017,35404575900017,O,1990-03-01,NN,,3312ZB,2019-11-14T14:00:14,true,3,,,,,LA GRAVIERE,03330,LOUROUX-DE-BOUBLE,,,03152,,,,,,,,,,,,,,,,,,,2008-01-01,A,,,,,28.12Z,NAFRev2,N,2.997495,46.22714,0.92,street,place de la gravière 03330 Louroux-de-Bouble,03152_0077,G,PLACE DE LA GRAVIERE,
356000000,54962,35600000054962,O,2012-01-01,,,,2019-11-14T14:00:14,false,2,,5046,,,LE BOURG,03330,LOUROUX-DE-BOUBLE,,,03152,,,,,,,,,,,,,,,,,,,2012-12-31,F,IMMEUBLE POSTE,,,,53.10Z,NAFRev2,N,2.965064,46.21772,0.71,street,lieu-dit les bideaux 03330 Louroux-de-Bouble,03152_tc2p86,G,LIEU DIT LES BIDEAUX,
356000836,00854,35600083600854,O,1991-01-01,NN,,,2019-11-14T14:00:14,false,4,,,,RTE,D' ECHASSIERES,03330,LOUROUX-DE-BOUBLE,,,03152,,,,,,,,,,,,,,,,,,,2009-03-18,F,BUREAU DE POSTE,,,,53.10Z,NAFRev2,O,2.975865,46.211232,0.34,street,route du Château d'Eau 03330 Louroux-de-Bouble,03152_0035,G,ROUTE DU CHATEAU D EAU,
378149793,00010,37814979300010,O,1900-01-01,,,,2019-11-14T14:00:14,false,3,,,,,LA GARE,03330,LOUROUX-DE-BOUBLE,,,03152,,,,,,,,,,,,,,,,,,,1991-08-31,F,,,,,,,N,2.98465,46.223689,0.92,street,rue de la gare 03330 Louroux-de-Bouble,03152_0075,G,RUE DE LA GARE,
382255008,00015,38225500800015,O,1991-06-03,NN,,,2019-11-14T14:00:14,true,4,,,,,LA PETITE COTE,03330,LOUROUX-DE-BOUBLE,,,03152,,,,,,,,,,,,,,,,,,,1996-12-31,F,,,,,45.1A,NAF1993,O,2.943206,46.22789,0.73,street,Lieu Dit Petite Cote 03330 Louroux-de-Bouble,03152_B067,G,LIEU DIT PETITE COTE,
382540912,00021,38254091200021,O,1991-07-01,,,,2019-11-14T14:00:14,false,6,,,,,LE BOURG,03330,LOUROUX-DE-BOUBLE,,,03152,,,,,,,,,,,,,,,,,,,2014-12-01,F,BOUTES SA,,,,68.20B,NAFRev2,N,2.965064,46.21772,0.71,street,lieu-dit les bideaux 03330 Louroux-de-Bouble,03152_tc2p86,G,LIEU DIT LES BIDEAUX,
383536182,00017,38353618200017,O,,NN,,,2019-11-14T14:00:14,true,1,,,,,,03330,LOUROUX-DE-BOUBLE,,,03152,,,,,,,,,,,,,,,,,,,1992-02-29,F,,,,,55.3A,NAF1993,N,,,0,,,,,,
384004602,00015,38400460200015,O,1992-01-01,02,2021,4312BA,2023-11-30T10:21:21,false,5,,7,,RTE,DE LA BOSSE,03330,LOUROUX-DE-BOUBLE,,,03152,,,,,,,,,,,,,,,,,,,2017-10-01,A,TPTM,,,SARL TPTM,43.12A,NAFRev2,O,2.98843,46.222863,0.84,housenumber,7 route de la bosse 03330 Louroux-de-Bouble,03152_0020_00007,G,7 ROUTE DE LA BOSSE,
384004602,00023,38400460200023,O,2017-10-01,,,,2020-04-01T11:50:41,false,3,,30,,RUE,DE LA GARE,03330,LOUROUX-DE-BOUBLE,,,03152,,,,,,,,,,,,,,,,,,,2019-11-01,F,,,,,02.40Z,NAFRev2,N,2.987966,46.223659,0.94,housenumber,30 rue de la gare 03330 Louroux-de-Bouble,03152_0075_00030,G,30 RUE DE LA GARE,
384004602,00031,38400460200031,O,2017-10-01,12,2021,,2023-11-30T10:21:21,true,3,,14,,RTE,DE LA BOSSE,03330,LOUROUX-DE-BOUBLE,,,03152,,,,,,,,,,,,,,,,,,,2018-04-24,A,,,,,49.41B,NAFRev2,O,2.986921,46.22157,0.85,housenumber,14 route de la bosse 03330 Louroux-de-Bouble,03152_0020_00014,G,14 ROUTE DE LA BOSSE,
384005781,00016,38400578100016,O,1991-04-01,NN,,,2019-11-14T14:00:14,true,4,,,,,LUZET,03330,LOUROUX-DE-BOUBLE,,,03152,,,,,,,,,,,,,,,,,,,2008-01-01,A,,,,,01.42Z,NAFRev2,N,2.98867,46.229214,0.9,street,Lieu Dit Luzet 03330 Louroux-de-Bouble,03152_a72k1m,G,LIEU DIT LUZET,
384009023,00019,38400902300019,O,1991-10-01,NN,,,2019-11-14T14:00:14,true,1,,,,RTE,DE LA GARE,03330,LOUROUX-DE-BOUBLE,,,03152,,,,,,,,,,,,,,,,,,,2002-09-30,F,,,,,51.3J,NAF1993,O,2.98465,46.223689,0.76,street,rue de la gare 03330 Louroux-de-Bouble,03152_0075,G,RUE DE LA GARE,
388717191,00018,38871719100018,O,1992-04-01,NN,,,2019-11-14T14:00:14,false,4,,,,,LE BOURG,03330,LOUROUX-DE-BOUBLE,,,03152,,,,,,,,,,,,,,,,,,,2001-09-30,F,,,,,15.8C,NAF1993,N,2.965064,46.21772,0.71,street,lieu-dit les bideaux 03330 Louroux-de-Bouble,03152_tc2p86,G,LIEU DIT LES BIDEAUX,
390137255,00019,39013725500019,O,1993-01-01,NN,,,2019-11-14T14:00:14,false,3,,,,,MARQUE FAILLE,03330,LOUROUX-DE-BOUBLE,,,03152,,,,,,,,,,,,,,,,,,,2008-01-01,A,,,,,01.50Z,NAFRev2,N,,,0,,,,,,
391087954,00015,39108795400015,O,1993-04-01,NN,,,2019-11-14T14:00:14,true,1,,,,,LA GARE,03330,LOUROUX-DE-BOUBLE,,,03152,,,,,,,,,,,,,,,,,,,1999-04-30,F,,,,,93.0D,NAF1993,O,2.98465,46.223689,0.92,street,rue de la gare 03330 Louroux-de-Bouble,03152_0075,G,RUE DE LA GARE,
391957537,00031,39195753700031,O,2022-12-10,,,,2023-10-07T11:52:15,true,1,,9,,LD,BOUTEVIN,03330,LOUROUX-DE-BOUBLE,,,03152,,,,,,,,,,,,,,,,,,,2022-12-10,A,,,,,02.10Z,NAFRev2,N,2.956343,46.23385,0.84,housenumber,9 lieu-dit boutevin 03330 Louroux-de-Bouble,03152_6zrtmn_00009,G,9 LIEU DIT BOUTEVIN,
392321279,00011,39232127900011,O,1994-01-01,NN,,,2019-11-14T14:00:14,true,3,,,,,LES THUIZARDS,03330,LOUROUX-DE-BOUBLE,,,03152,,,,,,,,,,,,,,,,,,,2008-01-01,A,,,,,01.11Z,NAFRev2,N,2.959422,46.223949,0.92,street,lieu-dit les thuizards 03330 Louroux-de-Bouble,03152_qeff17,G,LIEU DIT LES THUIZARDS,
394441653,00018,39444165300018,O,1992-05-01,NN,,,2019-11-14T14:00:14,true,3,,,,,LE BOURG,03330,LOUROUX-DE-BOUBLE,,,03152,,,,,,,,,,,,,,,,,,,2003-11-11,F,,,,,01.2C,NAFRev1,N,2.965064,46.21772,0.71,street,lieu-dit les bideaux 03330 Louroux-de-Bouble,03152_tc2p86,G,LIEU DIT LES BIDEAUX,
395272396,00064,39527239600064,O,2022-05-30,,,,2023-05-11T03:47:29,false,2,,6,,RUE,DES ECOLES,03330,LOUROUX-DE-BOUBLE,,,03152,,,,,,,,,,,,,,,,,,,2023-05-01,F,,,,,86.90F,NAFRev2,N,2.980336,46.225662,0.94,housenumber,6 rue des écoles 03330 Louroux-de-Bouble,03152_0060_00006,G,6 RUE DES ECOLES,
400621744,00012,40062174400012,O,1990-01-01,NN,,,2019-11-14T14:00:14,true,1,,,,,LA GRAVIERE,03330,LOUROUX-DE-BOUBLE,,,03152,,,,,,,,,,,,,,,,,,,1998-01-01,F,,,,,01.2A,NAF1993,N,2.997495,46.22714,0.92,street,place de la gravière 03330 Louroux-de-Bouble,03152_0077,G,PLACE DE LA GRAVIERE,
402049985,00011,40204998500011,O,1995-08-07,NN,,,2019-11-14T14:00:14,true,3,,,,,LE BOURG,03330,LOUROUX-DE-BOUBLE,,,03152,,,,,,,,,,,,,,,,,,,2008-01-01,A,,,,,68.20A,NAFRev2,N,2.965064,46.21772,0.71,street,lieu-dit les bideaux 03330 Louroux-de-Bouble,03152_tc2p86,G,LIEU DIT LES BIDEAUX,
402515324,00026,40251532400026,O,2000-03-01,NN,,,2019-11-14T14:00:14,true,4,,,,LD,LA GRANDE COTE,03330,LOUROUX-DE-BOUBLE,,,03152,,,,,,,,,,,,,,,,,,,2008-01-01,A,,,,,01.42Z,NAFRev2,N,2.944447,46.230118,0.5,street,lieu-dit la côte 03330 Louroux-de-Bouble,03152_m2r5b9,G,LIEU DIT LA COTE,
402958649,00012,40295864900012,O,1995-01-01,NN,,,2019-11-14T14:00:14,true,1,,,,,LES CABANNES,03330,LOUROUX-DE-BOUBLE,,,03152,,,,,,,,,,,,,,,,,,,1998-12-31,F,,,,,55.2E,NAF1993,N,2.934778,46.227217,0.39,street,Lieu Dit les Cosses 03330 Louroux-de-Bouble,03152_xp4hgc,G,LIEU DIT LES COSSES,
403664287,00014,40366428700014,O,1996-03-02,NN,,5610CQ,2022-01-27T03:55:56,true,9,,,,,LA GARE,03330,LOUROUX-DE-BOUBLE,,,03152,,,,,,,,,,,,,,,,,,,2022-01-31,F,,,,,56.10A,NAFRev2,N,2.98465,46.223689,0.92,street,rue de la gare 03330 Louroux-de-Bouble,03152_0075,G,RUE DE LA GARE,
404309106,00023,40430910600023,O,2000-07-01,NN,,,2019-11-14T14:00:14,true,3,,,,,LA GRAVIERE,03330,LOUROUX-DE-BOUBLE,,,03152,,,,,,,,,,,,,,,,,,,2004-08-12,F,,,,,45.3E,NAFRev1,N,2.997495,46.22714,0.92,street,place de la gravière 03330 Louroux-de-Bouble,03152_0077,G,PLACE DE LA GRAVIERE,
404335226,00027,40433522600027,O,2010-07-25,01,2021,,2023-12-29T11:32:02,true,2,,,,LD,BOUTEVIN,03330,LOUROUX-DE-BOUBLE,,,03152,,,,,,,,,,,,,,,,,,,2023-12-31,F,,,,,01.21Z,NAFRev2,O,2.960444,46.2371,0.91,street,lieu-dit boutevin 03330 Louroux-de-Bouble,03152_6zrtmn,G,LIEU DIT BOUTEVIN,
407496066,00017,40749606600017,O,,NN,,,2019-11-14T14:00:14,true,1,,,,,CHEMIN COMMUNAL LA GRAVIER,03330,LOUROUX-DE-BOUBLE,,,03152,,,,,,,,,,,,,,,,,,,1996-07-31,F,,,,,85.1H,NAF1993,N,2.997495,46.22714,0.38,street,place de la gravière 03330 Louroux-de-Bouble,03152_0077,G,PLACE DE LA GRAVIERE,
410744825,00010,41074482500010,O,1995-01-01,NN,,,2023-05-05T20:35:33,true,4,,,,,MARQUEFAILLE,03330,LOUROUX-DE-BOUBLE,,,03152,,,,,,,,,,,,,,,,,,,2017-12-25,F,,,,,01.42Z,NAFRev2,N,2.967028,46.241498,0.92,street,place de marquefaille 03330 Louroux-de-Bouble,03152_0130,G,PLACE DE MARQUEFAILLE,
411353824,00013,41135382400013,O,1990-01-01,NN,,,2019-11-14T14:00:14,true,3,,,,,LA GRAIRERE,03330,LOUROUX-DE-BOUBLE,,,03152,,,,,,,,,,,,,,,,,,,2003-09-01,F,,,,,55.2E,NAFRev1,N,2.997495,46.22714,0.62,street,place de la gravière 03330 Louroux-de-Bouble,03152_0077,G,PLACE DE LA GRAVIERE,
412169989,00016,41216998900016,O,1987-12-31,NN,,,2019-11-14T14:00:14,true,3,,,,,BOUCE,03330,LOUROUX-DE-BOUBLE,,,03152,,,,,,,,,,,,,,,,,,,2008-01-01,A,,,,,01.11Z,NAFRev2,N,2.987155,46.220624,0.91,street,Lieu Dit Bouce 03330 Louroux-de-Bouble,03152_5qweec,G,LIEU DIT BOUCE,
412178683,00014,41217868300014,O,1987-12-31,NN,,,2019-11-14T14:00:14,true,5,,,,,MARQUEFAILLE,03330,LOUROUX-DE-BOUBLE,,,03152,,,,,,,,,,,,,,,,,,,2010-12-31,F,,,,,01.41Z,NAFRev2,N,2.967028,46.241498,0.92,street,place de marquefaille 03330 Louroux-de-Bouble,03152_0130,G,PLACE DE MARQUEFAILLE,
412280737,13891,41228073713891,O,2015-01-01,01,2021,,2023-11-30T10:30:22,false,2,,,,LD,LA GARE,03330,LOUROUX-DE-BOUBLE,,,03152,,,,,,,,,,,,,,,,,,,2015-06-30,A,,,,,52.21Z,NAFRev2,O,2.98465,46.223689,0.92,street,rue de la gare 03330 Louroux-de-Bouble,03152_0075,G,RUE DE LA GARE,
413480500,00011,41348050000011,O,1991-01-01,NN,,,2019-11-14T14:00:14,true,4,,,,,LE BOURG,03330,LOUROUX-DE-BOUBLE,,,03152,,,,,,,,,,,,,,,,,,,2003-12-31,F,,,,,01.1A,NAFRev1,N,2.965064,46.21772,0.71,street,lieu-dit les bideaux 03330 Louroux-de-Bouble,03152_tc2p86,G,LIEU DIT LES BIDEAUX,
417554086,00021,41755408600021,O,2016-02-01,,,,2022-09-16T09:26:40,true,2,,,,LD,LES COMBES,03330,LOUROUX-DE-BOUBLE,,,03152,,,,,,,,,,,,,,,,,,,2021-12-31,F,,,,,47.78C,NAFRev2,N,2.977937,46.227356,0.74,street,chemin des combes 03330 Louroux-de-Bouble,03152_0045,G,CHEMIN DES COMBES,
417637626,00017,41763762600017,O,1998-01-01,NN,,,2019-11-14T14:00:14,true,3,,,,,LA GRAVIERE,03330,LOUROUX-DE-BOUBLE,,,03152,,,,,,,,,,,,,,,,,,,2008-01-01,A,,,,,01.42Z,NAFRev2,N,2.997495,46.22714,0.92,street,place de la gravière 03330 Louroux-de-Bouble,03152_0077,G,PLACE DE LA GRAVIERE,
418085833,00014,41808583300014,O,1998-03-17,NN,,,2019-11-14T14:00:14,true,4,,,,,LE BOURG,03330,LOUROUX-DE-BOUBLE,,,03152,,,,,,,,,,,,,,,,,,,2011-09-30,F,,,,,47.22Z,NAFRev2,N,2.965064,46.21772,0.71,street,lieu-dit les bideaux 03330 Louroux-de-Bouble,03152_tc2p86,G,LIEU DIT LES BIDEAUX,
419928429,00010,41992842900010,O,1998-09-01,NN,,,2019-11-14T14:00:14,true,3,,,,,LES CABANNES,03330,LOUROUX-DE-BOUBLE,,,03152,,,,,,,,,,,,,,,,,,,2008-01-01,A,,,,,71.12A,NAFRev2,N,2.934778,46.227217,0.39,street,Lieu Dit les Cosses 03330 Louroux-de-Bouble,03152_xp4hgc,G,LIEU DIT LES COSSES,
420321069,00015,42032106900015,O,1995-01-01,NN,,,2019-11-14T14:00:14,true,4,,,,,LE CHASSIN,03330,LOUROUX-DE-BOUBLE,,,03152,,,,,,,,,,,,,,,,,,,2002-12-31,F,,,,,67.2Z,NAF1993,N,2.959944,46.217985,0.91,street,lieu-dit le chassin 03330 Louroux-de-Bouble,03152_ty12un,G,LIEU DIT LE CHASSIN,
420741563,00035,42074156300035,O,2022-05-14,,,4722ZA,2022-06-16T04:06:08,false,1,,2,,PL,DU MONUMENT,03330,LOUROUX-DE-BOUBLE,,,03152,,,,,,,,,,,,,,,,,,,2022-05-14,A,,,,,47.11B,NAFRev2,N,2.979533,46.225017,0.83,housenumber,2 Place du Monument 03330 Louroux-de-Bouble,03152_0135_00002,G,2 PLACE DU MONUMENT,
425320314,00015,42532031400015,O,1976-01-01,NN,,,2023-07-03T21:01:19,true,4,,,,,,03330,LOUROUX-DE-BOUBLE,,,03152,,,,,,,,,,,,,,,,,,,2016-12-25,F,,,,,01.42Z,NAFRev2,N,,,0,,,,,,
430035162,00014,43003516200014,O,2000-03-15,NN,,9602AA,2021-02-23T11:49:50,true,3,,,,,LA GARE,03330,LOUROUX-DE-BOUBLE,,,03152,,,,,,,,,,,,,,,,,,,2008-01-01,A,,,,,96.02A,NAFRev2,N,2.98465,46.223689,0.92,street,rue de la gare 03330 Louroux-de-Bouble,03152_0075,G,RUE DE LA GARE,
434877312,00026,43487731200026,O,2009-11-30,,,,2021-02-23T13:16:54,true,1,,,,LD,BOUTEVIN,03330,LOUROUX-DE-BOUBLE,,,03152,,,,,,,,,,,,,,,,,,,2009-11-30,A,,,,ENTREPRISE ANDRET,81.30Z,NAFRev2,N,2.960444,46.2371,0.91,street,lieu-dit boutevin 03330 Louroux-de-Bouble,03152_6zrtmn,G,LIEU DIT BOUTEVIN,
440664803,00010,44066480300010,O,2002-02-02,NN,,,2019-11-14T14:00:14,true,4,LE BOURG,,,PL,DE L'EGLISE,03330,LOUROUX-DE-BOUBLE,,,03152,,,,,,,,,,,,,,,,,,,2009-03-31,F,,,,,47.62Z,NAFRev2,N,2.978925,46.225786,0.82,street,place de l'église 03330 Louroux-de-Bouble,03152_0063,G,PLACE DE L EGLISE,
441557741,00010,44155774100010,O,1953-02-25,NN,,,2019-11-14T14:00:14,true,5,MAIRIE,,,,,03330,LOUROUX-DE-BOUBLE,,,03152,,,,,,,,,,,,,,,,,,,2015-06-30,A,,,,,94.99Z,NAFRev2,N,2.96787,46.240956,0.37,street,chemin de la verrerie 03330 Louroux-de-Bouble,03152_0195,D,CHEMIN DE LA VERRERIE,
442108973,00011,44210897300011,O,1987-09-15,NN,,,2021-05-04T14:35:02,true,3,MAIRIE,8,,RUE,DES ECOLES,03330,LOUROUX-DE-BOUBLE,,,03152,,,,,,,,,,,,,,,,,,,2008-01-01,A,,,,,93.12Z,NAFRev2,N,2.980457,46.225718,0.94,housenumber,8 rue des écoles 03330 Louroux-de-Bouble,03152_0060_00008,G,8 RUE DES ECOLES,
443416722,00017,44341672200017,O,2002-08-21,NN,,,2019-11-14T14:00:14,true,4,,,,,LES CABANNES,03330,LOUROUX-DE-BOUBLE,,,03152,,,,,,,,,,,,,,,,,,,2010-06-08,F,,,,,68.20B,NAFRev2,N,2.934778,46.227217,0.39,street,Lieu Dit les Cosses 03330 Louroux-de-Bouble,03152_xp4hgc,G,LIEU DIT LES COSSES,
444279061,00014,44427906100014,O,2002-10-01,NN,,,2019-11-14T14:00:14,false,4,,,,,BOUCE,03330,LOUROUX-DE-BOUBLE,,,03152,,,,,,,,,,,,,,,,,,,2008-08-01,F,,,,,43.21A,NAFRev2,O,2.987155,46.220624,0.91,street,Lieu Dit Bouce 03330 Louroux-de-Bouble,03152_5qweec,G,LIEU DIT BOUCE,
444279061,00022,44427906100022,O,2008-08-01,NN,,4321AB,2021-10-27T08:25:17,true,2,,,,,LE BOURG,03330,LOUROUX-DE-BOUBLE,,,03152,,,,,,,,,,,,,,,,,,,2016-01-12,A,,,,,43.21A,NAFRev2,N,2.965064,46.21772,0.71,street,lieu-dit les bideaux 03330 Louroux-de-Bouble,03152_tc2p86,G,LIEU DIT LES BIDEAUX,
449690619,00019,44969061900019,O,2003-08-14,NN,,,2019-11-14T14:00:14,false,4,,,,,LE BOURG,03330,LOUROUX-DE-BOUBLE,,,03152,,,,,,,,,,,,,,,,,,,2010-08-01,F,,,,,01.62Z,NAFRev2,N,2.965064,46.21772,0.71,street,lieu-dit les bideaux 03330 Louroux-de-Bouble,03152_tc2p86,G,LIEU DIT LES BIDEAUX,