siren,nic,siret,statutDiffusionEtablissement,dateCreationEtablissement,trancheEffectifsEtablissement,anneeEffectifsEtablissement,activitePrincipaleRegistreMetiersEtablissement,dateDernierTraitementEtablissement,etablissementSiege,nombrePeriodesEtablissement,complementAdresseEtablissement,numeroVoieEtablissement,indiceRepetitionEtablissement,typeVoieEtablissement,libelleVoieEtablissement,codePostalEtablissement,libelleCommuneEtablissement,libelleCommuneEtrangerEtablissement,distributionSpecialeEtablissement,codeCommuneEtablissement,codeCedexEtablissement,libelleCedexEtablissement,codePaysEtrangerEtablissement,libellePaysEtrangerEtablissement,complementAdresse2Etablissement,numeroVoie2Etablissement,indiceRepetition2Etablissement,typeVoie2Etablissement,libelleVoie2Etablissement,codePostal2Etablissement,libelleCommune2Etablissement,libelleCommuneEtranger2Etablissement,distributionSpeciale2Etablissement,codeCommune2Etablissement,codeCedex2Etablissement,libelleCedex2Etablissement,codePaysEtranger2Etablissement,libellePaysEtranger2Etablissement,dateDebut,etatAdministratifEtablissement,enseigne1Etablissement,enseigne2Etablissement,enseigne3Etablissement,denominationUsuelleEtablissement,activitePrincipaleEtablissement,nomenclatureActivitePrincipaleEtablissement,caractereEmployeurEtablissement,longitude,latitude,geo_score,geo_type,geo_adresse,geo_id,geo_ligne,geo_l4,geo_l5
213003197,00018,21300319700018,O,1983-03-01,03,2021,,2023-12-08T09:45:57,true,4,,2,,,ANCIENNE ROUTE D'ALES,30700,SERVIERS-ET-LABAUME,,,30319,,,,,,,,,,,,,,,,,,,2008-01-01,A,MAIRIE,,,,84.11Z,NAFRev2,O,4.355655,44.038859,0.94,housenumber,2 Ancienne Route d’Ales 30700 Serviers-et-Labaume,30319_yxqyor_00002,G,2 ANCIENNE ROUTE D ALES,
213003197,00026,21300319700026,O,1983-12-21,02,2021,,2023-11-30T10:18:12,false,4,,,,,ANCIENNE RTE D'ALES,30700,SERVIERS-ET-LABAUME,,,30319,,,,,,,,,,,,,,,,,,,2021-12-25,A,ECOLE PRIMAIRE LES TROIS PONTS,,,,85.20Z,NAFRev2,N,4.355386,44.038878,0.85,street,Ancienne Route d’Ales 30700 Serviers-et-Labaume,30319_yxqyor,G,ANCIENNE ROUTE D ALES,
213003197,00034,21300319700034,O,1998-10-12,NN,,,2019-11-14T14:00:30,false,3,MAIRIE,,,RTE,ALES,30700,SERVIERS-ET-LABAUME,,,30319,,,,,,,,,,,,,,,,,,,2008-01-01,A,SERVICE ASSAINISSEMENT,,,,37.00Z,NAFRev2,N,4.355355,44.038926,0.71,locality,Route Ancienne Route d'Ales 30700 Serviers-et-Labaume,30319_0051,G,ROUTE ANCIENNE ROUTE D ALES,
263003030,00016,26300303000016,O,1986-01-06,NN,,,2020-06-12T10:27:04,true,5,,,,,MAIRIE,30700,SERVIERS-ET-LABAUME,,,30319,,,,,,,,,,,,,,,,,,,2019-04-10,F,,,,,88.99B,NAFRev2,N,4.360008,44.038642,0.39,street,Chemin de la Carcarie 30700 Serviers-et-Labaume,30319_0025,G,CHEMIN DE LA CARCARIE,
304309859,00011,30430985900011,O,1975-01-01,NN,,4321AB,2019-11-14T14:00:30,true,4,,,,RTE,D AUBUSSARGUES,30700,SERVIERS-ET-LABAUME,,,30319,,,,,,,,,,,,,,,,,,,2016-12-31,F,,,,,43.21A,NAFRev2,N,4.354093,44.035584,0.85,street,Route d'Aubussargues 30700 Serviers-et-Labaume,30319_0001,G,ROUTE D AUBUSSARGUES,
306271891,00013,30627189100013,O,,,,,2019-11-14T14:00:30,true,1,,,,,,30700,SERVIERS-ET-LABAUME,,,30319,,,,,,,,,,,,,,,,,,,1984-12-25,F,,,,,01.80,NAP,N,,,0,,,,,,
306877655,00051,30687765500051,O,2002-10-01,NN,,4334ZC,2019-11-14T14:00:30,true,3,LA COLOMBIERE,,,RTE,D ALES,30700,SERVIERS-ET-LABAUME,,,30319,,,,,,,,,,,,,,,,,,,2008-01-01,A,,,,,43.34Z,NAFRev2,N,4.356014,44.039402,0.77,street,Route d'Alès 30700 Serviers-et-Labaume,30319_0004,G,ROUTE D ALES,
311878995,00019,31187899500019,O,,,,,2019-11-14T14:00:30,true,1,,,,,,30700,SERVIERS-ET-LABAUME,,,30319,,,,,,,,,,,,,,,,,,,1988-07-15,F,,,,,91.3E,NAF1993,N,,,0,,,,,,
313207904,00019,31320790400019,O,1978-01-01,NN,,4312BA,2023-03-23T19:33:02,true,6,,2,,,CHEMIN DE QUEYROL,30700,SERVIERS-ET-LABAUME,,,30319,,,,,,,,,,,,,,,,,,,2023-03-01,A,,,,,01.61Z,NAFRev2,N,4.351506,44.041534,0.95,housenumber,2 Chemin de Queyrol 30700 Serviers-et-Labaume,30319_0021_00002,G,2 CHEMIN DE QUEYROL,
313889677,00016,31388967700016,O,,NN,,,2019-11-14T14:00:30,true,1,,,,,,30700,SERVIERS-ET-LABAUME,,,30319,,,,,,,,,,,,,,,,,,,1987-11-01,F,,,,,67.01,NAP,N,,,0,,,,,,
315303016,00010,31530301600010,O,1979-01-01,NN,,,2019-11-14T14:00:30,true,4,,,,,MAIRIE,30700,SERVIERS-ET-LABAUME,,,30319,,,,,,,,,,,,,,,,,,,1998-12-25,F,,,,,91.3E,NAF1993,N,4.360008,44.038642,0.39,street,Chemin de la Carcarie 30700 Serviers-et-Labaume,30319_0025,G,CHEMIN DE LA CARCARIE,
318765302,00035,31876530200035,O,1999-06-30,NN,,4331ZB,2019-11-14T14:00:30,true,6,,,,RTE,D ALES,30700,SERVIERS-ET-LABAUME,,,30319,,,,,,,,,,,,,,,,,,,2014-09-30,F,,,,,43.31Z,NAFRev2,N,4.356014,44.039402,0.77,street,Route d'Alès 30700 Serviers-et-Labaume,30319_0004,G,ROUTE D ALES,
318937612,00030,31893761200030,O,,,,,2019-11-14T14:00:30,true,1,,,,RTE,DE LABAUME,30700,SERVIERS-ET-LABAUME,,,30319,,,,,,,,,,,,,,,,,,,1994-06-30,F,,,,,45.2V,NAF1993,N,4.35648,44.042102,0.82,street,Route de Labaume 30700 Serviers-et-Labaume,30319_0015,G,ROUTE DE LABAUME,
320664774,00025,32066477400025,O,1984-01-01,NN,,,2019-11-14T14:00:30,true,4,,,,RTE,D AUBUSSARGUES,30700,SERVIERS-ET-LABAUME,,,30319,,,,,,,,,,,,,,,,,,,2003-04-30,F,,,,,74.1J,NAFRev1,N,4.354093,44.035584,0.85,street,Route d'Aubussargues 30700 Serviers-et-Labaume,30319_0001,G,ROUTE D AUBUSSARGUES,
325478642,00037,32547864200037,P,2007-01-01,,,,2024-01-17T21:10:42,true,1,[ND],[ND],[ND],[ND],[ND],[ND],SERVIERS-ET-LABAUME,,[ND],30319,[ND],[ND],,,[ND],[ND],[ND],[ND],[ND],[ND],,,[ND],,[ND],[ND],,,2007-01-01,A,[ND],[ND],[ND],[ND],68.20B,NAFRev2,N,,,0,,,,,,
328188602,00028,32818860200028,P,1994-01-26,NN,,,2024-01-17T21:13:23,true,4,[ND],[ND],[ND],[ND],[ND],[ND],SERVIERS-ET-LABAUME,,[ND],30319,[ND],[ND],,,[ND],[ND],[ND],[ND],[ND],[ND],,,[ND],,[ND],[ND],,,2013-10-01,A,[ND],[ND],[ND],[ND],68.20B,NAFRev2,N,,,0,,,,,,
328188602,00036,32818860200036,P,2011-02-10,,,,2019-11-14T14:00:30,false,2,[ND],[ND],[ND],[ND],[ND],[ND],SERVIERS-ET-LABAUME,,[ND],30319,[ND],[ND],,,[ND],[ND],[ND],[ND],[ND],[ND],,,[ND],,[ND],[ND],,,2012-12-31,F,[ND],[ND],[ND],[ND],81.30Z,NAFRev2,O,,,0,,,,,,
328278106,00047,32827810600047,O,2014-07-22,,,,2019-11-14T14:00:30,false,2,,5,,CHE,DE LA MINE,30700,SERVIERS-ET-LABAUME,,,30319,,,,,,,,,,,,,,,,,,,2014-09-22,F,,,,,86.90E,NAFRev2,N,4.354128,44.040232,0.84,housenumber,5 Chemin de la Mine 30700 Serviers-et-Labaume,30319_0016_00005,G,5 CHEMIN DE LA MINE,
329779557,00019,32977955700019,O,1984-01-01,NN,,,2019-11-14T14:00:30,true,3,,,,RTE,D ALES,30700,SERVIERS-ET-LABAUME,,,30319,,,,,,,,,,,,,,,,,,,2008-01-01,A,,,,,68.20B,NAFRev2,N,4.356014,44.039402,0.77,street,Route d'Alès 30700 Serviers-et-Labaume,30319_0004,G,ROUTE D ALES,
329779565,00012,32977956500012,O,1984-01-01,NN,,,2019-11-14T14:00:30,true,1,,,,RTE,D AUBUSSARGUES,30700,SERVIERS-ET-LABAUME,,,30319,,,,,,,,,,,,,,,,,,,2001-11-30,F,,,,,70.2C,NAF1993,N,4.354093,44.035584,0.85,street,Route d'Aubussargues 30700 Serviers-et-Labaume,30319_0001,G,ROUTE D AUBUSSARGUES,
329781868,00016,32978186800016,O,1984-01-01,NN,,,2019-11-14T14:00:30,true,1,,,,RTE,D AUBUSSARGUES,30700,SERVIERS-ET-LABAUME,,,30319,,,,,,,,,,,,,,,,,,,1992-02-19,F,,,,,70.2C,NAF1993,N,4.354093,44.035584,0.85,street,Route d'Aubussargues 30700 Serviers-et-Labaume,30319_0001,G,ROUTE D AUBUSSARGUES,
329781876,00019,32978187600019,O,1984-01-01,NN,,,2019-11-14T14:00:30,true,1,,,,RTE,D ALES,30700,SERVIERS-ET-LABAUME,,,30319,,,,,,,,,,,,,,,,,,,1992-02-19,F,,,,,14.2A,NAF1993,N,4.356014,44.039402,0.77,street,Route d'Alès 30700 Serviers-et-Labaume,30319_0004,G,ROUTE D ALES,
331674341,00010,33167434100010,O,1985-01-01,NN,,,2019-11-14T14:00:30,false,4,,,,,,30700,SERVIERS-ET-LABAUME,,,30319,,,,,,,,,,,,,,,,,,,2017-06-30,F,,,,,68.20B,NAFRev2,N,,,0,,,,,,
333063907,00039,33306390700039,O,2003-10-27,NN,,4399CZ,2021-02-23T10:52:38,true,3,,,,CHE,DU STADE,30700,SERVIERS-ET-LABAUME,,,30319,,,,,,,,,,,,,,,,,,,2008-01-01,A,,,,,43.99C,NAFRev2,N,4.35539,44.040484,0.8,street,Chemin du Stade 30700 Serviers-et-Labaume,30319_0037,G,CHEMIN DU STADE,
338032410,00031,33803241000031,O,2010-01-01,,,,2021-02-23T10:54:42,true,1,MAS D'ALZAS,,,CHE,DU MAS D'ALZAS,30700,SERVIERS-ET-LABAUME,,,30319,,,,,,,,,,,,,,,,,,,2010-01-01,A,,,,,55.20Z,NAFRev2,N,4.344729,44.036282,0.84,street,Chemin du Mas d’Alzas 30700 Serviers-et-Labaume,30319_0040,G,CHEMIN DU MAS D ALZAS,
341526218,00019,34152621800019,O,1987-06-05,NN,,,2023-02-21T09:35:38,true,3,,,,,LABAUME,30700,SERVIERS-ET-LABAUME,,,30319,,,,,,,,,,,,,,,,,,,2008-01-01,A,,,,,68.20B,NAFRev2,N,4.35648,44.042102,0.92,street,Route de Labaume 30700 Serviers-et-Labaume,30319_0015,G,ROUTE DE LABAUME,
341812279,00055,34181227900055,O,1900-01-01,NN,,,2019-11-14T14:00:30,false,3,,,,,LIEU DIT CAILLAN,30700,SERVIERS-ET-LABAUME,,,30319,,,,,,,,,,,,,,,,,,,2001-12-31,F,,,,,01.4B,NAF1993,N,4.351585,44.036344,0.35,street,Rue du Village 30700 Serviers-et-Labaume,30319_0005,G,RUE DU VILLAGE,
342361532,00019,34236153200019,O,,NN,,,2019-11-14T14:00:30,true,1,,,,,LA BAUME,30700,SERVIERS-ET-LABAUME,,,30319,,,,,,,,,,,,,,,,,,,1988-12-31,F,,,,,60.09,NAP,N,4.360008,44.038642,0.72,street,Chemin de la Carcarie 30700 Serviers-et-Labaume,30319_0025,G,CHEMIN DE LA CARCARIE,
342508587,00017,34250858700017,O,1987-10-05,NN,,4399CZ,2019-11-14T14:00:30,true,5,,,,RTE,D AUBUSSARGUES,30700,SERVIERS-ET-LABAUME,,,30319,,,,,,,,,,,,,,,,,,,2010-12-31,A,,,,,43.99C,NAFRev2,N,4.354093,44.035584,0.85,street,Route d'Aubussargues 30700 Serviers-et-Labaume,30319_0001,G,ROUTE D AUBUSSARGUES,
342509312,00019,34250931200019,O,1900-01-01,NN,,,2019-11-14T14:00:30,false,3,,,,RTE,D AUBUSSARGUES,30700,SERVIERS-ET-LABAUME,,,30319,,,,,,,,,,,,,,,,,,,1992-09-30,F,,,,,45.3E,NAF1993,N,4.354093,44.035584,0.85,street,Route d'Aubussargues 30700 Serviers-et-Labaume,30319_0001,G,ROUTE D AUBUSSARGUES,
342509312,00027,34250931200027,O,2004-07-01,NN,,,2019-11-14T14:00:30,true,3,,,,RUE,DU FER A CHEVAL,30700,SERVIERS-ET-LABAUME,,,30319,,,,,,,,,,,,,,,,,,,2006-12-31,F,,,,,45.4D,NAFRev1,N,4.35346,44.036769,0.94,street,Rue du Fer à Cheval 30700 Serviers-et-Labaume,30319_0007,G,RUE DU FER A CHEVAL,
342932282,00011,34293228200011,O,1987-11-01,NN,,,2019-11-14T14:00:30,true,1,,,,,,30700,SERVIERS-ET-LABAUME,,,30319,,,,,,,,,,,,,,,,,,,1999-03-31,F,,,,,55.4A,NAF1993,O,,,0,,,,,,
344507967,00018,34450796700018,O,,NN,,,2019-11-14T14:00:30,true,1,,,,,QUARTIER DE GENTOUX,30700,SERVIERS-ET-LABAUME,,,30319,,,,,,,,,,,,,,,,,,,1988-09-17,F,,,,,64.11,NAP,N,4.6630713,46.6132236,0.71,poi.community_centre,Multi-accueil Les Tourterelles (Salle des fêtes) Saint-Gengoux-le-National,https://osm.org/node/5056006566,G,,
347479644,00028,34747964400028,O,1997-10-27,NN,,,2019-11-14T14:00:30,true,1,,,,RTE,DE LABAUME,30700,SERVIERS-ET-LABAUME,,,30319,,,,,,,,,,,,,,,,,,,2000-09-30,F,,,,,45.2V,NAF1993,O,4.35648,44.042102,0.82,street,Route de Labaume 30700 Serviers-et-Labaume,30319_0015,G,ROUTE DE LABAUME,
350517272,00026,35051727200026,O,1991-10-01,NN,,,2019-11-14T14:00:30,false,4,,,,RUE,DE LA FABRIQUE,30700,SERVIERS-ET-LABAUME,,,30319,,,,,,,,,,,,,,,,,,,1998-03-06,F,,,,,60.2M,NAF1993,O,4.357263,44.038197,0.78,street,Chemin de la Fabrique 30700 Serviers-et-Labaume,30319_0002,G,CHEMIN DE LA FABRIQUE,
351625389,00017,35162538900017,O,1989-07-31,NN,,,2019-11-14T14:00:30,true,3,,,,RTE,D ALES,30700,SERVIERS-ET-LABAUME,,,30319,,,,,,,,,,,,,,,,,,,2008-01-01,A,,,,,68.20B,NAFRev2,N,4.356014,44.039402,0.77,street,Route d'Alès 30700 Serviers-et-Labaume,30319_0004,G,ROUTE D ALES,
351724687,00022,35172468700022,O,1990-10-03,NN,,,2019-11-14T14:00:30,true,3,,,,,LA COLOMBIERE,30700,SERVIERS-ET-LABAUME,,,30319,,,,,,,,,,,,,,,,,,,1992-12-25,F,,,,,70.1A,NAF1993,N,4.36099,44.038441,0.42,street,Les Coteaux de la Carcarie 30700 Serviers-et-Labaume,30319_2xfo2f,G,LES COTEAUX DE LA CARCARIE,
351906003,00022,35190600300022,O,,NN,,,2019-11-14T14:00:30,true,1,,,,RTE,D ALES,30700,SERVIERS-ET-LABAUME,,,30319,,,,,,,,,,,,,,,,,,,1992-12-25,F,,,,,70.1A,NAF1993,N,4.356014,44.039402,0.77,street,Route d'Alès 30700 Serviers-et-Labaume,30319_0004,G,ROUTE D ALES,
352093249,00014,35209324900014,O,1989-07-07,01,2021,4312BA,2023-11-30T10:17:22,true,3,,,,RTE,D ALES,30700,SERVIERS-ET-LABAUME,,,30319,,,,,,,,,,,,,,,,,,,2008-01-01,A,,,,,93.21Z,NAFRev2,O,4.356014,44.039402,0.77,street,Route d'Alès 30700 Serviers-et-Labaume,30319_0004,G,ROUTE D ALES,
352877039,00011,35287703900011,O,1989-12-07,NN,,,2019-11-14T14:00:30,true,3,,,,,ECOLE,30700,SERVIERS-ET-LABAUME,,,30319,,,,,,,,,,,,,,,,,,,2008-01-01,A,,,,,93.12Z,NAFRev2,N,4.353129,44.036676,0.59,street,Rue des Ecoliers 30700 Serviers-et-Labaume,30319_0023,G,RUE DES ECOLIERS,
353897473,00016,35389747300016,O,,,,,2019-11-14T14:00:30,true,1,,,,CHE,DE LA MINE,30700,SERVIERS-ET-LABAUME,,,30319,,,,,,,,,,,,,,,,,,,1996-10-01,F,,,,,45.2V,NAF1993,N,4.354371,44.040396,0.82,street,Chemin de la Mine 30700 Serviers-et-Labaume,30319_0016,G,CHEMIN DE LA MINE,
378980866,00016,37898086600016,O,,NN,,,2019-11-14T14:00:30,true,1,,,,,MONTEE DU VILLAGE,30700,SERVIERS-ET-LABAUME,,,30319,,,,,,,,,,,,,,,,,,,1990-04-24,F,,,,,70.3A,NAF1993,N,4.354219,44.036518,0.95,street,Montee du Village 30700 Serviers-et-Labaume,30319_0006,G,MONTEE DU VILLAGE,
379585706,00011,37958570600011,O,1990-09-28,NN,,,2020-04-01T03:53:07,true,4,,,,,,30700,SERVIERS-ET-LABAUME,,,30319,,,,,,,,,,,,,,,,,,,2020-03-01,F,,,,,68.20B,NAFRev2,N,,,0,,,,,,
380442921,00017,38044292100017,O,,NN,,,2019-11-14T14:00:30,true,1,,,,RUE,VILLAGE,30700,SERVIERS-ET-LABAUME,,,30319,,,,,,,,,,,,,,,,,,,1991-11-08,F,,,,,79.06,NAP,N,4.351585,44.036344,0.86,street,Rue du Village 30700 Serviers-et-Labaume,30319_0005,G,RUE DU VILLAGE,
380572842,00058,38057284200058,P,2012-03-01,,,,2023-01-20T20:00:34,false,1,[ND],[ND],[ND],[ND],[ND],[ND],SERVIERS-ET-LABAUME,,[ND],30319,[ND],[ND],,,[ND],[ND],[ND],[ND],[ND],[ND],,,[ND],,[ND],[ND],,,2012-03-01,A,[ND],[ND],[ND],[ND],68.20A,NAFRev2,N,,,0,,,,,,
380572842,00066,38057284200066,P,2018-03-01,,,,2023-01-20T20:00:35,false,2,[ND],[ND],[ND],[ND],[ND],[ND],SERVIERS-ET-LABAUME,,[ND],30319,[ND],[ND],,,[ND],[ND],[ND],[ND],[ND],[ND],,,[ND],,[ND],[ND],,,2022-12-31,F,[ND],[ND],[ND],[ND],86.90F,NAFRev2,N,,,0,,,,,,
380659839,00019,38065983900019,O,1991-01-17,NN,,,2019-11-14T14:00:30,true,3,CHEZ MME ROSE DUPUY,,,RTE,D ALES,30700,SERVIERS-ET-LABAUME,,,30319,,,,,,,,,,,,,,,,,,,2008-01-01,A,,,,,68.20B,NAFRev2,N,4.356014,44.039402,0.77,street,Route d'Alès 30700 Serviers-et-Labaume,30319_0004,G,ROUTE D ALES,
380753772,00017,38075377200017,O,1991-01-18,00,2021,,2023-11-30T10:19:55,true,3,,,,,,30700,SERVIERS-ET-LABAUME,,,30319,,,,,,,,,,,,,,,,,,,2008-01-01,A,,,,,01.24Z,NAFRev2,N,,,0,,,,,,
380896597,00032,38089659700032,O,2002-12-17,,,,2019-11-14T14:00:30,false,4,,,,,,30700,SERVIERS-ET-LABAUME,,,30319,,,,,,,,,,,,,,,,,,,2010-09-13,F,,,,,81.30Z,NAFRev2,O,,,0,,,,,,
380896597,00040,38089659700040,O,2010-09-13,01,2021,,2023-11-30T10:19:58,true,1,ROUTE D'AIGALIERS,,,RTE,QUEYROL,30700,SERVIERS-ET-LABAUME,,,30319,,,,,,,,,,,,,,,,,,,2010-09-13,A,,,,,81.30Z,NAFRev2,N,4.351119,44.041484,0.7,street,Chemin de Queyrol 30700 Serviers-et-Labaume,30319_0021,G,CHEMIN DE QUEYROL,
381176304,00016,38117630400016,O,1900-01-01,NN,,,2022-10-05T15:22:04,true,4,MAIRIE,2,,,ANCIENNE ROUTE D'ALES,30700,SERVIERS-ET-LABAUME,,,30319,,,,,,,,,,,,,,,,,,,1995-12-25,A,,,,,85.51Z,NAFRev2,N,4.355655,44.038859,0.94,housenumber,2 Ancienne Route d’Ales 30700 Serviers-et-Labaume,30319_yxqyor_00002,G,2 ANCIENNE ROUTE D ALES,
381414721,00013,38141472100013,O,1991-04-01,NN,,,2021-02-23T11:09:50,true,5,,14,,CHE,DE LA MINE,30700,SERVIERS-ET-LABAUME,,,30319,,,,,,,,,,,,,,,,,,,2011-04-14,A,,,,,47.89Z,NAFRev2,N,4.354366,44.041849,0.85,housenumber,14 Chemin de la Mine 30700 Serviers-et-Labaume,30319_0016_00014,G,14 CHEMIN DE LA MINE,
382316297,00045,38231629700045,O,2022-11-02,,,,2023-01-09T11:01:10,true,1,,10,,RTE,DE LABAUME,30700,SERVIERS-ET-LABAUME,,,30319,,,,,,,,,,,,,,,,,,,2022-11-02,A,,,,,68.20B,NAFRev2,N,4.356706,44.042124,0.84,housenumber,10 Route de Labaume 30700 Serviers-et-Labaume,30319_0015_00010,G,10 ROUTE DE LABAUME,
382357267,00022,38235726700022,O,2000-04-21,NN,,,2019-11-14T14:00:30,false,4,,,,RTE,DE LABAUME,30700,SERVIERS-ET-LABAUME,,,30319,,,,,,,,,,,,,,,,,,,2001-03-05,F,,,,,45.4A,NAF1993,N,4.35648,44.042102,0.82,street,Route de Labaume 30700 Serviers-et-Labaume,30319_0015,G,ROUTE DE LABAUME,
382720365,00016,38272036500016,O,,NN,,,2019-11-14T14:00:30,true,1,,,,RTE,UZES,30700,SERVIERS-ET-LABAUME,,,30319,,,,,,,,,,,,,,,,,,,1991-08-02,F,,,,,86.06,NAP,N,4.358496,44.037368,0.62,locality,Route d'Uzès 30700 Serviers-et-Labaume,30319_0019,G,ROUTE D UZES,
382728509,00037,38272850900037,O,1999-12-19,NN,,,2019-11-14T14:00:30,true,3,,,,RTE,D'AUBUSSARGUES,30700,SERVIERS-ET-LABAUME,,,30319,,,,,,,,,,,,,,,,,,,2007-03-21,F,,,,,52.6E,NAFRev1,N,4.354093,44.035584,0.85,street,Route d'Aubussargues 30700 Serviers-et-Labaume,30319_0001,G,ROUTE D AUBUSSARGUES,
383159373,00018,38315937300018,O,1991-10-01,NN,,,2019-11-14T14:00:30,true,3,,,,,,30700,SERVIERS-ET-LABAUME,,,30319,,,,,,,,,,,,,,,,,,,2005-12-31,F,,,,,02.0B,NAFRev1,N,,,0,,,,,,
384662946,00027,38466294600027,O,2005-06-01,,,,2019-11-14T14:00:30,false,2,QUARTIER LA BOUSCARASSE,,,RTE,D ALES,30700,SERVIERS-ET-LABAUME,,,30319,,,,,,,,,,,,,,,,,,,2005-10-31,F,,,,,55.3A,NAFRev1,N,4.356014,44.039402,0.77,street,Route d'Alès 30700 Serviers-et-Labaume,30319_0004,G,ROUTE D ALES,
385289566,00015,38528956600015,O,,NN,,,2019-11-14T14:00:30,true,1,,,,,MONTEE DU VILLAGE,30700,SERVIERS-ET-LABAUME,,,30319,,,,,,,,,,,,,,,,,,,1992-09-17,F,,,,,52.6D,NAF1993,N,4.354219,44.036518,0.95,street,Montee du Village 30700 Serviers-et-Labaume,30319_0006,G,MONTEE DU VILLAGE,
389352402,00017,38935240200017,O,1992-10-01,NN,,,2021-05-31T10:26:42,false,8,,,,RTE,D ALES,30700,SERVIERS-ET-LABAUME,,,30319,,,,,,,,,,,,,,,,,,,2021-03-29,F,,,,,08.12Z,NAFRev2,N,4.356014,44.039402,0.77,street,Route d'Alès 30700 Serviers-et-Labaume,30319_0004,G,ROUTE D ALES,
389352402,00025,38935240200025,O,1992-10-01,NN,,,2019-11-14T14:00:30,false,3,,,,RTE,D AUBUSSARGUES,30700,SERVIERS-ET-LABAUME,,,30319,,,,,,,,,,,,,,,,,,,2001-10-17,F,,,,,14.2A,NAF1993,N,4.354093,44.035584,0.85,street,Route d'Aubussargues 30700 Serviers-et-Labaume,30319_0001,G,ROUTE D AUBUSSARGUES,
389352402,00033,38935240200033,O,2021-03-29,,,,2021-06-19T11:44:41,true,1,,,,,LIEUDIT PLAMAGEON,30700,SERVIERS-ET-LABAUME,,,30319,,,,,,,,,,,,,,,,,,,2021-03-29,A,,,,,08.12Z,NAFRev2,N,,,0,,,,,,
389630914,00049,38963091400049,O,2021-05-10,,,3109BA,2021-09-06T10:01:36,true,1,,1,,PRO,DU VALADAS,30700,SERVIERS-ET-LABAUME,,,30319,,,,,,,,,,,,,,,,,,,2021-05-10,A,,,,,31.09B,NAFRev2,N,4.353058,44.035449,0.83,housenumber,1 Promenade du Valadas 30700 Serviers-et-Labaume,30319_0026_00001,G,1 PROMENADE DU VALADAS,
390741643,00030,39074164300030,O,2023-01-01,,,,2023-06-29T10:13:16,false,1,,7,A,LOT,COTEAUX DE CARCARIE,30700,SERVIERS-ET-LABAUME,,,30319,,,,,,,,,,,,,,,,,,,2023-01-01,A,,,,,68.20A,NAFRev2,N,4.361275,44.037627,0.66,street,Impasse les Coteaux de la Carcarie 30700 Serviers-et-Labaume,30319_0056,G,IMP LES COTEAUX DE LA CARCARIE,
391134426,00033,39113442600033,O,,NN,,,2019-11-14T14:00:30,true,1,,,,,LE VIEUX PONT,30700,SERVIERS-ET-LABAUME,,,30319,,,,,,,,,,,,,,,,,,,1997-01-31,F,,,,,52.6D,NAF1993,N,4.355193,44.035183,0.41,street,Impasse du Pont Métallique 30700 Serviers-et-Labaume,30319_0042,G,IMPASSE DU PONT METALLIQUE,
391943735,00012,39194373500012,O,1900-01-01,NN,,,2019-11-14T14:00:30,false,4,,,,,,30700,SERVIERS-ET-LABAUME,,,30319,,,,,,,,,,,,,,,,,,,1994-12-25,F,,,,,52.6E,NAF1993,N,,,0,,,,,,
394162879,00016,39416287900016,O,1994-01-26,NN,,,2020-04-25T03:38:25,true,4,,,,RTE,D'ALES,30700,SERVIERS-ET-LABAUME,,,30319,,,,,,,,,,,,,,,,,,,2020-04-24,F,,,,,68.20B,NAFRev2,N,4.356014,44.039402,0.77,street,Route d'Alès 30700 Serviers-et-Labaume,30319_0004,G,ROUTE D ALES,
395137508,00036,39513750800036,O,2018-04-17,,,4339ZZ,2022-12-12T16:19:50,true,1,,,,RTE,D'AIGALIERS,30700,SERVIERS-ET-LABAUME,,,30319,,,,,,,,,,,,,,,,,,,2018-04-17,A,,,,,43.39Z,NAFRev2,N,4.349442,44.040021,0.82,street,Route d’Aigaliers 30700 Serviers-et-Labaume,30319_u614ci,G,ROUTE D AIGALIERS,
395188329,00035,39518832900035,O,1998-01-01,NN,,,2019-11-14T14:00:30,true,1,,,,RTE,DU PONT DE LABAUME,30700,SERVIERS-ET-LABAUME,,,30319,,,,,,,,,,,,,,,,,,,1999-10-15,F,,,,,74.1J,NAF1993,N,4.361023,44.054699,0.86,street,Route du Pont de Labaume 30700 Serviers-et-Labaume,30319_0012,G,ROUTE DU PONT DE LABAUME,
398134056,00017,39813405600017,O,1994-08-01,NN,,,2019-11-14T14:00:30,true,3,CHEZ MME PIERPAOLI YVETTE,,,RTE,D AUBUSSARGUES,30700,SERVIERS-ET-LABAUME,,,30319,,,,,,,,,,,,,,,,,,,2008-01-01,A,,,,,94.99Z,NAFRev2,N,4.354093,44.035584,0.85,street,Route d'Aubussargues 30700 Serviers-et-Labaume,30319_0001,G,ROUTE D AUBUSSARGUES,
398557256,00029,39855725600029,O,1996-11-06,NN,,4399CZ,2022-02-18T04:11:09,true,5,,,,CHE,DE QUEYROL,30700,SERVIERS-ET-LABAUME,,,30319,,,,,,,,,,,,,,,,,,,2022-02-15,F,,,,,43.99C,NAFRev2,N,4.351119,44.041484,0.82,street,Chemin de Queyrol 30700 Serviers-et-Labaume,30319_0021,G,CHEMIN DE QUEYROL,
399619758,00010,39961975800010,O,1995-01-03,NN,,,2019-11-14T14:00:30,false,4,,,,,TRAVERSE DES 3 PONTS,30700,SERVIERS-ET-LABAUME,,,30319,,,,,,,,,,,,,,,,,,,1996-12-31,F,,,,,18.1Z,NAF1993,O,4.356034,44.038536,0.94,street,Traverse des 3 Ponts 30700 Serviers-et-Labaume,30319_0003,G,TRAVERSE DES 3 PONTS,
402249502,00012,40224950200012,O,1995-09-01,NN,,,2019-11-14T14:00:30,true,5,,,,IMP,DU MIDI,30700,SERVIERS-ET-LABAUME,,,30319,,,,,,,,,,,,,,,,,,,2010-09-30,F,,,,,46.69B,NAFRev2,N,4.360101,44.054459,0.78,street,Impasse du Midi 30700 Serviers-et-Labaume,30319_0011,G,IMPASSE DU MIDI,
402446603,00019,40244660300019,O,1995-07-03,NN,,,2019-11-14T14:00:30,false,3,,,,,,30700,SERVIERS-ET-LABAUME,,,30319,,,,,,,,,,,,,,,,,,,1997-10-13,F,,,,,85.1G,NAF1993,N,,,0,,,,,,
403944127,00030,40394412700030,O,2020-07-15,,,,2023-10-09T11:00:10,true,3,,23,,CHE,DE LA CARCARIE,30700,SERVIERS-ET-LABAUME,,,30319,,,,,,,,,,,,,,,,,,,2022-05-01,A,,,,,86.22C,NAFRev2,N,4.363855,44.039212,0.86,housenumber,23 Chemin de la Carcarie 30700 Serviers-et-Labaume,30319_0025_00023,G,23 CHEMIN DE LA CARCARIE,
405201880,00011,40520188000011,O,1996-04-01,NN,,,2019-11-14T14:00:30,true,4,,,,,,30700,SERVIERS-ET-LABAUME,,,30319,,,,,,,,,,,,,,,,,,,2018-10-11,F,,,,,01.21Z,NAFRev2,N,,,0,,,,,,
405292293,00033,40529229300033,O,2019-12-20,,,,2021-02-23T11:29:33,true,1,,2,,RTE,DE GATTIGUES,30700,SERVIERS-ET-LABAUME,,,30319,,,,,,,,,,,,,,,,,,,2019-12-20,A,,,,,68.20B,NAFRev2,N,4.353956,44.051415,0.84,housenumber,2 Route de Gattigues 30700 Serviers-et-Labaume,30319_0043_00002,G,2 ROUTE DE GATTIGUES,
405368606,00019,40536860600019,O,1996-03-08,NN,,,2019-11-14T14:00:30,false,4,HAMEAU BAUME,,,,,30700,SERVIERS-ET-LABAUME,,,30319,,,,,,,,,,,,,,,,,,,2013-05-19,F,,,,,68.20B,NAFRev2,N,4.359987,44.055086,0.51,street,Ruelle du Chateau 30700 Serviers-et-Labaume,30319_0022,D,RUELLE DU CHATEAU,
407866474,00015,40786647400015,O,1996-04-01,NN,,,2019-11-14T14:00:30,false,4,,,,RTE,D ALES,30700,SERVIERS-ET-LABAUME,,,30319,,,,,,,,,,,,,,,,,,,2003-08-01,F,,,,,45.1A,NAFRev1,N,4.356014,44.039402,0.77,street,Route d'Alès 30700 Serviers-et-Labaume,30319_0004,G,ROUTE D ALES,
407866474,00023,40786647400023,O,1996-04-01,NN,,,2019-11-14T14:00:30,true,4,,,,RTE,D'ALES,30700,SERVIERS-ET-LABAUME,,,30319,,,,,,,,,,,,,,,,,,,2003-12-31,F,,,,,01.1A,NAFRev1,N,4.356014,44.039402,0.77,street,Route d'Alès 30700 Serviers-et-Labaume,30319_0004,G,ROUTE D ALES,
408689982,00036,40868998200036,O,2006-04-02,,,,2019-11-14T14:00:30,false,2,,8,,CHE,DE LA MINE,30700,SERVIERS-ET-LABAUME,,,30319,,,,,,,,,,,,,,,,,,,2007-03-01,F,,,,,70.3A,NAFRev1,N,4.354764,44.040405,0.84,housenumber,8 Chemin de la Mine 30700 Serviers-et-Labaume,30319_0016_00008,G,8 CHEMIN DE LA MINE,
411117278,00019,41111727800019,O,1997-01-01,NN,,,2019-11-14T14:00:30,false,4,,,,RTE,D AUBUSSARGUES,30700,SERVIERS-ET-LABAUME,,,30319,,,,,,,,,,,,,,,,,,,2003-01-01,F,,,,,60.2M,NAF1993,O,4.354093,44.035584,0.85,street,Route d'Aubussargues 30700 Serviers-et-Labaume,30319_0001,G,ROUTE D AUBUSSARGUES,