siren,nic,siret,statutDiffusionEtablissement,dateCreationEtablissement,trancheEffectifsEtablissement,anneeEffectifsEtablissement,activitePrincipaleRegistreMetiersEtablissement,dateDernierTraitementEtablissement,etablissementSiege,nombrePeriodesEtablissement,complementAdresseEtablissement,numeroVoieEtablissement,indiceRepetitionEtablissement,typeVoieEtablissement,libelleVoieEtablissement,codePostalEtablissement,libelleCommuneEtablissement,libelleCommuneEtrangerEtablissement,distributionSpecialeEtablissement,codeCommuneEtablissement,codeCedexEtablissement,libelleCedexEtablissement,codePaysEtrangerEtablissement,libellePaysEtrangerEtablissement,complementAdresse2Etablissement,numeroVoie2Etablissement,indiceRepetition2Etablissement,typeVoie2Etablissement,libelleVoie2Etablissement,codePostal2Etablissement,libelleCommune2Etablissement,libelleCommuneEtranger2Etablissement,distributionSpeciale2Etablissement,codeCommune2Etablissement,codeCedex2Etablissement,libelleCedex2Etablissement,codePaysEtranger2Etablissement,libellePaysEtranger2Etablissement,dateDebut,etatAdministratifEtablissement,enseigne1Etablissement,enseigne2Etablissement,enseigne3Etablissement,denominationUsuelleEtablissement,activitePrincipaleEtablissement,nomenclatureActivitePrincipaleEtablissement,caractereEmployeurEtablissement,longitude,latitude,geo_score,geo_type,geo_adresse,geo_id,geo_ligne,geo_l4,geo_l5
214602237,00015,21460223700015,O,1983-03-01,01,2021,,2023-11-30T10:18:20,true,3,,,,,,46150,PONTCIRQ,,,46223,,,,,,,,,,,,,,,,,,,2008-01-01,A,MAIRIE,,,,84.11Z,NAFRev2,N,,,0,,,,,,
254603343,00016,25460334300016,O,1998-07-13,NN,,,2011-04-23T04:19:47,true,5,MAIRIE,,,,,46150,PONTCIRQ,,,46223,,,,,,,,,,,,,,,,,,,2010-09-17,F,,,,,37.00Z,NAFRev2,N,,,0,,,,,,
264603317,00019,26460331700019,O,1984-11-20,NN,,,2007-10-10T16:31:06,true,3,,,,,MAIRIE,46150,PONTCIRQ,,,46223,,,,,,,,,,,,,,,,,,,2007-04-05,F,CCAS,,,,85.3K,NAFRev1,N,3.0709671,50.6304695,0.92,poi.townhall,Hôtel de Ville Lille,https://osm.org/way/40917078,G,,
309861391,00055,30986139100055,O,2014-01-01,,,4399CZ,2017-05-15T19:22:22,false,2,,,,LD,LE MAS DE VERGNE,46150,PONTCIRQ,,,46223,,,,,,,,,,,,,,,,,,,2017-03-01,F,,,,,43.99C,NAFRev2,N,1.267712,44.551061,0.77,street,Chemin du Mas de Vergne 46150 Pontcirq,46223_32jsrm,G,CHEMIN DU MAS DE VERGNE,
315762955,00013,31576295500013,O,1979-01-01,NN,,,2014-07-08T00:19:42,true,4,,,,LD,ROSTASSAC,46150,PONTCIRQ,,,46223,,,,,,,,,,,,,,,,,,,2009-12-31,F,,,,,55.10Z,NAFRev2,N,1.27871,44.526861,0.92,street,Route de Rostassac 46150 Pontcirq,46223_fkjjly,G,ROUTE DE ROSTASSAC,
316507508,00026,31650750800026,O,,NN,,,,true,1,,,,PL,DE L EGLISE,46150,PONTCIRQ,,,46223,,,,,,,,,,,,,,,,,,,1994-12-31,F,,,,,74.4B,NAF1993,N,1.263098,44.548116,0.75,street,Rue de l'Eglise 46150 Pontcirq,46223_o2oj6q,G,RUE DE L EGLISE,
319618682,00011,31961868200011,O,1980-01-15,NN,,,,true,4,,,,,CASTAGNE,46150,PONTCIRQ,,,46223,,,,,,,,,,,,,,,,,,,1998-09-03,F,,,,,91.3E,NAF1993,N,1.272046,44.560473,0.91,street,Chemin de Castagné 46150 Pontcirq,46223_1722u5,G,CHEMIN DE CASTAGNE,
334610540,00018,33461054000018,O,1985-12-19,NN,,,2006-10-27T02:39:29,true,3,,,,,,46150,PONTCIRQ,,,46223,,,,,,,,,,,,,,,,,,,2004-10-01,F,,,,,01.2C,NAFRev1,N,,,0,,,,,,
334991734,00016,33499173400016,O,1986-02-06,NN,,,2006-11-25T10:27:50,true,3,,,,,,46150,PONTCIRQ,,,46223,,,,,,,,,,,,,,,,,,,2006-03-02,F,,,,,71.3A,NAFRev1,N,,,0,,,,,,
337828412,00011,33782841200011,O,,NN,,,,true,1,,,,,,46150,PONTCIRQ,,,46223,,,,,,,,,,,,,,,,,,,1990-04-10,F,,,,,62.11,NAP,N,,,0,,,,,,
340343110,00011,34034311000011,O,1987-02-01,NN,,,2008-01-04T21:40:59,true,3,,,,,,46150,PONTCIRQ,,,46223,,,,,,,,,,,,,,,,,,,2008-01-01,A,,,,,94.99Z,NAFRev2,N,,,0,,,,,,
343255741,00013,34325574100013,O,1988-01-01,NN,,8121ZZ,2020-09-18T15:18:34,true,7,,,,LD,LE CLUZEL,46150,PONTCIRQ,,,46223,,,,,,,,,,,,,,,,,,,2020-10-01,A,,,,ENTREPRISE PIERRE MARROUX,81.21Z,NAFRev2,N,1.263728,44.536259,0.65,street,Rue du Cluzel 46150 Pontcirq,46223_qezbyj,G,RUE DU CLUZEL,
343460960,00028,34346096000028,O,1900-01-01,NN,,,2011-04-28T00:36:14,false,4,,,,LD,ROSTASSAC,46150,PONTCIRQ,,,46223,,,,,,,,,,,,,,,,,,,1995-12-31,F,,,,,55.3A,NAF1993,O,1.27871,44.526861,0.92,street,Route de Rostassac 46150 Pontcirq,46223_fkjjly,G,ROUTE DE ROSTASSAC,
381836220,00032,38183622000032,O,1992-07-15,NN,,4322AZ,2015-03-17T00:34:34,false,3,,,,,LE CLUZEL,46150,PONTCIRQ,,,46223,,,,,,,,,,,,,,,,,,,1995-06-12,F,,,,,45.3E,NAF1993,N,1.263728,44.536259,0.65,street,Rue du Cluzel 46150 Pontcirq,46223_qezbyj,G,RUE DU CLUZEL,
385051099,00013,38505109900013,O,1992-04-13,NN,,,2008-11-08T00:46:17,true,3,,,,LD,LE CLUZEL,46150,PONTCIRQ,,,46223,,,,,,,,,,,,,,,,,,,2006-09-30,F,,,,,45.2L,NAFRev1,N,1.263728,44.536259,0.65,street,Rue du Cluzel 46150 Pontcirq,46223_qezbyj,G,RUE DU CLUZEL,
391362464,00011,39136246400011,O,1993-04-10,NN,,,2011-09-28T04:40:05,true,4,,,,,TOURNIAC,46150,PONTCIRQ,,,46223,,,,,,,,,,,,,,,,,,,2011-09-30,F,,,,,71.11Z,NAFRev2,N,1.265708,44.557404,0.91,street,Route de Tourniac 46150 Pontcirq,46223_xhlnzb,G,ROUTE DE TOURNIAC,
399987684,00012,39998768400012,O,1993-04-01,NN,,,2007-01-18T09:36:50,true,3,,,,,,46150,PONTCIRQ,,,46223,,,,,,,,,,,,,,,,,,,2000-12-31,F,,,,,01.1A,NAF1993,N,,,0,,,,,,
401859459,00034,40185945900034,P,1998-04-01,NN,,1610BZ,2021-11-10T09:01:40,true,11,[ND],[ND],[ND],[ND],[ND],[ND],PONTCIRQ,,[ND],46223,[ND],[ND],,,[ND],[ND],[ND],[ND],[ND],[ND],,,[ND],,[ND],[ND],,,2021-09-27,F,[ND],[ND],[ND],[ND],16.10B,NAFRev2,N,,,0,,,,,,
402765150,00014,40276515000014,O,1900-01-01,NN,,,2011-05-03T00:23:48,false,3,,,,,VALDIE,46150,PONTCIRQ,,,46223,,,,,,,,,,,,,,,,,,,1996-11-13,F,,,,,51.5L,NAF1993,,1.27524,44.558623,0.37,street,Chemin de Lauzadie 46150 Pontcirq,46223_uxvmxa,G,CHEMIN DE LAUZADIE,
403262520,00014,40326252000014,O,1996-01-04,NN,,,2008-11-08T01:15:07,true,3,,,,,PRESBYTERE,46150,PONTCIRQ,,,46223,,,,,,,,,,,,,,,,,,,1996-12-25,F,,,,,45.3A,NAF1993,N,-4.4890765,48.2459539,0.9,poi.community_centre,Presbytère (Salle des fêtes) Crozon,https://osm.org/way/53987643,G,,
404557175,00019,40455717500019,O,1985-12-19,NN,,,2006-10-28T03:22:12,true,3,,,,,LABASTIDETTE,46150,PONTCIRQ,,,46223,,,,,,,,,,,,,,,,,,,2004-05-01,F,,,,,01.2C,NAFRev1,N,1.268475,44.547046,0.78,street,Route de la Bastidette 46150 Pontcirq,46223_9puzu5,G,ROUTE DE LA BASTIDETTE,
404557183,00013,40455718300013,O,1987-05-01,NN,,,2019-09-27T03:55:52,true,4,,,,,,46150,PONTCIRQ,,,46223,,,,,,,,,,,,,,,,,,,2012-10-26,F,,,,,01.43Z,NAFRev2,N,,,0,,,,,,
404557191,00016,40455719100016,O,1988-12-31,NN,,,2023-03-21T11:19:45,true,4,,,,,LE CAUSSE,46150,PONTCIRQ,,,46223,,,,,,,,,,,,,,,,,,,2023-03-31,F,,,,,01.41Z,NAFRev2,N,1.263479,44.532069,0.64,street,Chemin du Causse du Cluzel 46150 Pontcirq,46223_0pdl8f,G,CHEMIN DU CAUSSE DU CLUZEL,
404557209,00016,40455720900016,O,1979-06-19,NN,,,,true,1,,,,,,46150,PONTCIRQ,,,46223,,,,,,,,,,,,,,,,,,,2001-10-01,F,,,,,01.1A,NAF1993,N,,,0,,,,,,
408113173,00012,40811317300012,O,1985-12-18,NN,,,,true,1,,,,,,46150,PONTCIRQ,,,46223,,,,,,,,,,,,,,,,,,,1998-05-31,F,,,,,01.1A,NAF1993,N,,,0,,,,,,
410654933,00010,41065493300010,O,1995-04-14,NN,,,2008-01-04T21:46:58,true,4,,,,,TOURNIAC,46150,PONTCIRQ,,,46223,,,,,,,,,,,,,,,,,,,2008-01-01,A,,,,,90.02Z,NAFRev2,N,1.265708,44.557404,0.91,street,Route de Tourniac 46150 Pontcirq,46223_xhlnzb,G,ROUTE DE TOURNIAC,
419989157,00013,41998915700013,O,1984-06-21,NN,,,2008-01-04T23:45:12,false,3,,,,,LABASTIDETTE,46150,PONTCIRQ,,,46223,,,,,,,,,,,,,,,,,,,2008-01-01,A,,,,,66.22Z,NAFRev2,N,1.268475,44.547046,0.78,street,Route de la Bastidette 46150 Pontcirq,46223_9puzu5,G,ROUTE DE LA BASTIDETTE,
419989157,00021,41998915700021,O,2004-05-02,,,,2022-10-01T04:52:57,true,3,,,,,LABASTIDETTE,46150,PONTCIRQ,,,46223,,,,,,,,,,,,,,,,,,,2008-01-01,A,,,,,01.45Z,NAFRev2,N,1.268475,44.547046,0.78,street,Route de la Bastidette 46150 Pontcirq,46223_9puzu5,G,ROUTE DE LA BASTIDETTE,
425262979,00015,42526297900015,O,1991-01-01,NN,,,2008-01-05T01:14:28,true,4,,,,,LE CASTANIER,46150,PONTCIRQ,,,46223,,,,,,,,,,,,,,,,,,,2008-01-01,A,,,,,01.11Z,NAFRev2,N,1.272046,44.560473,0.44,street,Chemin de Castagné 46150 Pontcirq,46223_1722u5,G,CHEMIN DE CASTAGNE,
425264819,00011,42526481900011,O,1976-01-01,NN,,,2008-01-05T01:14:29,true,3,,,,,,46150,PONTCIRQ,,,46223,,,,,,,,,,,,,,,,,,,2008-01-01,A,,,,,01.42Z,NAFRev2,N,,,0,,,,,,
425265329,00010,42526532900010,O,1986-01-01,NN,,,2007-01-18T09:41:06,true,3,,,,,,46150,PONTCIRQ,,,46223,,,,,,,,,,,,,,,,,,,2005-12-25,F,,,,,01.3Z,NAFRev1,N,,,0,,,,,,
433057130,00018,43305713000018,O,2000-10-04,NN,,,2008-01-04T18:54:25,true,3,,,,,LE CLUZEL,46150,PONTCIRQ,,,46223,,,,,,,,,,,,,,,,,,,2008-01-01,A,,,,,01.50Z,NAFRev2,N,1.263728,44.536259,0.65,street,Rue du Cluzel 46150 Pontcirq,46223_qezbyj,G,RUE DU CLUZEL,
440926681,00014,44092668100014,O,2002-01-01,NN,,,2010-11-16T00:19:09,false,3,,,,,,46150,PONTCIRQ,,,46223,,,,,,,,,,,,,,,,,,,2004-12-31,F,,,,,01.1A,NAFRev1,N,,,0,,,,,,
442761763,00014,44276176300014,O,1975-01-01,NN,,,2017-07-27T09:59:43,true,4,MAIRIE,,,,,46150,PONTCIRQ,,,46223,,,,,,,,,,,,,,,,,,,2017-07-26,A,,,,,94.99Z,NAFRev2,N,,,0,,,,,,
447597279,00051,44759727900051,O,2011-08-01,,,,2019-01-28T16:52:43,true,2,,,,,LD MAS ROUGET,46150,PONTCIRQ,,,46223,,,,,,,,,,,,,,,,,,,2018-12-31,F,,,,NEO-MULTIMEDIA,62.02A,NAFRev2,N,1.265863,44.562698,0.92,street,Route du Mas Rouget 46150 Pontcirq,46223_imbied,G,ROUTE DU MAS ROUGET,
448672857,00043,44867285700043,P,2022-10-03,,,,2023-01-09T11:04:18,true,1,[ND],[ND],[ND],[ND],[ND],[ND],PONTCIRQ,,[ND],46223,[ND],[ND],,,[ND],[ND],[ND],[ND],[ND],[ND],,,[ND],,[ND],[ND],,,2022-10-03,A,[ND],[ND],[ND],[ND],90.03B,NAFRev2,N,,,0,,,,,,
450849989,00014,45084998900014,O,2003-12-01,NN,,,2006-11-25T18:50:10,true,3,,,,LD,TOURNIAC,46150,PONTCIRQ,,,46223,,,,,,,,,,,,,,,,,,,2003-12-31,F,,,,,74.1G,NAFRev1,N,1.265708,44.557404,0.91,street,Route de Tourniac 46150 Pontcirq,46223_xhlnzb,G,ROUTE DE TOURNIAC,
453324808,00030,45332480800030,O,2012-12-01,,,,2017-12-19T12:18:28,false,2,,,,,TOURNIAC,46150,PONTCIRQ,,,46223,,,,,,,,,,,,,,,,,,,2015-08-01,F,,,,,96.09Z,NAFRev2,N,1.265708,44.557404,0.91,street,Route de Tourniac 46150 Pontcirq,46223_xhlnzb,G,ROUTE DE TOURNIAC,
482442332,00037,48244233200037,O,2019-10-01,,,,2021-02-23T13:46:37,true,1,,,,,TOURNIAC,46150,PONTCIRQ,,,46223,,,,,,,,,,,,,,,,,,,2019-10-01,A,,,,,96.04Z,NAFRev2,N,1.265708,44.557404,0.91,street,Route de Tourniac 46150 Pontcirq,46223_xhlnzb,G,ROUTE DE TOURNIAC,
482575198,00015,48257519800015,O,2005-05-18,,,,2008-02-06T05:54:33,true,2,,,,,TOURNIAC,46150,PONTCIRQ,,,46223,,,,,,,,,,,,,,,,,,,2007-04-28,F,,,,,52.5Z,NAFRev1,N,1.265708,44.557404,0.91,street,Route de Tourniac 46150 Pontcirq,46223_xhlnzb,G,ROUTE DE TOURNIAC,
494593783,00017,49459378300017,O,2007-04-01,,,,2009-06-11T11:03:54,true,2,,,,,ROSTASSAC,46150,PONTCIRQ,,,46223,,,,,,,,,,,,,,,,,,,2008-01-01,A,,,,,38.32Z,NAFRev2,N,1.27871,44.526861,0.92,street,Route de Rostassac 46150 Pontcirq,46223_fkjjly,G,ROUTE DE ROSTASSAC,
503873440,00021,50387344000021,O,2020-12-11,,,,2021-04-03T11:19:36,true,1,,,,,LE BOURG,46150,PONTCIRQ,,,46223,,,,,,,,,,,,,,,,,,,2020-12-11,A,,,,,94.99Z,NAFRev2,N,1.262778,44.548208,0.61,street,Route du Bourg 46150 Pontcirq,46223_0jbz8c,G,ROUTE DU BOURG,
504994831,00023,50499483100023,O,2015-08-01,,,,2015-07-24T07:53:45,true,1,,,,,LA BOUYSSETTE,46150,PONTCIRQ,,,46223,,,,,,,,,,,,,,,,,,,2015-08-01,A,,,,,01.24Z,NAFRev2,N,1.268475,44.547046,0.47,street,Route de la Bastidette 46150 Pontcirq,46223_9puzu5,G,ROUTE DE LA BASTIDETTE,
510666076,00052,51066607600052,P,2014-09-02,,,4391AZ,2017-12-19T13:26:52,false,2,[ND],[ND],[ND],[ND],[ND],[ND],PONTCIRQ,,[ND],46223,[ND],[ND],,,[ND],[ND],[ND],[ND],[ND],[ND],,,[ND],,[ND],[ND],,,2017-12-15,F,[ND],[ND],[ND],[ND],43.91A,NAFRev2,N,,,0,,,,,,
518368469,00020,51836846900020,O,2020-04-27,,,,2023-04-07T20:00:50,false,1,,,,LD,LABASTIDE FLOYRAS,46150,PONTCIRQ,,,46223,,,,,,,,,,,,,,,,,,,2020-04-27,A,AVEC LES ABEILLES,,,,01.49Z,NAFRev2,N,1.273286,44.547341,0.82,street,Chemin de la Bastide Floyras 46150 Pontcirq,46223_vhnxgv,G,CHEMIN DE LA BASTIDE FLOYRAS,
519233332,00047,51923333200047,O,2015-02-09,,,,2021-02-23T15:31:23,true,1,,,,,LA BOUYSSETTE,46150,PONTCIRQ,,,46223,,,,,,,,,,,,,,,,,,,2015-02-09,A,,,,,94.99Z,NAFRev2,N,1.268475,44.547046,0.47,street,Route de la Bastidette 46150 Pontcirq,46223_9puzu5,G,ROUTE DE LA BASTIDETTE,
519809289,00019,51980928900019,O,2010-02-01,,,,2016-12-16T11:37:56,false,2,,,,,TOURNIAC,46150,PONTCIRQ,,,46223,,,,,,,,,,,,,,,,,,,2010-10-01,F,,,,,01.62Z,NAFRev2,N,1.265708,44.557404,0.91,street,Route de Tourniac 46150 Pontcirq,46223_xhlnzb,G,ROUTE DE TOURNIAC,
519811616,00019,51981161600019,O,2010-02-01,,,,2013-01-13T04:30:02,true,2,AUBERGE DU VERT,,,,ROSTASSAC,46150,PONTCIRQ,,,46223,,,,,,,,,,,,,,,,,,,2012-12-31,F,,,,,56.10A,NAFRev2,N,1.27871,44.526861,0.92,street,Route de Rostassac 46150 Pontcirq,46223_fkjjly,G,ROUTE DE ROSTASSAC,
521321018,00017,52132101800017,O,2010-03-09,,,,2011-02-08T04:03:14,true,1,,,,LD,LE CLUZEL,46150,PONTCIRQ,,,46223,,,,,,,,,,,,,,,,,,,2010-03-09,F,,,,,47.91A,NAFRev2,N,1.263728,44.536259,0.65,street,Rue du Cluzel 46150 Pontcirq,46223_qezbyj,G,RUE DU CLUZEL,
521388900,00016,52138890000016,O,2010-04-01,,,,2020-02-13T11:19:48,true,4,,,,LD,LD LA CROUZETTE,46150,PONTCIRQ,,,46223,,,,,,,,,,,,,,,,,,,2019-12-31,F,,,,,90.03A,NAFRev2,N,1.264774,44.55077,0.92,street,Route de la Crouzette 46150 Pontcirq,46223_rogrti,G,ROUTE DE LA CROUZETTE,
521854828,00014,52185482800014,O,2010-04-01,,,,2015-11-09T14:01:19,true,1,LABORIE,,,,,46150,PONTCIRQ,,,46223,,,,,,,,,,,,,,,,,,,2010-04-01,A,,,,,90.03B,NAFRev2,N,1.27524,44.558623,0.33,street,Chemin de Lauzadie 46150 Pontcirq,46223_uxvmxa,D,CHEMIN DE LAUZADIE,
521854828,00022,52185482800022,O,2015-11-01,,,,2021-02-23T15:36:33,false,1,,,,,LABORIE,46150,PONTCIRQ,,,46223,,,,,,,,,,,,,,,,,,,2015-11-01,A,,,,,01.42Z,NAFRev2,N,1.27524,44.558623,0.33,street,Chemin de Lauzadie 46150 Pontcirq,46223_uxvmxa,G,CHEMIN DE LAUZADIE,
521854828,00030,52185482800030,O,2015-01-01,,,,2015-11-23T07:54:59,false,1,,,,,LABORIE,46150,PONTCIRQ,,,46223,,,,,,,,,,,,,,,,,,,2015-01-01,A,,,,,68.20A,NAFRev2,N,1.27524,44.558623,0.33,street,Chemin de Lauzadie 46150 Pontcirq,46223_uxvmxa,G,CHEMIN DE LAUZADIE,
524433737,00037,52443373700037,O,2020-05-01,,,1039BP,2022-02-15T19:35:01,false,2,,,,LD,LA PLEGADE,46150,PONTCIRQ,,,46223,,,,,,,,,,,,,,,,,,,2022-02-09,F,,,,,85.52Z,NAFRev2,N,1.264774,44.55077,0.34,street,Route de la Crouzette 46150 Pontcirq,46223_rogrti,G,ROUTE DE LA CROUZETTE,
530053842,00015,53005384200015,O,2011-01-24,,,,2019-03-05T16:34:24,false,2,LES SEGALAS,,,,,46150,PONTCIRQ,,,46223,,,,,,,,,,,,,,,,,,,2017-09-12,F,,,,,94.99Z,NAFRev2,N,1.24463,44.545411,0.76,street,Impasse des Ségalas 46150 Pontcirq,46223_0v9j6r,D,IMPASSE DES SEGALAS,
531456960,00032,53145696000032,O,2021-04-01,,,1081ZZ,2021-06-19T12:05:22,true,1,,,,LD,LE CLUZEL,46150,PONTCIRQ,,,46223,,,,,,,,,,,,,,,,,,,2021-04-01,A,,,,SUCREE DE PLANTES,15.12Z,NAFRev2,N,1.263728,44.536259,0.65,street,Rue du Cluzel 46150 Pontcirq,46223_qezbyj,G,RUE DU CLUZEL,
531663169,00013,53166316900013,O,2011-04-04,,,,2011-04-14T10:33:56,true,1,LA CROUZETTE,,,LD,LA BORIE,46150,PONTCIRQ,,,46223,,,,,,,,,,,,,,,,,,,2011-04-04,A,,,,,68.20B,NAFRev2,N,1.268475,44.547046,0.41,street,Route de la Bastidette 46150 Pontcirq,46223_9puzu5,G,ROUTE DE LA BASTIDETTE,
581640026,00018,58164002600018,O,,NN,,,,true,1,,,,,CLUZEL,46150,PONTCIRQ,,,46223,,,,,,,,,,,,,,,,,,,1987-12-31,F,,,,,01.80,NAP,N,1.263728,44.536259,0.92,street,Rue du Cluzel 46150 Pontcirq,46223_qezbyj,G,RUE DU CLUZEL,
752269837,00015,75226983700015,O,2012-01-01,,,,2012-06-21T07:25:53,true,1,,,,LD,LES CAZELLES,46150,PONTCIRQ,,,46223,,,,,,,,,,,,,,,,,,,2012-01-01,A,,,,,01.49Z,NAFRev2,N,2.7251955,44.4729425,0.88,poi.social_facility,"EHPAD ""Les Cazelles"" (Service social) Bozouls",https://osm.org/way/198014152,G,,
752810572,00020,75281057200020,P,2019-07-01,,,9523ZZ,2019-10-23T19:33:39,false,2,[ND],[ND],[ND],[ND],[ND],[ND],PONTCIRQ,,[ND],46223,[ND],[ND],,,[ND],[ND],[ND],[ND],[ND],[ND],,,[ND],,[ND],[ND],,,2019-10-16,F,[ND],[ND],[ND],[ND],95.23Z,NAFRev2,N,,,0,,,,,,
777082074,00017,77708207400017,O,,,,,,true,1,,,,,LD- ROSTASSAC,46150,PONTCIRQ,,,46223,,,,,,,,,,,,,,,,,,,,F,,,,,55.71,NAP,N,1.27871,44.526861,0.72,street,Route de Rostassac 46150 Pontcirq,46223_fkjjly,G,ROUTE DE ROSTASSAC,
777082090,00013,77708209000013,O,,NN,,,,true,1,,,,LD,LES RASIMIERES,46150,PONTCIRQ,,,46223,,,,,,,,,,,,,,,,,,,,F,,,,,54.05,NAP,N,1.267311,44.557213,0.6,street,Chemin des Razimières 46150 Pontcirq,46223_ddvu2f,G,CHEMIN DES RAZIMIERES,
789777646,00017,78977764600017,O,2013-01-02,,,3213ZZ,2015-03-18T01:38:10,true,2,,,,,LD MAS ROUGET,46150,PONTCIRQ,,,46223,,,,,,,,,,,,,,,,,,,2014-03-31,F,,,,SEVY FANTAISY,32.13Z,NAFRev2,N,1.265863,44.562698,0.92,street,Route du Mas Rouget 46150 Pontcirq,46223_imbied,G,ROUTE DU MAS ROUGET,
790688279,00021,79068827900021,O,2013-02-10,,,,2021-02-23T16:17:12,true,1,,,,,LE CLUZEL,46150,PONTCIRQ,,,46223,,,,,,,,,,,,,,,,,,,2013-02-10,A,,,,,85.51Z,NAFRev2,N,1.263728,44.536259,0.65,street,Rue du Cluzel 46150 Pontcirq,46223_qezbyj,G,RUE DU CLUZEL,
790788210,00017,79078821000017,O,2013-02-01,,,,2015-01-22T19:32:45,true,2,,,,LD,LA PLEGADE,46150,PONTCIRQ,,,46223,,,,,,,,,,,,,,,,,,,2015-02-28,F,LA FERME DE PONTCIRQ,,,,01.13Z,NAFRev2,N,1.264774,44.55077,0.34,street,Route de la Crouzette 46150 Pontcirq,46223_rogrti,G,ROUTE DE LA CROUZETTE,
791068299,00019,79106829900019,O,2013-03-01,,,4391BZ,2015-03-18T00:52:45,false,2,,,,,LD TOURNIAC,46150,PONTCIRQ,,,46223,,,,,,,,,,,,,,,,,,,2013-09-01,F,,,,,43.91B,NAFRev2,N,1.265708,44.557404,0.91,street,Route de Tourniac 46150 Pontcirq,46223_xhlnzb,G,ROUTE DE TOURNIAC,
791068299,00027,79106829900027,O,2013-09-01,,,,2018-06-23T03:54:08,true,2,,,,,LE BOURG,46150,PONTCIRQ,,,46223,,,,,,,,,,,,,,,,,,,2018-06-19,F,,,,,43.91B,NAFRev2,N,1.262778,44.548208,0.61,street,Route du Bourg 46150 Pontcirq,46223_0jbz8c,G,ROUTE DU BOURG,
792799785,00029,79279978500029,O,2016-01-06,,,8121ZZ,2017-01-09T19:28:25,true,2,,,,,LE BOURG,46150,PONTCIRQ,,,46223,,,,,,,,,,,,,,,,,,,2016-12-15,F,,,,MARK DOWSETT,81.21Z,NAFRev2,N,1.262778,44.548208,0.61,street,Route du Bourg 46150 Pontcirq,46223_0jbz8c,G,ROUTE DU BOURG,
799467196,00025,79946719600025,O,2015-03-01,NN,,,2021-02-23T16:28:35,true,1,,,,,LA PLEGADE,46150,PONTCIRQ,,,46223,,,,,,,,,,,,,,,,,,,2015-03-01,A,LA FERME DE PONTCIRQ,,,,01.13Z,NAFRev2,N,1.264774,44.55077,0.34,street,Route de la Crouzette 46150 Pontcirq,46223_rogrti,G,ROUTE DE LA CROUZETTE,
808537765,00022,80853776500022,O,2015-03-23,,,,2015-03-30T09:20:51,false,1,,,,,LA BASTIDE FLOYRAS,46150,PONTCIRQ,,,46223,,,,,,,,,,,,,,,,,,,2015-03-23,A,,,,,68.20B,NAFRev2,N,1.273286,44.547341,0.92,street,Chemin de la Bastide Floyras 46150 Pontcirq,46223_vhnxgv,G,CHEMIN DE LA BASTIDE FLOYRAS,
808751143,00021,80875114300021,O,2017-11-30,,,,2020-10-13T03:42:20,false,2,,,,LD,LAUZADIE,46150,PONTCIRQ,,,46223,,,,,,,,,,,,,,,,,,,2020-09-01,F,LE JARDIN DE L'AMARANTE,,,,01.13Z,NAFRev2,N,1.27524,44.558623,0.91,street,Chemin de Lauzadie 46150 Pontcirq,46223_uxvmxa,G,CHEMIN DE LAUZADIE,
808751143,00054,80875114300054,O,2021-09-05,,,,2023-02-04T13:55:28,true,1,,,,LD,LAUZADIE,46150,PONTCIRQ,,,46223,,,,,,,,,,,,,,,,,,,2021-09-05,A,,,,,96.04Z,NAFRev2,N,1.27524,44.558623,0.91,street,Chemin de Lauzadie 46150 Pontcirq,46223_uxvmxa,G,CHEMIN DE LAUZADIE,
821112943,00013,82111294300013,O,2016-07-01,,,4399CZ,2023-02-07T03:38:14,true,2,,,,,LE BOURG,46150,PONTCIRQ,,,46223,,,,,,,,,,,,,,,,,,,2022-12-31,F,,,,,41.20A,NAFRev2,N,1.262778,44.548208,0.61,street,Route du Bourg 46150 Pontcirq,46223_0jbz8c,G,ROUTE DU BOURG,
821546496,00018,82154649600018,O,2016-06-28,,,5610CQ,2016-11-22T09:36:51,true,1,,,,LD,ROSTASSAC,46150,PONTCIRQ,,,46223,,,,,,,,,,,,,,,,,,,2016-06-28,A,,,,,56.10C,NAFRev2,N,1.27871,44.526861,0.92,street,Route de Rostassac 46150 Pontcirq,46223_fkjjly,G,ROUTE DE ROSTASSAC,
825391543,00014,82539154300014,O,2017-02-14,,,,2017-02-03T09:56:06,true,1,,,,,LABORIE,46150,PONTCIRQ,,,46223,,,,,,,,,,,,,,,,,,,2017-02-14,A,UN GOUT D'IRLANDE,,,UN GOUT D'IRLANDE,46.34Z,NAFRev2,N,1.27524,44.558623,0.33,street,Chemin de Lauzadie 46150 Pontcirq,46223_uxvmxa,G,CHEMIN DE LAUZADIE,
828552224,00028,82855222400028,O,2018-01-18,,,,2022-04-25T03:36:48,true,2,,,,,LABASTIDE FLOYRAS,46150,PONTCIRQ,,,46223,,,,,,,,,,,,,,,,,,,2022-03-15,A,,,,,68.20B,NAFRev2,O,1.273286,44.547341,0.82,street,Chemin de la Bastide Floyras 46150 Pontcirq,46223_vhnxgv,G,CHEMIN DE LA BASTIDE FLOYRAS,
832145825,00028,83214582500028,O,2018-07-01,,,,2024-01-17T19:50:50,false,3,,,,LD,LES SOLEILLOUS,46150,PONTCIRQ,,,46223,,,,,,,,,,,,,,,,,,,2024-01-02,F,,,,,93.29Z,NAFRev2,N,1.272711,44.534922,0.68,street,Impasse des Souleillous 46150 Pontcirq,46223_w4rygp,G,IMPASSE DES SOULEILLOUS,
839658804,00027,83965880400027,O,2020-11-18,,,,2021-03-16T15:01:35,true,1,,,,LD,LE BOURG,46150,PONTCIRQ,,,46223,,,,,,,,,,,,,,,,,,,2020-11-18,A,,,,,58.11Z,NAFRev2,N,1.262778,44.548208,0.61,street,Route du Bourg 46150 Pontcirq,46223_0jbz8c,G,ROUTE DU BOURG,
879308658,00019,87930865800019,O,2020-01-01,,,,2023-07-01T12:33:29,true,1,VALIDIE,149,,RTE,DE LA CROUZETTE,46150,PONTCIRQ,,,46223,,,,,,,,,,,,,,,,,,,2020-01-01,A,AMINATA,,,AMINATA,55.20Z,NAFRev2,N,1.264221,44.550825,0.86,housenumber,149 Route de la Crouzette 46150 Pontcirq,46223_rogrti_00149,G,149 ROUTE DE LA CROUZETTE,
882476062,00030,88247606200030,O,2020-08-26,,,,2021-11-26T04:02:50,true,1,,,,,LAUZADIE,46150,PONTCIRQ,,,46223,,,,,,,,,,,,,,,,,,,2020-08-26,A,,,,,96.09Z,NAFRev2,N,1.27524,44.558623,0.91,street,Chemin de Lauzadie 46150 Pontcirq,46223_uxvmxa,G,CHEMIN DE LAUZADIE,
893908004,00011,89390800400011,O,2018-03-17,,,,2021-02-10T10:20:57,true,1,,,,,LABASTIDE FLOYRAS,46150,PONTCIRQ,,,46223,,,,,,,,,,,,,,,,,,,2018-03-17,A,,,,,85.51Z,NAFRev2,N,1.273286,44.547341,0.82,street,Chemin de la Bastide Floyras 46150 Pontcirq,46223_vhnxgv,G,CHEMIN DE LA BASTIDE FLOYRAS,
900889957,00032,90088995700032,P,2021-11-11,,,,2022-12-28T03:56:18,true,2,[ND],[ND],[ND],[ND],[ND],[ND],PONTCIRQ,,[ND],46223,[ND],[ND],,,[ND],[ND],[ND],[ND],[ND],[ND],,,[ND],,[ND],[ND],,,2023-01-01,F,[ND],[ND],[ND],[ND],96.04Z,NAFRev2,N,,,0,,,,,,
902447853,00018,90244785300018,O,2018-03-03,,,,2021-10-20T11:19:00,true,2,,1,,CHE,DU CLUZEL,46150,PONTCIRQ,,,46223,,,,,,,,,,,,,,,,,,,2021-10-15,F,,,,,96.09Z,NAFRev2,N,1.263479,44.532069,0.76,street,Chemin du Causse du Cluzel 46150 Pontcirq,46223_0pdl8f,G,CHEMIN DU CAUSSE DU CLUZEL,
904061447,00010,90406144700010,O,2021-10-18,,,,2021-10-12T08:40:22,true,1,,,,RTE,DU CLUZEL,46150,PONTCIRQ,,,46223,,,,,,,,,,,,,,,,,,,2021-10-18,A,,,,,86.90F,NAFRev2,N,1.262317,44.534024,0.8,street,Route du Pont du Cluzel 46150 Pontcirq,46223_yf6r9r,G,ROUTE DU PONT DU CLUZEL,
923457378,00019,92345737800019,O,2014-04-04,,,,2023-04-28T15:14:34,true,1,LE BOURG,,,,MAIRIE,46150,PONTCIRQ,,,46223,,,,,,,,,,,,,,,,,,,2014-04-04,A,,,,,94.99Z,NAFRev2,N,1.262778,44.548208,0.36,street,Route du Bourg 46150 Pontcirq,46223_0jbz8c,D,ROUTE DU BOURG,
950717199,00018,95071719900018,O,2023-04-01,,,,2023-04-01T16:05:12,true,1,,248,,CHE,DU CAUSSE DU CLUZEL,46150,PONTCIRQ,,,46223,,,,,,,,,,,,,,,,,,,2023-04-01,A,,,,,01.42Z,NAFRev2,N,1.263996,44.531594,0.9,housenumber,248 Chemin du Causse du Cluzel 46150 Pontcirq,46223_0pdl8f_00248,G,248 CHEMIN DU CAUSSE DU CLUZEL,
