siren,nic,siret,statutDiffusionEtablissement,dateCreationEtablissement,trancheEffectifsEtablissement,anneeEffectifsEtablissement,activitePrincipaleRegistreMetiersEtablissement,dateDernierTraitementEtablissement,etablissementSiege,nombrePeriodesEtablissement,complementAdresseEtablissement,numeroVoieEtablissement,indiceRepetitionEtablissement,typeVoieEtablissement,libelleVoieEtablissement,codePostalEtablissement,libelleCommuneEtablissement,libelleCommuneEtrangerEtablissement,distributionSpecialeEtablissement,codeCommuneEtablissement,codeCedexEtablissement,libelleCedexEtablissement,codePaysEtrangerEtablissement,libellePaysEtrangerEtablissement,complementAdresse2Etablissement,numeroVoie2Etablissement,indiceRepetition2Etablissement,typeVoie2Etablissement,libelleVoie2Etablissement,codePostal2Etablissement,libelleCommune2Etablissement,libelleCommuneEtranger2Etablissement,distributionSpeciale2Etablissement,codeCommune2Etablissement,codeCedex2Etablissement,libelleCedex2Etablissement,codePaysEtranger2Etablissement,libellePaysEtranger2Etablissement,dateDebut,etatAdministratifEtablissement,enseigne1Etablissement,enseigne2Etablissement,enseigne3Etablissement,denominationUsuelleEtablissement,activitePrincipaleEtablissement,nomenclatureActivitePrincipaleEtablissement,caractereEmployeurEtablissement,longitude,latitude,geo_score,geo_type,geo_adresse,geo_id,geo_ligne,geo_l4,geo_l5
216500199,00015,21650019900015,O,1983-03-01,02,2021,,2023-11-30T10:18:30,true,3,,,,,,65360,ARCIZAC-ADOUR,,,65019,,,,,,,,,,,,,,,,,,,2008-01-01,A,MAIRIE,,,,84.11Z,NAFRev2,N,,,0,,,,,,
216500199,00031,21650019900031,O,1995-12-25,NN,,,2019-11-14T14:00:52,false,3,MAIRIE,,,,,65360,ARCIZAC-ADOUR,,,65019,,,,,,,,,,,,,,,,,,,2014-12-31,F,LOTISSEMENT,,,,42.99Z,NAFRev2,N,0.099846,43.157466,0.39,street,Rue du 8 Mai 1945 65360 Arcizac-Adour,65019_0062,D,RUE DU 8 MAI 1945,
216500199,00049,21650019900049,O,1999-09-01,01,2021,,2023-11-30T10:18:30,false,4,,170,,RUE,DU 8 MAI 1945,65360,ARCIZAC-ADOUR,,,65019,,,,,,,,,,,,,,,,,,,2023-05-01,A,ECOLE MATERNELLE D'ARCIZAC-ADOUR,,,,85.10Z,NAFRev2,N,0.099318,43.157117,0.95,housenumber,170 Rue du 8 Mai 1945 65360 Arcizac-Adour,65019_0062_00170,G,170 RUE DU 8 MAI 1945,
246500227,00011,24650022700011,O,1990-03-20,03,2021,,2023-11-30T10:18:55,true,4,,,,,MAIRIE,65360,ARCIZAC-ADOUR,,,65019,,,,,,,,,,,,,,,,,,,2008-01-01,A,,,,,84.11Z,NAFRev2,N,0.099846,43.157466,0.39,street,Rue du 8 Mai 1945 65360 Arcizac-Adour,65019_0062,G,RUE DU 8 MAI 1945,
246500839,00013,24650083900013,O,2004-12-23,NN,,,2019-11-14T14:00:52,true,5,MAIRIE,,,PL,11 NOVEMBRE 1918,65360,ARCIZAC-ADOUR,,,65019,,,,,,,,,,,,,,,,,,,2017-01-01,F,,,,,84.11Z,NAFRev2,O,0.098512,43.155584,0.56,street,Place du 11 Novembre 65360 Arcizac-Adour,65019_0072,G,PLACE DU 11 NOVEMBRE,
266501410,00010,26650141000010,O,1984-11-20,NN,,,2020-09-30T14:29:45,true,4,,,,,MAIRIE,65360,ARCIZAC-ADOUR,,,65019,,,,,,,,,,,,,,,,,,,2016-12-31,F,CCAS,,,,88.99B,NAFRev2,N,0.099846,43.157466,0.39,street,Rue du 8 Mai 1945 65360 Arcizac-Adour,65019_0062,G,RUE DU 8 MAI 1945,
300424843,00013,30042484300013,O,1900-01-01,NN,,,2019-11-14T14:00:52,true,4,,,,RTE,DE BAGNERES,65360,ARCIZAC-ADOUR,,,65019,,,,,,,,,,,,,,,,,,,1996-12-25,F,,,,,74.1J,NAF1993,N,0.098212,43.158034,0.32,street,Impasse des Berges de l’Adour 65360 Arcizac-Adour,65019_0016,G,IMPASSE DES BERGES DE L ADOUR,
300424843,00021,30042484300021,O,1992-05-13,NN,,,2019-11-14T14:00:52,false,3,,30,,RUE,DU PIC DU JER,65360,ARCIZAC-ADOUR,,,65019,,,,,,,,,,,,,,,,,,,1996-12-25,F,,,,,45.4J,NAF1993,N,0.09145,43.148484,0.95,housenumber,30 Rue du Pic du Jer 65360 Arcizac-Adour,65019_0075_00030,G,30 RUE DU PIC DU JER,
301349056,00020,30134905600020,O,1995-03-22,,,,2019-11-14T14:00:52,false,2,,,,CHE,DES COTEAUX,65360,ARCIZAC-ADOUR,,,65019,,,,,,,,,,,,,,,,,,,2008-10-01,F,,,,,01.11Z,NAFRev2,N,0.084634,43.15073,0.83,street,Chemin des Coteaux 65360 Arcizac-Adour,65019_0034,G,CHEMIN DES COTEAUX,
309599496,00069,30959949600069,O,1991-06-01,01,2021,,2023-11-30T10:20:25,false,4,,,,,,65360,ARCIZAC-ADOUR,,,65019,,,,,,,,,,,,,,,,,,,2015-08-01,A,,,,,46.21Z,NAFRev2,O,,,0,,,,,,
314355553,00012,31435555300012,O,,,,,2019-11-14T14:00:52,true,1,,,,,,65360,ARCIZAC-ADOUR,,,65019,,,,,,,,,,,,,,,,,,,1994-11-19,F,,,,,45.4C,NAF1993,N,,,0,,,,,,
316293414,00017,31629341400017,O,1900-01-01,NN,,,2019-11-14T14:00:52,true,5,,,,,,65360,ARCIZAC-ADOUR,,,65019,,,,,,,,,,,,,,,,,,,2008-01-01,A,,,,,43.21A,NAFRev2,N,,,0,,,,,,
317911535,00019,31791153500019,O,,NN,,,2019-11-14T14:00:52,true,1,,,,,,65360,ARCIZAC-ADOUR,,,65019,,,,,,,,,,,,,,,,,,,,F,,,,,55.60,NAP,N,,,0,,,,,,
319737888,00028,31973788800028,O,,NN,,,2019-11-14T14:00:52,true,1,,,,CHE,DE LA PASSADE,65360,ARCIZAC-ADOUR,,,65019,,,,,,,,,,,,,,,,,,,,F,,,,,69.25,NAP,N,0.101539,43.156572,0.55,street,Impasse de la Plaine 65360 Arcizac-Adour,65019_0078,G,IMPASSE DE LA PLAINE,
320654148,00024,32065414800024,O,2010-10-01,,,,2019-11-14T14:00:52,false,2,,65,,CHE,DES VALLONS,65360,ARCIZAC-ADOUR,,,65019,,,,,,,,,,,,,,,,,,,2011-07-27,F,,,,,56.10C,NAFRev2,N,0.081091,43.14639,0.84,housenumber,65 Chemin des Vallons 65360 Arcizac-Adour,65019_itex79_00065,G,65 CHEMIN DES VALLONS,
321401341,00011,32140134100011,O,1900-01-01,,,,2019-11-14T14:00:52,false,3,,,,,CAPBLANQUE,65360,ARCIZAC-ADOUR,,,65019,,,,,,,,,,,,,,,,,,,1988-03-31,F,,,,,,,N,0.093673,43.149606,0.92,street,Impasse Capblanque 65360 Arcizac-Adour,65019_0027,G,IMPASSE CAPBLANQUE,
322383100,00011,32238310000011,O,1981-07-01,NN,,,2019-11-14T14:00:52,true,4,,,,,,65360,ARCIZAC-ADOUR,,,65019,,,,,,,,,,,,,,,,,,,2009-12-31,F,,,,,56.10A,NAFRev2,N,,,0,,,,,,
324607902,00016,32460790200016,O,,,,,2019-11-14T14:00:52,true,1,,,,,,65360,ARCIZAC-ADOUR,,,65019,,,,,,,,,,,,,,,,,,,1984-12-25,F,,,,,69.23,NAP,N,,,0,,,,,,
329003685,00016,32900368500016,O,,,,,2019-11-14T14:00:52,true,1,,,,,,65360,ARCIZAC-ADOUR,,,65019,,,,,,,,,,,,,,,,,,,1985-12-25,F,,,,,86.07,NAP,N,,,0,,,,,,
331921841,00010,33192184100010,O,1985-02-11,NN,,,2019-11-14T14:00:52,true,1,,,,,,65360,ARCIZAC-ADOUR,,,65019,,,,,,,,,,,,,,,,,,,1999-06-25,F,,,,,15.8C,NAF1993,N,,,0,,,,,,
332500594,00046,33250059400046,O,2000-04-03,NN,,,2022-05-13T04:11:18,true,6,,195,,RUE,DE L'ARBIZON,65360,ARCIZAC-ADOUR,,,65019,,,,,,,,,,,,,,,,,,,2022-04-01,F,,,,,43.33Z,NAFRev2,N,0.09901,43.155129,0.95,housenumber,195 Rue de l'Arbizon 65360 Arcizac-Adour,65019_0010_00195,G,195 RUE DE L ARBIZON,
337856264,00011,33785626400011,O,,NN,,,2019-11-14T14:00:52,true,1,,,,,,65360,ARCIZAC-ADOUR,,,65019,,,,,,,,,,,,,,,,,,,,F,,,,,86.06,NAP,N,,,0,,,,,,
342031739,00036,34203173900036,O,2013-10-25,,,,2021-02-23T10:57:38,true,5,,895,,RTE,DES PYRENEES,65360,ARCIZAC-ADOUR,,,65019,,,,,,,,,,,,,,,,,,,2016-11-14,A,,,,,43.39Z,NAFRev2,N,0.093898,43.144829,0.85,housenumber,895 Route des Pyrénées 65360 Arcizac-Adour,65019_0080_00895,G,895 ROUTE DES PYRENEES,
342332798,00020,34233279800020,O,,NN,,,2019-11-14T14:00:52,true,1,,,,,,65360,ARCIZAC-ADOUR,,,65019,,,,,,,,,,,,,,,,,,,1991-09-30,F,,,,,82.05,NAP,N,,,0,,,,,,
345032932,00021,34503293200021,O,2018-10-10,,,,2019-11-14T14:00:52,true,1,,95,,RUE,PIC DE JER,65360,ARCIZAC-ADOUR,,,65019,,,,,,,,,,,,,,,,,,,2018-10-10,A,,,,,68.20B,NAFRev2,N,0.090946,43.148056,0.75,housenumber,95 Rue du Pic du Jer 65360 Arcizac-Adour,65019_0075_00095,G,95 RUE DU PIC DU JER,
349166819,00012,34916681900012,O,1973-03-26,NN,,,2019-11-14T14:00:52,true,6,,85,,RUE,LASPASSADES,65360,ARCIZAC-ADOUR,,,65019,,,,,,,,,,,,,,,,,,,2012-12-31,F,,,,,43.99C,NAFRev2,N,0.087126,43.149627,0.95,housenumber,85 Rue Laspassades 65360 Arcizac-Adour,65019_0053_00085,G,85 RUE LASPASSADES,
350306619,00023,35030661900023,O,2019-08-01,,,,2021-02-23T11:03:03,true,1,,365,,CHE,DES COTEAUX,65360,ARCIZAC-ADOUR,,,65019,,,,,,,,,,,,,,,,,,,2019-08-01,A,,,,,68.20B,NAFRev2,N,0.082468,43.150755,0.85,housenumber,365 Chemin des Coteaux 65360 Arcizac-Adour,65019_0034_00365,G,365 CHEMIN DES COTEAUX,
350426920,00020,35042692000020,O,2021-06-01,,,,2021-10-30T03:42:42,true,2,,10,,IMP,DU LHERIS,65360,ARCIZAC-ADOUR,,,65019,,,,,,,,,,,,,,,,,,,2021-06-04,F,,,,,47.81Z,NAFRev2,N,0.090832,43.1526,0.83,housenumber,10 Impasse du Lheris 65360 Arcizac-Adour,65019_0058_00010,G,10 IMPASSE DU LHERIS,
379751233,00014,37975123300014,O,1990-10-01,NN,,1610AQ,2022-03-12T04:04:59,true,4,,,,,,65360,ARCIZAC-ADOUR,,,65019,,,,,,,,,,,,,,,,,,,2021-06-30,F,,,,,16.10A,NAFRev2,N,,,0,,,,,,
379763139,00027,37976313900027,O,2022-07-04,,,,2023-04-24T19:37:24,true,2,,160,,RUE,DU 8 MAI 1945,65360,ARCIZAC-ADOUR,,,65019,,,,,,,,,,,,,,,,,,,2023-03-31,F,,,,,68.31Z,NAFRev2,N,0.099277,43.15706,0.95,housenumber,160 Rue du 8 Mai 1945 65360 Arcizac-Adour,65019_0062_00160,G,160 RUE DU 8 MAI 1945,
381863661,00017,38186366100017,O,1991-04-29,NN,,,2019-11-14T14:00:52,true,4,,,,,HOURS,65360,ARCIZAC-ADOUR,,,65019,,,,,,,,,,,,,,,,,,,1995-12-25,F,,,,,60.2M,NAF1993,O,-0.1694876,43.2290249,0.89,poi.townhall,Mairie (Hôtel de ville) Hours,https://osm.org/way/70396875,G,,
383726577,00018,38372657700018,P,1991-11-23,NN,,,2024-01-17T21:38:29,true,5,[ND],[ND],[ND],[ND],[ND],[ND],ARCIZAC-ADOUR,,[ND],65019,[ND],[ND],,,[ND],[ND],[ND],[ND],[ND],[ND],,,[ND],,[ND],[ND],,,2008-08-01,A,[ND],[ND],[ND],[ND],68.20B,NAFRev2,N,,,0,,,,,,
384347340,00026,38434734000026,O,2020-03-02,,,,2020-04-17T03:52:31,true,1,,60,,RTE,DES PYRENEES,65360,ARCIZAC-ADOUR,,,65019,,,,,,,,,,,,,,,,,,,2020-03-02,A,,,,,68.20A,NAFRev2,N,0.090032,43.151795,0.85,housenumber,60 Route des Pyrénées 65360 Arcizac-Adour,65019_0080_00060,G,60 ROUTE DES PYRENEES,
387583438,00032,38758343800032,P,1998-07-01,NN,,8121ZZ,2019-11-14T14:00:52,true,5,[ND],[ND],[ND],[ND],[ND],[ND],ARCIZAC-ADOUR,,[ND],65019,[ND],[ND],,,[ND],[ND],[ND],[ND],[ND],[ND],,,[ND],,[ND],[ND],,,2019-04-01,A,[ND],[ND],[ND],[ND],95.29Z,NAFRev2,N,,,0,,,,,,
389532235,00022,38953223500022,O,1998-01-01,,,,2019-11-14T14:00:52,true,1,,,,,,65360,ARCIZAC-ADOUR,,,65019,,,,,,,,,,,,,,,,,,,1999-10-01,F,,,,,01.2G,NAF1993,N,,,0,,,,,,
389969288,00023,38996928800023,O,,NN,,,2019-11-14T14:00:52,true,1,,305,,CHE,,65360,ARCIZAC-ADOUR,,,65019,,,,,,,,,,,,,,,,,,,1996-12-01,F,,,,,85.1C,NAF1993,N,0.084757,43.148825,0.8,housenumber,305 Chemin du Hameau 65360 Arcizac-Adour,65019_0042_00305,G,305 CHEMIN DU HAMEAU,
389981176,00016,38998117600016,O,1992-12-23,NN,,,2021-06-18T08:48:38,true,2,,225,,RUE,ARBIZON,65360,ARCIZAC-ADOUR,,,65019,,,,,,,,,,,,,,,,,,,1995-09-09,F,,,,,,,,0.099826,43.153749,0.88,housenumber,225 Rue de l'Arbizon 65360 Arcizac-Adour,65019_0010_00225,G,225 RUE DE L ARBIZON,
391389699,00029,39138969900029,O,2005-04-04,,,,2019-11-14T14:00:52,false,4,,300,,RUE,LASPASSADES,65360,ARCIZAC-ADOUR,,,65019,,,,,,,,,,,,,,,,,,,2011-01-01,F,,,,,33.12Z,NAFRev2,O,0.088365,43.147925,0.95,housenumber,300 Rue Laspassades 65360 Arcizac-Adour,65019_0053_00300,G,300 RUE LASPASSADES,
393986559,00010,39398655900010,O,,NN,,,2019-11-14T14:00:52,true,1,,295,,RUE,DU 8 MAI 1945,65360,ARCIZAC-ADOUR,,,65019,,,,,,,,,,,,,,,,,,,1994-03-24,F,,,,,85.1G,NAF1993,N,0.099707,43.158041,0.95,housenumber,295 Rue du 8 Mai 1945 65360 Arcizac-Adour,65019_0062_00295,G,295 RUE DU 8 MAI 1945,
397518234,00026,39751823400026,O,2001-07-16,NN,,,2021-01-22T03:50:27,true,4,,115,,CHE,DES COTEAUX,65360,ARCIZAC-ADOUR,,,65019,,,,,,,,,,,,,,,,,,,2021-01-31,F,,,,,56.21Z,NAFRev2,N,0.08553,43.150651,0.85,housenumber,115 Chemin des Coteaux 65360 Arcizac-Adour,65019_0034_00115,G,115 CHEMIN DES COTEAUX,
400408217,00018,40040821700018,O,1995-03-15,NN,,,2019-12-05T09:30:46,true,3,,155,,,LASPASSADES,65360,ARCIZAC-ADOUR,,,65019,,,,,,,,,,,,,,,,,,,2008-01-01,A,,,,,68.20A,NAFRev2,N,0.087868,43.149165,0.89,housenumber,155 Rue Laspassades 65360 Arcizac-Adour,65019_0053_00155,G,155 RUE LASPASSADES,
408580025,00026,40858002500026,O,1997-04-26,,,,2019-11-14T14:00:52,true,3,,365,,RUE,DE L'ARBIZON,65360,ARCIZAC-ADOUR,,,65019,,,,,,,,,,,,,,,,,,,2008-01-01,A,,,,,94.99Z,NAFRev2,N,0.10022,43.152513,0.95,housenumber,365 Rue de l'Arbizon 65360 Arcizac-Adour,65019_0010_00365,G,365 RUE DE L ARBIZON,
411517816,00020,41151781600020,O,2006-11-15,,,,2019-11-14T14:00:52,false,2,,220,,,CHEMIN DES VALLONS,65360,ARCIZAC-ADOUR,,,65019,,,,,,,,,,,,,,,,,,,2007-01-01,F,MIKE ANIMATION,,,,74.8J,NAFRev1,N,0.079088,43.14611,0.94,housenumber,220 Chemin des Vallons 65360 Arcizac-Adour,65019_itex79_00220,G,220 CHEMIN DES VALLONS,
413083882,00022,41308388200022,O,2006-04-03,,,,2022-04-03T20:32:44,true,6,,495,,RUE,DE L ARBIZON,65360,ARCIZAC-ADOUR,,,65019,,,,,,,,,,,,,,,,,,,2015-04-25,A,,,,,68.31Z,NAFRev2,N,0.100656,43.151387,0.95,housenumber,495 Rue de l'Arbizon 65360 Arcizac-Adour,65019_0010_00495,G,495 RUE DE L ARBIZON,
419134788,00019,41913478800019,O,1982-12-31,NN,,,2023-05-05T21:06:23,true,4,,,,,,65360,ARCIZAC-ADOUR,,,65019,,,,,,,,,,,,,,,,,,,2018-12-25,F,,,,,01.11Z,NAFRev2,N,,,0,,,,,,
419134796,00012,41913479600012,O,1982-12-31,NN,,,2019-11-14T14:00:52,true,3,,,,,,65360,ARCIZAC-ADOUR,,,65019,,,,,,,,,,,,,,,,,,,2008-01-01,A,,,,,01.47Z,NAFRev2,N,,,0,,,,,,
419134804,00014,41913480400014,O,1990-01-01,NN,,,2019-11-14T14:00:52,true,3,,,,CHE,LASPASSADES,65360,ARCIZAC-ADOUR,,,65019,,,,,,,,,,,,,,,,,,,2006-02-16,F,,,,,01.1A,NAFRev1,N,0.087579,43.148675,0.77,street,Rue Laspassades 65360 Arcizac-Adour,65019_0053,G,RUE LASPASSADES,
419134812,00017,41913481200017,O,1982-12-31,NN,,,2022-05-04T16:38:49,true,4,,,,,,65360,ARCIZAC-ADOUR,,,65019,,,,,,,,,,,,,,,,,,,2021-12-31,F,,,,,01.41Z,NAFRev2,N,,,0,,,,,,
419134820,00010,41913482000010,O,1988-12-31,NN,,,2019-11-14T14:00:52,true,3,,200,,RUE,DU 8 MAI 1945,65360,ARCIZAC-ADOUR,,,65019,,,,,,,,,,,,,,,,,,,2008-01-01,A,,,,,01.11Z,NAFRev2,N,0.099613,43.157202,0.95,housenumber,200 Rue du 8 Mai 1945 65360 Arcizac-Adour,65019_0062_00200,G,200 RUE DU 8 MAI 1945,
419134838,00012,41913483800012,O,1986-12-31,NN,,,2023-04-05T03:45:50,true,4,,,,,,65360,ARCIZAC-ADOUR,,,65019,,,,,,,,,,,,,,,,,,,2023-02-28,F,,,,,01.43Z,NAFRev2,N,,,0,,,,,,
419134846,00015,41913484600015,O,1986-12-31,NN,,,2019-11-14T14:00:52,true,3,,5,,RUE,DU PIC DU MIDI,65360,ARCIZAC-ADOUR,,,65019,,,,,,,,,,,,,,,,,,,2008-01-01,A,,,,,01.42Z,NAFRev2,N,0.082772,43.147652,0.95,housenumber,5 Rue du Pic du Midi 65360 Arcizac-Adour,65019_0077_00005,G,5 RUE DU PIC DU MIDI,
419134853,00011,41913485300011,O,1987-12-31,NN,,,2022-03-15T17:00:57,true,3,,,,,,65360,ARCIZAC-ADOUR,,,65019,,,,,,,,,,,,,,,,,,,2008-01-01,A,,,,,01.11Z,NAFRev2,N,,,0,,,,,,
419134861,00014,41913486100014,O,1988-12-31,NN,,,2019-11-14T14:00:52,true,4,,,,,,65360,ARCIZAC-ADOUR,,,65019,,,,,,,,,,,,,,,,,,,2012-12-25,F,,,,,01.11Z,NAFRev2,N,,,0,,,,,,
419134879,00016,41913487900016,O,1982-12-31,NN,,,2019-11-14T14:00:52,true,4,,750,,RUE,DU PIC DU JER,65360,ARCIZAC-ADOUR,,,65019,,,,,,,,,,,,,,,,,,,2008-01-01,A,,,,,01.42Z,NAFRev2,N,0.085053,43.144134,0.95,housenumber,750 Rue du Pic du Jer 65360 Arcizac-Adour,65019_0075_00750,G,750 RUE DU PIC DU JER,
419134887,00019,41913488700019,O,1990-01-01,NN,,,2019-11-14T14:00:52,true,4,,,,,,65360,ARCIZAC-ADOUR,,,65019,,,,,,,,,,,,,,,,,,,2003-01-12,F,,,,,01.1A,NAFRev1,N,,,0,,,,,,
419134895,00012,41913489500012,O,1991-12-31,NN,,,2024-01-27T03:35:37,true,4,,,,,,65360,ARCIZAC-ADOUR,,,65019,,,,,,,,,,,,,,,,,,,2008-01-01,A,,,,,01.42Z,NAFRev2,N,,,0,,,,,,
419166202,00012,41916620200012,O,1992-01-01,NN,,,2019-11-14T14:00:52,true,3,,185,,RUE,DU PIC DU MIDI,65360,ARCIZAC-ADOUR,,,65019,,,,,,,,,,,,,,,,,,,2008-01-01,A,,,,,01.50Z,NAFRev2,N,0.083498,43.146203,0.95,housenumber,185 Rue du Pic du Midi 65360 Arcizac-Adour,65019_0077_00185,G,185 RUE DU PIC DU MIDI,
419166608,00010,41916660800010,O,1982-12-31,NN,,,2023-12-21T19:50:39,true,4,,,,,,65360,ARCIZAC-ADOUR,,,65019,,,,,,,,,,,,,,,,,,,2023-12-31,F,,,,,01.43Z,NAFRev2,N,,,0,,,,,,
420352916,00019,42035291600019,O,1982-12-31,NN,,,2023-05-05T20:53:55,true,4,,,,,,65360,ARCIZAC-ADOUR,,,65019,,,,,,,,,,,,,,,,,,,2017-12-25,F,,,,,01.49Z,NAFRev2,N,,,0,,,,,,
420352924,00013,42035292400013,O,1985-07-01,NN,,,2019-11-14T14:00:52,true,1,,,,,,65360,ARCIZAC-ADOUR,,,65019,,,,,,,,,,,,,,,,,,,1986-12-25,F,,,,,45.2B,NAF1993,N,,,0,,,,,,
420685935,00017,42068593500017,O,1998-10-01,NN,,,2019-11-14T14:00:52,true,3,,,,RUE,DE L'ARBIZON,65360,ARCIZAC-ADOUR,,,65019,,,,,,,,,,,,,,,,,,,2006-07-29,F,,,,,92.7C,NAFRev1,N,0.099907,43.153266,0.95,street,Rue de l'Arbizon 65360 Arcizac-Adour,65019_0010,G,RUE DE L ARBIZON,
420937922,00011,42093792200011,O,1998-11-08,NN,,,2019-11-14T14:00:52,true,4,CHEZ MR AUSSENAC,5,,CHE,LABACHE,65360,ARCIZAC-ADOUR,,,65019,,,,,,,,,,,,,,,,,,,2008-01-01,A,,,,,93.12Z,NAFRev2,N,0.089329,43.14586,0.92,housenumber,5 Chemin de Labache 65360 Arcizac-Adour,65019_0050_00005,G,5 CHEMIN DE LABACHE,
423343730,00010,42334373000010,O,1999-06-14,NN,,,2019-11-14T14:00:52,true,3,,,,,,65360,ARCIZAC-ADOUR,,,65019,,,,,,,,,,,,,,,,,,,2008-01-01,A,,,,,77.31Z,NAFRev2,N,,,0,,,,,,
424526812,00062,42452681200062,O,2012-06-22,,,,2019-11-14T14:00:52,false,1,CHEZ MADAME LABORDE,30,,CHE,BUALA DEBAT,65360,ARCIZAC-ADOUR,,,65019,,,,,,,,,,,,,,,,,,,2012-06-22,A,,,,,86.90E,NAFRev2,N,0.085319,43.150912,0.84,housenumber,30 Chemin du Buala Debat 65360 Arcizac-Adour,65019_k1q26z_00030,G,30 CHEMIN DU BUALA DEBAT,
425274511,00012,42527451100012,O,1992-12-15,NN,,,2019-11-14T14:00:52,true,3,,,,,,65360,ARCIZAC-ADOUR,,,65019,,,,,,,,,,,,,,,,,,,2002-12-31,F,,,,,70.2A,NAF1993,N,,,0,,,,,,
425274578,00011,42527457800011,O,,,,,2019-11-14T14:00:52,true,1,,,,,,65360,ARCIZAC-ADOUR,,,65019,,,,,,,,,,,,,,,,,,,1992-01-01,F,,,,,01.3Z,NAF1993,N,,,0,,,,,,
425275047,00016,42527504700016,O,1968-01-01,NN,,,2019-11-14T14:00:52,true,3,,,,,,65360,ARCIZAC-ADOUR,,,65019,,,,,,,,,,,,,,,,,,,2008-01-01,A,,,,,01.11Z,NAFRev2,N,,,0,,,,,,
425275054,00012,42527505400012,O,1969-01-01,NN,,,2019-11-14T14:00:52,true,3,,,,,,65360,ARCIZAC-ADOUR,,,65019,,,,,,,,,,,,,,,,,,,2008-01-01,A,,,,,01.11Z,NAFRev2,N,,,0,,,,,,
425275062,00015,42527506200015,O,1982-01-01,NN,,,2019-11-14T14:00:52,true,3,,,,,,65360,ARCIZAC-ADOUR,,,65019,,,,,,,,,,,,,,,,,,,2008-01-01,A,,,,,01.11Z,NAFRev2,N,,,0,,,,,,
428607659,00011,42860765900011,O,1999-10-01,NN,,,2019-11-14T14:00:52,false,3,,,,,,65360,ARCIZAC-ADOUR,,,65019,,,,,,,,,,,,,,,,,,,2004-01-01,F,,,,,01.1A,NAFRev1,N,,,0,,,,,,
428631675,00025,42863167500025,O,2003-01-01,NN,,,2019-11-14T14:00:52,true,3,,275,,RTE,DU MONTAIGU,65360,ARCIZAC-ADOUR,,,65019,,,,,,,,,,,,,,,,,,,2008-01-01,A,,,,,71.11Z,NAFRev2,N,0.088867,43.154759,0.85,housenumber,275 Route du Montaigu 65360 Arcizac-Adour,65019_0066_00275,G,275 ROUTE DU MONTAIGU,
429486392,00021,42948639200021,O,2016-01-01,,,,2019-11-14T14:00:52,true,1,,255,,RUE,DU PIC DU JER,65360,ARCIZAC-ADOUR,,,65019,,,,,,,,,,,,,,,,,,,2016-01-01,A,,,,,01.42Z,NAFRev2,N,0.089676,43.146914,0.95,housenumber,255 Rue du Pic du Jer 65360 Arcizac-Adour,65019_0075_00255,G,255 RUE DU PIC DU JER,
429953920,00015,42995392000015,O,2000-04-03,NN,,4120BA,2019-11-14T14:00:52,true,4,,195,,RUE,DE L'ARBIZON,65360,ARCIZAC-ADOUR,,,65019,,,,,,,,,,,,,,,,,,,2009-11-02,F,,,,,46.73A,NAFRev2,N,0.09901,43.155129,0.95,housenumber,195 Rue de l'Arbizon 65360 Arcizac-Adour,65019_0010_00195,G,195 RUE DE L ARBIZON,
431531482,00021,43153148200021,O,2001-12-17,NN,,,2019-11-14T14:00:52,false,4,,10,,RTE,DU MONTAIGU,65360,ARCIZAC-ADOUR,,,65019,,,,,,,,,,,,,,,,,,,2003-03-15,F,,,,,85.1G,NAFRev1,N,0.089367,43.153357,0.7,street,Route du Montaigu 65360 Arcizac-Adour,65019_0066,G,ROUTE DU MONTAIGU,
432111664,00012,43211166400012,O,2000-06-06,NN,,,2019-11-14T14:00:52,true,3,CHEZ MARIE HELENE FANT,430,,RUE,LASPASSADES,65360,ARCIZAC-ADOUR,,,65019,,,,,,,,,,,,,,,,,,,2008-01-01,A,,,,,94.99Z,NAFRev2,N,0.08943,43.14716,0.95,housenumber,430 Rue Laspassades 65360 Arcizac-Adour,65019_0053_00430,G,430 RUE LASPASSADES,
434435756,00011,43443575600011,O,2001-02-17,NN,,,2019-11-14T14:00:52,true,5,,315,,RUE,DE L'ARBIZON,65360,ARCIZAC-ADOUR,,,65019,,,,,,,,,,,,,,,,,,,2013-06-13,F,,,,,43.21A,NAFRev2,O,0.100153,43.152833,0.95,housenumber,315 Rue de l'Arbizon 65360 Arcizac-Adour,65019_0010_00315,G,315 RUE DE L ARBIZON,
442103560,00011,44210356000011,O,2002-05-24,NN,,,2019-11-14T14:00:52,true,4,,495,,RUE,DE L'ARBIZON,65360,ARCIZAC-ADOUR,,,65019,,,,,,,,,,,,,,,,,,,2019-02-28,F,,,,,68.20B,NAFRev2,N,0.100656,43.151387,0.95,housenumber,495 Rue de l'Arbizon 65360 Arcizac-Adour,65019_0010_00495,G,495 RUE DE L ARBIZON,
442445235,00041,44244523500041,P,2017-08-28,,,,2020-02-07T04:26:11,true,1,[ND],[ND],[ND],[ND],[ND],[ND],ARCIZAC-ADOUR,,[ND],65019,[ND],[ND],,,[ND],[ND],[ND],[ND],[ND],[ND],,,[ND],,[ND],[ND],,,2017-08-28,A,[ND],[ND],[ND],[ND],86.90E,NAFRev2,N,,,0,,,,,,
443713896,00027,44371389600027,O,2016-02-15,,,,2019-11-14T14:00:52,false,1,LIEU-DIT MATARDOUN,,,CHE,DE COMPOSTELLE,65360,ARCIZAC-ADOUR,,,65019,,,,,,,,,,,,,,,,,,,2016-02-15,A,,,,,68.20B,NAFRev2,N,0.093141,43.149084,0.85,street,Chemin de Compostelle 65360 Arcizac-Adour,65019_0032,G,CHEMIN DE COMPOSTELLE,
443831771,00011,44383177100011,O,2002-10-15,NN,,,2019-11-14T14:00:52,false,3,,245,,AV,DU 8 MAI 1945,65360,ARCIZAC-ADOUR,,,65019,,,,,,,,,,,,,,,,,,,2007-06-30,F,,,,,68.20B,NAFRev2,N,0.099762,43.15742,0.8,housenumber,245 Rue du 8 Mai 1945 65360 Arcizac-Adour,65019_0062_00245,G,245 RUE DU 8 MAI 1945,
443831771,00029,44383177100029,O,2007-06-30,,,,2019-11-14T14:00:52,false,3,,275,,RUE,DU PIC DU JER,65360,ARCIZAC-ADOUR,,,65019,,,,,,,,,,,,,,,,,,,2019-03-25,F,,,,,68.20B,NAFRev2,N,0.089508,43.146712,0.95,housenumber,275 Rue du Pic du Jer 65360 Arcizac-Adour,65019_0075_00275,G,275 RUE DU PIC DU JER,
443850219,00017,44385021900017,O,2002-10-01,NN,,,2019-11-14T14:00:52,false,3,,245,,RUE,DU 8 MAI,65360,ARCIZAC-ADOUR,,,65019,,,,,,,,,,,,,,,,,,,2007-06-30,F,,,,,74.1J,NAFRev1,N,0.099762,43.15742,0.94,housenumber,245 Rue du 8 Mai 1945 65360 Arcizac-Adour,65019_0062_00245,G,245 RUE DU 8 MAI 1945,
443850219,00025,44385021900025,O,2007-06-30,,,,2019-11-14T14:00:52,false,3,,275,,RUE,DU PIC DU JER,65360,ARCIZAC-ADOUR,,,65019,,,,,,,,,,,,,,,,,,,2016-10-01,F,,,,,64.20Z,NAFRev2,N,0.089508,43.146712,0.95,housenumber,275 Rue du Pic du Jer 65360 Arcizac-Adour,65019_0075_00275,G,275 RUE DU PIC DU JER,
445119225,00016,44511922500016,O,2003-02-04,NN,,,2019-11-14T14:00:52,false,3,,635,,RUE,DE L'ADOUR,65360,ARCIZAC-ADOUR,,,65019,,,,,,,,,,,,,,,,,,,2003-12-25,F,,,,,72.2A,NAFRev1,N,0.091651,43.152903,0.95,housenumber,635 Rue de l'Adour 65360 Arcizac-Adour,65019_0005_00635,G,635 RUE DE L ADOUR,
449998491,00038,44999849100038,P,2020-01-06,,,,2021-02-23T13:32:31,true,1,[ND],[ND],[ND],[ND],[ND],[ND],ARCIZAC-ADOUR,,[ND],65019,[ND],[ND],,,[ND],[ND],[ND],[ND],[ND],[ND],,,[ND],,[ND],[ND],,,2020-01-06,A,[ND],[ND],[ND],[ND],74.90B,NAFRev2,N,,,0,,,,,,
450176193,00016,45017619300016,O,2003-10-01,NN,,,2022-07-08T03:50:32,true,6,,265,,RUE,SAINT MISSELIN,65360,ARCIZAC-ADOUR,,,65019,,,,,,,,,,,,,,,,,,,2022-05-30,F,,,,,47.78C,NAFRev2,N,0.099876,43.157248,0.95,housenumber,265 Rue Saint-misselin 65360 Arcizac-Adour,65019_0087_00265,G,265 RUE SAINT MISSELIN,
453626459,00011,45362645900011,O,1990-01-01,NN,,,2019-11-14T14:00:52,true,3,,155,,RUE,DU 8 MAI 1945,65360,ARCIZAC-ADOUR,,,65019,,,,,,,,,,,,,,,,,,,2008-01-01,A,,,,,01.11Z,NAFRev2,N,0.099029,43.157018,0.95,housenumber,155 Rue du 8 Mai 1945 65360 Arcizac-Adour,65019_0062_00155,G,155 RUE DU 8 MAI 1945,
478873912,00024,47887391200024,O,2005-05-01,NN,,,2019-11-14T14:00:52,true,3,,260,,RUE,LASPASSADE,65360,ARCIZAC-ADOUR,,,65019,,,,,,,,,,,,,,,,,,,2011-12-19,F,,,,,43.99C,NAFRev2,O,0.088241,43.148153,0.9,housenumber,260 Rue Laspassades 65360 Arcizac-Adour,65019_0053_00260,G,260 RUE LASPASSADES,
480579663,00018,48057966300018,O,1998-01-01,NN,,,2019-11-14T14:00:52,true,3,,160,,RUE,DE LA GESPE,65360,ARCIZAC-ADOUR,,,65019,,,,,,,,,,,,,,,,,,,2008-01-01,A,,,,,01.11Z,NAFRev2,N,0.087843,43.151617,0.94,housenumber,160 Rue de la Gespe 65360 Arcizac-Adour,65019_0040_00160,G,160 RUE DE LA GESPE,
481078681,00014,48107868100014,O,2005-02-16,,,,2019-11-14T14:00:52,true,2,,30,,CHE,BUALA DEBAT,65360,ARCIZAC-ADOUR,,,65019,,,,,,,,,,,,,,,,,,,2008-01-01,A,,,,,68.20B,NAFRev2,N,0.085319,43.150912,0.84,housenumber,30 Chemin du Buala Debat 65360 Arcizac-Adour,65019_k1q26z_00030,G,30 CHEMIN DU BUALA DEBAT,