siren,nic,siret,statutDiffusionEtablissement,dateCreationEtablissement,trancheEffectifsEtablissement,anneeEffectifsEtablissement,activitePrincipaleRegistreMetiersEtablissement,dateDernierTraitementEtablissement,etablissementSiege,nombrePeriodesEtablissement,complementAdresseEtablissement,numeroVoieEtablissement,indiceRepetitionEtablissement,typeVoieEtablissement,libelleVoieEtablissement,codePostalEtablissement,libelleCommuneEtablissement,libelleCommuneEtrangerEtablissement,distributionSpecialeEtablissement,codeCommuneEtablissement,codeCedexEtablissement,libelleCedexEtablissement,codePaysEtrangerEtablissement,libellePaysEtrangerEtablissement,complementAdresse2Etablissement,numeroVoie2Etablissement,indiceRepetition2Etablissement,typeVoie2Etablissement,libelleVoie2Etablissement,codePostal2Etablissement,libelleCommune2Etablissement,libelleCommuneEtranger2Etablissement,distributionSpeciale2Etablissement,codeCommune2Etablissement,codeCedex2Etablissement,libelleCedex2Etablissement,codePaysEtranger2Etablissement,libellePaysEtranger2Etablissement,dateDebut,etatAdministratifEtablissement,enseigne1Etablissement,enseigne2Etablissement,enseigne3Etablissement,denominationUsuelleEtablissement,activitePrincipaleEtablissement,nomenclatureActivitePrincipaleEtablissement,caractereEmployeurEtablissement,longitude,latitude,geo_score,geo_type,geo_adresse,geo_id,geo_ligne,geo_l4,geo_l5
077280089,00028,07728008900028,O,1983-10-17,21,2021,,2023-11-30T10:16:56,true,4,,,,,ZI DES QUATRE VOIES,22170,PLELO,,,22182,,,,,,,,,,,,,,,,,,,2008-01-01,A,,,,,25.93Z,NAFRev2,O,,,0,,,,,,
212201826,00014,21220182600014,O,1983-03-01,NN,,,,false,3,,3,,RUE,DES ECOLES,22170,PLELO,,,22182,,,,,,,,,,,,,,,,,,,1996-12-25,F,MAIRIE,,,,75.1A,NAF1993,O,-2.947896,48.556321,0.95,housenumber,3 Rue des Ecoles 22170 Plélo,22182_0135_00003,G,3 RUE DES ECOLES,
212201826,00022,21220182600022,O,1983-12-21,11,2021,,2023-11-30T10:18:07,false,4,,7,,RUE,DES ECOLES,22170,PLELO,,,22182,,,,,,,,,,,,,,,,,,,2008-01-01,A,ECOLE PRIMAIRE PUBLIQUE,,,,85.20Z,NAFRev2,O,-2.948698,48.556596,0.95,housenumber,7 Rue des Ecoles 22170 Plélo,22182_0135_00007,G,7 RUE DES ECOLES,
212201826,00030,21220182600030,O,2000-12-25,NN,,,2022-08-31T13:47:47,false,3,MAIRIE,,,PL,DU 11 NOVEMBRE,22170,PLELO,,,22182,,,,,,,,,,,,,,,,,,,2021-12-31,F,TRANSPORT SCOLAIRE,,,,49.39A,NAFRev2,N,-2.945873,48.556169,0.84,street,Place du 11 Novembre 22170 Plélo,22182_0080,G,PLACE DU 11 NOVEMBRE,
212201826,00048,21220182600048,O,2000-12-25,NN,,,2017-04-27T14:15:49,false,4,MAIRIE,,,PL,DU 11 NOVEMBRE,22170,PLELO,,,22182,,,,,,,,,,,,,,,,,,,2016-01-01,F,SERVICE D EAU,,,,37.00Z,NAFRev2,N,-2.945873,48.556169,0.84,street,Place du 11 Novembre 22170 Plélo,22182_0080,G,PLACE DU 11 NOVEMBRE,
212201826,00055,21220182600055,O,2000-12-25,NN,,,,false,2,,3,,RUE,DES ECOLES,22170,PLELO,,,22182,,,,,,,,,,,,,,,,,,,2003-12-25,F,LOTISSEMENT COMMUNAL,,,,70.1C,NAFRev1,N,-2.947896,48.556321,0.95,housenumber,3 Rue des Ecoles 22170 Plélo,22182_0135_00003,G,3 RUE DES ECOLES,
212201826,00063,21220182600063,O,2000-12-25,NN,,,,false,2,,3,,RUE,DES ECOLES,22170,PLELO,,,22182,,,,,,,,,,,,,,,,,,,2003-12-25,F,LOGEMENTS SOCIAUX,,,,70.2A,NAFRev1,N,-2.947896,48.556321,0.95,housenumber,3 Rue des Ecoles 22170 Plélo,22182_0135_00003,G,3 RUE DES ECOLES,
212201826,00071,21220182600071,O,2002-01-01,NN,,,2009-08-04T16:19:40,false,3,MAIRIE,,,PL,DU 11 NOVEMBRE,22170,PLELO,,,22182,,,,,,,,,,,,,,,,,,,2006-12-25,F,LOTISSEMENT MOBUCHON,,,,70.1C,NAFRev1,N,-2.945873,48.556169,0.84,street,Place du 11 Novembre 22170 Plélo,22182_0080,G,PLACE DU 11 NOVEMBRE,
212201826,00089,21220182600089,O,1994-12-25,12,2021,,2023-11-30T10:18:07,true,3,,,,PL,DU 11 NOVEMBRE,22170,PLELO,,,22182,,,,,,,,,,,,,,,,,,,2023-05-01,A,MAIRIE,,,,84.11Z,NAFRev2,O,-2.945873,48.556169,0.84,street,Place du 11 Novembre 22170 Plélo,22182_0080,G,PLACE DU 11 NOVEMBRE,
212201826,00113,21220182600113,O,2017-03-24,,,,2023-07-28T10:34:10,false,1,,,,PL,DU 11 NOVEMBRE,22170,PLELO,,,22182,,,,,,,,,,,,,,,,,,,2017-03-24,A,LOTISSEMENT LE CLOS DES CHARMES,,,,42.99Z,NAFRev2,N,-2.945873,48.556169,0.84,street,Place du 11 Novembre 22170 Plélo,22182_0080,G,PLACE DU 11 NOVEMBRE,
262202393,00019,26220239300019,O,1984-08-06,NN,,,2010-06-26T03:06:33,true,3,MAIRIE,3,,RUE,DES ECOLES,22170,PLELO,,,22182,,,,,,,,,,,,,,,,,,,2008-01-01,A,CCAS,,,,88.99B,NAFRev2,N,-2.947896,48.556321,0.95,housenumber,3 Rue des Ecoles 22170 Plélo,22182_0135_00003,G,3 RUE DES ECOLES,
262205156,00017,26220515600017,O,1993-12-15,NN,,,2020-07-03T10:50:22,true,4,MAIRIE,,,,LE BOURG,22170,PLELO,,,22182,,,,,,,,,,,,,,,,,,,2020-06-25,F,CDE,,,,88.99B,NAFRev2,N,-2.903707,48.539476,0.84,street,Le Bourgneuf 22170 Plélo,22182_ohlef9,G,LE BOURGNEUF,
292201365,00015,29220136500015,O,1983-08-10,NN,,,2009-08-03T15:43:18,true,4,,3,,RUE,DES ECOLES,22170,PLELO,,,22182,,,,,,,,,,,,,,,,,,,2008-10-01,F,,,,,42.99Z,NAFRev2,N,-2.947896,48.556321,0.95,housenumber,3 Rue des Ecoles 22170 Plélo,22182_0135_00003,G,3 RUE DES ECOLES,
292202165,00018,29220216500018,O,1986-03-05,NN,,,2006-11-25T09:10:30,true,3,,,,RUE,DES ECOLES,22170,PLELO,,,22182,,,,,,,,,,,,,,,,,,,2004-07-07,F,,,,,70.1C,NAFRev1,N,-2.948832,48.556828,0.95,street,Rue des Ecoles 22170 Plélo,22182_0135,G,RUE DES ECOLES,
292202231,00018,29220223100018,O,1986-03-05,NN,,,2006-11-25T09:10:30,true,3,MAIRIE,,,,BOURG,22170,PLELO,,,22182,,,,,,,,,,,,,,,,,,,2004-03-05,F,,,,,70.1C,NAFRev1,N,-2.944235,48.554521,0.77,street,Rue Leon Bourgeois 22170 Plélo,22182_2210,G,RUE LEON BOURGEOIS,
301610986,00012,30161098600012,O,1900-01-01,NN,,,2021-05-11T03:42:40,true,5,,,,,LAUNAY,22170,PLELO,,,22182,,,,,,,,,,,,,,,,,,,2015-01-01,A,,,,,01.11Z,NAFRev2,N,-2.914266,48.58926,0.95,street,Launay 22170 Plélo,22182_24q7a0,G,LAUNAY,
302375985,00025,30237598500025,O,1984-04-15,NN,,,2006-10-26T23:56:56,true,4,,,,LD,LES COURTILLONS LA CORDERI,22170,PLELO,,,22182,,,,,,,,,,,,,,,,,,,2004-12-31,F,,,,,60.2L,NAFRev1,O,-2.916813,48.582305,0.53,street,Rue des Courtillons 22170 Plélo,22182_0123,G,RUE DES COURTILLONS,
303518492,00028,30351849200028,O,,,,,,true,1,,,,,LA GRENOUILLERE,22170,PLELO,,,22182,,,,,,,,,,,,,,,,,,,1984-12-25,F,,,,,55.73,NAP,N,-2.961307,48.547998,0.95,street,La Grenouillere 22170 Plélo,22182_gfwlhc,G,LA GRENOUILLERE,
303590657,00027,30359065700027,O,1985-05-06,NN,,,,true,1,,5,,RUE,DE LA SOLIDARITE,22170,PLELO,,,22182,,,,,,,,,,,,,,,,,,,2001-03-31,F,,,,,52.2C,NAF1993,O,-2.946365,48.555693,0.96,housenumber,5 Rue de La Solidarite 22170 Plélo,22182_0270_00005,G,5 RUE DE LA SOLIDARITE,
303805774,00013,30380577400013,O,1974-01-01,NN,,,,true,1,,,,LD,LE MOUTON D'OR,22170,PLELO,,,22182,,,,,,,,,,,,,,,,,,,1998-12-31,F,,,,,45.3A,NAF1993,N,-2.96166,48.540959,0.76,street,Rue du Mouton d'Or 22170 Plélo,22182_0213,G,RUE DU MOUTON D OR,
303863781,00058,30386378100058,O,1994-03-01,NN,,,2006-11-25T09:16:39,false,3,,,,,ST QUAY,22170,PLELO,,,22182,,,,,,,,,,,,,,,,,,,2005-11-01,F,,,,,74.1E,NAFRev1,N,-2.96982,48.580494,0.71,street,Saint Quay 22170 Plélo,22182_D093,G,SAINT QUAY,
304577588,04930,30457758804930,O,2016-04-04,NN,,,2019-06-24T13:15:44,false,2,17 RUE DES IFS,,,,ZA DES 4 VOIES,22170,PLELO,,,22182,,,,,,,,,,,,,,,,,,,2017-06-30,F,,,,,78.20Z,NAFRev2,O,-2.945674,48.532513,0.61,housenumber,17 Rue des Ifs 22170 Plélo,22182_psfcmy_00017,D,17 RUE DES IFS,
304589021,00027,30458902100027,O,,NN,,,,true,1,,,,LD,ST NICOLAS,22170,PLELO,,,22182,,,,,,,,,,,,,,,,,,,,F,,,,,55.73,NAP,N,-2.895678,48.547205,0.79,street,Saint Nicolas 22170 Plélo,22182_D092,G,SAINT NICOLAS,
305337271,00012,30533727100012,O,,,,,,true,1,,,,,CORDERIE,22170,PLELO,,,22182,,,,,,,,,,,,,,,,,,,1993-12-31,F,,,,,20.1A,NAF1993,N,-2.918337,48.577596,0.92,street,Rue de La Corderie 22170 Plélo,22182_0121,G,RUE DE LA CORDERIE,
306080334,00031,30608033400031,O,1980-01-02,NN,,,2008-11-07T00:21:50,true,3,,,,LD,LA GREMOUILLERE,22170,PLELO,,,22182,,,,,,,,,,,,,,,,,,,1996-07-01,F,,,,,45.4F,NAF1993,,-2.961307,48.547998,0.78,street,La Grenouillere 22170 Plélo,22182_gfwlhc,G,LA GRENOUILLERE,
306537945,00017,30653794500017,O,,NN,,,,true,1,,,,LD,SAINT JEAN DU TEMPLE,22170,PLELO,,,22182,,,,,,,,,,,,,,,,,,,,F,,,,,48.01,NAP,N,-2.911572,48.570955,0.96,street,Saint Jean du Temple 22170 Plélo,22182_D091,G,SAINT JEAN DU TEMPLE,
306956475,00017,30695647500017,O,1900-01-01,NN,,,2006-10-27T00:15:29,false,3,,,,,FONTAINE AURAIN,22170,PLELO,,,22182,,,,,,,,,,,,,,,,,,,2006-02-28,F,,,,,70.2C,NAFRev1,N,-2.897004,48.527241,0.94,street,La Fontaine Aurain 22170 Plélo,22182_C200,G,LA FONTAINE AURAIN,
306998972,00013,30699897200013,O,,NN,,,,true,1,,4,,RUE,DES PROMENADES,22170,PLELO,,,22182,,,,,,,,,,,,,,,,,,,1989-12-31,F,,,,,62.11,NAP,N,-2.945978,48.556888,0.96,housenumber,4 Rue des Promenades 22170 Plélo,22182_0239_00004,G,4 RUE DES PROMENADES,
307012823,00018,30701282300018,O,,,,,,true,1,,22,,RUE,DES PROMENADES,22170,PLELO,,,22182,,,,,,,,,,,,,,,,,,,1992-10-28,F,,,,,45.4C,NAF1993,N,-2.943693,48.557869,0.96,housenumber,22 Rue des Promenades 22170 Plélo,22182_0239_00022,G,22 RUE DES PROMENADES,
307184309,00028,30718430900028,O,1900-01-01,,,,2011-11-18T00:10:31,true,5,,,,,LES QUATRES VOIES,22170,PLELO,,,22182,,,,,,,,,,,,,,,,,,,2007-09-30,F,,,,,51.1T,NAFRev1,N,-2.951803,48.557605,0.49,street,Rue des Quatre Vents 22170 Plélo,22182_0245,G,RUE DES QUATRE VENTS,
308368307,00036,30836830700036,O,2002-08-21,NN,,,2014-07-08T00:14:05,true,4,MAIRIE,,,,,22170,PLELO,,,22182,,,,,,,,,,,,,,,,,,,2009-12-31,F,,,,,47.89Z,NAFRev2,N,-2.886418,48.538299,0.38,street,La Toilerie 22170 Plélo,22182_8r9wvk,D,LA TOILERIE,
309127918,00014,30912791800014,O,,NN,,,,true,1,,,,,LA CORDERIE,22170,PLELO,,,22182,,,,,,,,,,,,,,,,,,,1992-05-06,F,,,,,55.4B,NAF1993,N,-2.918337,48.577596,0.93,street,Rue de La Corderie 22170 Plélo,22182_0121,G,RUE DE LA CORDERIE,
309518801,00019,30951880100019,O,,NN,,,,true,1,,,,RUE,DE PLELO,22170,PLELO,,,22182,,,,,,,,,,,,,,,,,,,1989-06-28,F,,,,,55.72,NAP,N,-2.965993,48.546379,0.95,street,Rue de Plelo 22170 Plélo,22182_0230,G,RUE DE PLELO,
311142590,00018,31114259000018,O,1977-01-01,NN,,,2014-07-08T00:15:27,true,5,,,,LD,VILLE MORO,22170,PLELO,,,22182,,,,,,,,,,,,,,,,,,,2009-06-30,F,,,,,31.09B,NAFRev2,N,-2.962134,48.556904,0.59,street,Moulin de La Ville Geffroy 22170 Plélo,22182_D389,G,MOULIN DE LA VILLE GEFFROY,
311167258,00012,31116725800012,O,,NN,,,,true,1,,,,,LA VILLE JAFFRAIS,22170,PLELO,,,22182,,,,,,,,,,,,,,,,,,,,F,,,,,01.80,NAP,N,-2.926432,48.581467,0.54,street,La Ville Jouhaux 22170 Plélo,22182_l94m7t,G,LA VILLE JOUHAUX,
311203079,00034,31120307900034,O,,NN,,,,true,1,,,,,LA VILLE JEGU,22170,PLELO,,,22182,,,,,,,,,,,,,,,,,,,1993-12-31,F,,,,,45.1A,NAF1993,N,-2.917453,48.533784,0.95,street,La Ville Jegu 22170 Plélo,22182_D245,G,LA VILLE JEGU,
311444731,00013,31144473100013,O,1997-08-25,NN,,,2014-07-08T00:15:41,true,5,,,,,ST QUAY,22170,PLELO,,,22182,,,,,,,,,,,,,,,,,,,2012-04-30,F,,,,,43.32A,NAFRev2,O,-2.96982,48.580494,0.71,street,Saint Quay 22170 Plélo,22182_D093,G,SAINT QUAY,
311741771,00043,31174177100043,O,1985-02-05,NN,,,,true,4,,1,,RUE,DE LA SOLIDARITE,22170,PLELO,,,22182,,,,,,,,,,,,,,,,,,,2003-06-30,F,,,,,85.1E,NAFRev1,N,-2.946353,48.555856,0.96,housenumber,1 Rue de La Solidarite 22170 Plélo,22182_0270_00001,G,1 RUE DE LA SOLIDARITE,
312199151,00019,31219915100019,O,1978-01-01,NN,,,,true,3,,,,,ST QUAY,22170,PLELO,,,22182,,,,,,,,,,,,,,,,,,,2001-07-31,F,,,,,70.2C,NAF1993,N,-2.96982,48.580494,0.71,street,Saint Quay 22170 Plélo,22182_D093,G,SAINT QUAY,
312478159,00014,31247815900014,O,,NN,,,,true,1,,,,LD,KERPRAT,22170,PLELO,,,22182,,,,,,,,,,,,,,,,,,,1988-12-25,F,,,,,01.00,NAP,N,-2.95755,48.5767,0.94,street,Kerprat 22170 Plélo,22182_m5lpg9,G,KERPRAT,
313247736,00025,31324773600025,O,1982-07-01,NN,,,2014-07-08T00:17:19,false,5,SAINT-QUAY,,,,BEL AIR ST QUAY,22170,PLELO,,,22182,,,,,,,,,,,,,,,,,,,2012-04-01,F,,,,,10.13B,NAFRev2,O,-2.963343,48.580009,0.54,street,Bel Air 22170 Plélo,22182_B048,G,BEL AIR,
314263021,00029,31426302100029,O,,NN,,,,true,1,,,,LD,LA VILLE FUMEE,22170,PLELO,,,22182,,,,,,,,,,,,,,,,,,,1988-06-30,F,,,,,62.46,NAP,N,-2.956659,48.534105,0.95,street,La Ville Fumee 22170 Plélo,22182_D225,G,LA VILLE FUMEE,
314321076,00015,31432107600015,O,,NN,,,,true,1,,,,,LA VILLE FUMEE,22170,PLELO,,,22182,,,,,,,,,,,,,,,,,,,1988-06-30,F,,,,,62.46,NAP,N,-2.956659,48.534105,0.95,street,La Ville Fumee 22170 Plélo,22182_D225,G,LA VILLE FUMEE,
314347097,00029,31434709700029,O,1981-04-16,NN,,,2023-05-05T20:11:09,true,4,,,,,LA VILLE JEGU,22170,PLELO,,,22182,,,,,,,,,,,,,,,,,,,2016-12-25,F,,,,,01.41Z,NAFRev2,N,-2.917453,48.533784,0.95,street,La Ville Jegu 22170 Plélo,22182_D245,G,LA VILLE JEGU,
315104141,00017,31510414100017,O,,NN,,,2007-01-18T09:14:04,true,1,,,,LD,CHIEN DE LA VILLE,22170,PLELO,,,22182,,,,,,,,,,,,,,,,,,,1990-03-01,F,,,,,01.1A,NAF1993,N,-2.886093,48.531119,0.73,street,Le Chien de Ville 22170 Plélo,22182_B302,G,LE CHIEN DE VILLE,
315104158,00011,31510415800011,O,1978-02-01,NN,,,2010-04-18T03:43:55,true,5,,,,LD,VILLE ES MEE,22170,PLELO,,,22182,,,,,,,,,,,,,,,,,,,2008-04-30,F,,,,,01.46Z,NAFRev2,N,-2.876405,48.536686,0.94,street,La Ville Es Mee 22170 Plélo,22182_D222,G,LA VILLE ES MEE,
315203455,00011,31520345500011,O,1979-01-01,NN,,,2007-01-18T09:14:06,true,3,,,,,SAINT THURIAU,22170,PLELO,,,22182,,,,,,,,,,,,,,,,,,,1996-12-25,F,,,,,01.4A,NAF1993,N,-2.893302,48.546856,0.49,street,Hameau de Saint Nicolas 22170 Plélo,22182_D397,G,HAMEAU DE SAINT NICOLAS,
315414649,00022,31541464900022,O,1998-05-16,,,,2006-11-25T09:36:32,true,1,,7,,PL,ST PIERRE,22170,PLELO,,,22182,,,,,,,,,,,,,,,,,,,1998-12-16,F,,,,,74.1J,NAF1993,N,-2.947664,48.556042,0.71,housenumber,7 Place Saint Pierre 22170 Plélo,22182_0279_00007,G,7 PLACE SAINT PIERRE,
316186642,00013,31618664200013,O,,NN,,,,true,1,,,,,LA VILLE FUMEE,22170,PLELO,,,22182,,,,,,,,,,,,,,,,,,,1988-06-30,F,,,,,62.46,NAP,N,-2.956659,48.534105,0.95,street,La Ville Fumee 22170 Plélo,22182_D225,G,LA VILLE FUMEE,
316525112,00025,31652511200025,O,1985-06-17,NN,,,2017-06-21T09:17:38,true,4,,6,,RUE,GUSTAVE GILBERT,22170,PLELO,,,22182,,,,,,,,,,,,,,,,,,,2017-06-30,F,,,,,86.21Z,NAFRev2,N,-2.94676,48.557546,0.96,housenumber,6 Rue Gustave Gilbert 22170 Plélo,22182_0164_00006,G,6 RUE GUSTAVE GILBERT,
317279172,00058,31727917200058,O,2001-06-01,NN,,,2014-07-08T00:21:00,true,4,,5,,RUE,DE LENGRIES,22170,PLELO,,,22182,,,,,,,,,,,,,,,,,,,2010-09-30,F,,,,,43.31Z,NAFRev2,N,-2.950632,48.55412,0.9,housenumber,5 Rue de Lenggries 22170 Plélo,22182_0203_00005,G,5 RUE DE LENGGRIES,
317325520,00011,31732552000011,O,,NN,,,,true,1,,,,,LA RUE NEUVE,22170,PLELO,,,22182,,,,,,,,,,,,,,,,,,,,F,,,,,01.07,NAP,N,-2.93987,48.559698,0.95,street,La Rue Neuve 22170 Plélo,22182_D080,G,LA RUE NEUVE,
317325561,00015,31732556100015,O,,NN,,,,true,1,,,,,PIERRE BLANCHE,22170,PLELO,,,22182,,,,,,,,,,,,,,,,,,,,F,,,,,01.07,NAP,N,-2.921825,48.575659,0.94,street,La Pierre Blanche 22170 Plélo,22182_C757,G,LA PIERRE BLANCHE,
317325751,00012,31732575100012,O,1979-01-01,NN,,,2007-01-18T09:14:36,true,4,,,,,,22170,PLELO,,,22182,,,,,,,,,,,,,,,,,,,1996-12-25,F,,,,,01.1A,NAF1993,N,,,0,,,,,,
317372019,00024,31737201900024,O,2009-02-15,,,,2013-01-23T05:36:27,true,2,,,,,ZA DE LA BARRICADE,22170,PLELO,,,22182,,,,,,,,,,,,,,,,,,,2012-12-28,F,,,,,68.20B,NAFRev2,N,6.7647205,43.6172755,0.75,poi.parking,Parking de la Barricade Montauroux,https://osm.org/node/2684309665,G,,
317480648,00037,31748064800037,O,1999-10-01,NN,,,2014-06-14T00:52:36,false,5,,6,,RUE,DU CHEMIN VERT,22170,PLELO,,,22182,,,,,,,,,,,,,,,,,,,2012-07-12,F,,,,,56.10A,NAFRev2,O,-2.949378,48.553311,0.96,housenumber,6 Rue du Chemin Vert 22170 Plélo,22182_0118_00006,G,6 RUE DU CHEMIN VERT,
317641306,00020,31764130600020,O,1983-09-23,NN,,,,false,4,,,,,ZA DES QUATRE VOIES,22170,PLELO,,,22182,,,,,,,,,,,,,,,,,,,1996-06-01,F,,,,,70.2C,NAF1993,N,,,0,,,,,,
317960573,00028,31796057300028,O,1981-10-01,NN,,,2006-12-15T00:19:34,false,3,,,,,ZONE ARTISANALE DES 4 VOIE,22170,PLELO,,,22182,,,,,,,,,,,,,,,,,,,1996-07-01,F,,,,,70.2C,NAF1993,N,,,0,,,,,,
318023918,00044,31802391800044,O,2002-07-01,11,2021,,2023-11-30T10:21:51,true,4,,,,,ZA DES QUATRE VOIES,22170,PLELO,,,22182,,,,,,,,,,,,,,,,,,,2008-12-31,A,,,,,46.73A,NAFRev2,O,,,0,,,,,,
318368339,00012,31836833900012,O,,,,,,true,1,,,,,LA VILLE NORO,22170,PLELO,,,22182,,,,,,,,,,,,,,,,,,,1984-12-25,F,,,,,55.31,NAP,N,-2.930444,48.533817,0.96,street,La Ville Noro 22170 Plélo,22182_D238,G,LA VILLE NORO,
318397387,00016,31839738700016,O,,,,,,true,1,,,,LD,LE COURTIL PICARD,22170,PLELO,,,22182,,,,,,,,,,,,,,,,,,,1985-12-25,F,,,,,55.71,NAP,N,-2.921575,48.576871,0.59,street,Le Courtil Rault 22170 Plélo,22182_C110,G,LE COURTIL RAULT,
318652328,00010,31865232800010,O,,NN,,,,true,1,,,,,ST QUAY,22170,PLELO,,,22182,,,,,,,,,,,,,,,,,,,1994-01-27,F,,,,,67.12,NAP,N,-2.96982,48.580494,0.71,street,Saint Quay 22170 Plélo,22182_D093,G,SAINT QUAY,
318699485,00013,31869948500013,O,,NN,,,,true,1,,,,,LES 4 PLANTS,22170,PLELO,,,22182,,,,,,,,,,,,,,,,,,,1987-03-15,F,,,,,01.4A,NAF1993,N,-2.951803,48.557605,0.38,street,Rue des Quatre Vents 22170 Plélo,22182_0245,G,RUE DES QUATRE VENTS,
318789484,00074,31878948400074,O,1996-09-01,NN,,,,true,1,,,,,LE ROSSIGNOL,22170,PLELO,,,22182,,,,,,,,,,,,,,,,,,,1999-12-31,F,,,,,45.3E,NAF1993,N,-2.945225,48.535468,0.95,street,Le Rossignol 22170 Plélo,22182_z3slru,G,LE ROSSIGNOL,
319453247,00037,31945324700037,O,,NN,,,2013-02-22T10:40:30,true,1,,,,,LICINEUC,22170,PLELO,,,22182,,,,,,,,,,,,,,,,,,,1995-12-25,F,,,,,70.2C,NAF1993,N,-2.905375,48.532369,0.74,street,Liscineuc 22170 Plélo,22182_0euffb,G,LISCINEUC,
319530705,00023,31953070500023,O,1984-07-01,NN,,,,true,1,,,,,ZA DES QUATRES VOIES,22170,PLELO,,,22182,,,,,,,,,,,,,,,,,,,2001-06-25,F,,,,,15.2Z,NAF1993,O,-4.3238661,48.437836,0.71,poi.industrial,Za des Quatres Vents (Zone industrielle) La Forest-Landerneau,https://osm.org/way/130883287,G,,
319530788,00011,31953078800011,O,1980-06-18,NN,,,2008-01-04T18:03:18,true,4,,,,,LES NOROIS,22170,PLELO,,,22182,,,,,,,,,,,,,,,,,,,2008-01-01,A,,,,,77.31Z,NAFRev2,N,-2.937167,48.54303,0.95,street,Les Norois 22170 Plélo,22182_hh7094,G,LES NOROIS,
319538526,00017,31953852600017,O,1980-09-01,12,2021,,2023-11-30T10:22:11,false,8,,,,,SAINT-AVIT,22170,PLELO,,,22182,,,,,,,,,,,,,,,,,,,2023-09-01,F,LOPIN RESEAUX,,,LOPIN RESEAUX,41.20B,NAFRev2,O,-2.924393,48.528738,0.95,street,Saint Avit 22170 Plélo,22182_D085,G,SAINT AVIT,
319538526,00025,31953852600025,O,2023-09-01,,,,2023-11-03T10:02:44,true,1,ZA DES 4 VOIES SUD,7,,RUE,DES CHATAIGNIERS,22170,PLELO,,,22182,,,,,,,,,,,,,,,,,,,2023-09-01,A,REZO OUEST,,,REZO OUEST,41.20B,NAFRev2,N,-2.932926,48.530214,0.95,housenumber,7 Rue des Chataigniers 22170 Plélo,22182_ckdo8w_00007,G,7 RUE DES CHATAIGNIERS,
319626297,00018,31962629700018,O,1980-07-01,02,2021,,2023-11-30T10:22:12,true,4,,,,,ST JEAN DU TEMPLE,22170,PLELO,,,22182,,,,,,,,,,,,,,,,,,,2012-12-31,A,,,,,01.46Z,NAFRev2,O,-2.911572,48.570955,0.85,street,Saint Jean du Temple 22170 Plélo,22182_D091,G,SAINT JEAN DU TEMPLE,
319663175,00085,31966317500085,O,2018-06-06,,,,2018-08-17T10:23:53,false,2,,15,,,LA VILLE ANDONNET,22170,PLELO,,,22182,,,,,,,,,,,,,,,,,,,2018-07-19,F,,,,,59.11B,NAFRev2,N,-2.952534,48.563041,0.95,housenumber,15 La Ville Andonnet 22170 Plélo,22182_d201_00015,G,15 LA VILLE ANDONNET,
319753802,00036,31975380200036,O,1999-06-01,NN,,,2015-05-14T05:13:47,true,4,,,,,LES FONTAINES,22170,PLELO,,,22182,,,,,,,,,,,,,,,,,,,2013-09-30,F,,,,,43.99C,NAFRev2,O,-2.953969,48.575586,0.95,street,Les Fontaines 22170 Plélo,22182_49jkj1,G,LES FONTAINES,
320634785,00010,32063478500010,O,1981-01-01,NN,,,2010-12-30T15:01:39,true,4,,,,,VILLA ANDON,22170,PLELO,,,22182,,,,,,,,,,,,,,,,,,,2009-12-25,F,,,,,68.20B,NAFRev2,N,-2.929146,48.556624,0.78,street,La Ville Andon 22170 Plélo,22182_D208,G,LA VILLE ANDON,
320972102,00026,32097210200026,P,1999-12-13,NN,,4120AZ,2022-08-29T09:16:56,true,6,[ND],[ND],[ND],[ND],[ND],[ND],PLELO,,[ND],22182,[ND],[ND],,,[ND],[ND],[ND],[ND],[ND],[ND],,,[ND],,[ND],[ND],,,2021-04-06,A,[ND],[ND],[ND],[ND],43.99C,NAFRev2,N,,,0,,,,,,
321572539,00021,32157253900021,O,2013-09-05,,,,2021-02-23T10:45:20,true,1,,11,,PL,SAINT PIERRE,22170,PLELO,,,22182,,,,,,,,,,,,,,,,,,,2013-09-05,A,,,,,43.22A,NAFRev2,N,-2.947381,48.556277,0.86,housenumber,11 Place Saint Pierre 22170 Plélo,22182_0279_00011,G,11 PLACE SAINT PIERRE,
321705840,00015,32170584000015,O,1980-10-20,NN,,,,true,1,,,,,LES BROUSSES,22170,PLELO,,,22182,,,,,,,,,,,,,,,,,,,1999-12-31,F,,,,,01.4A,NAF1993,N,-2.921803,48.544521,0.94,street,Les Brousses 22170 Plélo,22182_v0mpsu,G,LES BROUSSES,
321705857,00019,32170585700019,O,1980-02-01,NN,,,2008-01-04T18:28:49,true,3,,,,,CHATEAU GOELO,22170,PLELO,,,22182,,,,,,,,,,,,,,,,,,,2008-01-01,A,,,,,68.20A,NAFRev2,N,-2.880703,48.536617,0.95,street,Chateau Goelo 22170 Plélo,22182_B272,G,CHATEAU GOELO,
321879223,00071,32187922300071,O,2006-11-24,NN,,,2014-07-08T00:26:13,false,5,,,,,ST-BLAISE,22170,PLELO,,,22182,,,,,,,,,,,,,,,,,,,2010-10-26,F,,,,,43.31Z,NAFRev2,N,-2.932272,48.542567,0.77,street,Saint Blaise 22170 Plélo,22182_D087,G,SAINT BLAISE,
321948499,00033,32194849900033,O,2008-10-25,,,,2014-07-08T00:26:23,true,2,,5,,RUE,DES QUATRE VENTS,22170,PLELO,,,22182,,,,,,,,,,,,,,,,,,,2012-12-31,F,,,,,43.22B,NAFRev2,N,-2.95123,48.557326,0.95,housenumber,5 Rue des Quatre Vents 22170 Plélo,22182_0245_00005,G,5 RUE DES QUATRE VENTS,
323143321,00012,32314332100012,O,1981-04-16,NN,,,2008-01-04T18:42:48,true,4,,,,,VILLE JEGU,22170,PLELO,,,22182,,,,,,,,,,,,,,,,,,,2008-01-01,A,,,,,01.41Z,NAFRev2,N,-2.917453,48.533784,0.94,street,La Ville Jegu 22170 Plélo,22182_D245,G,LA VILLE JEGU,
323657148,00017,32365714800017,O,1982-01-01,NN,,,,false,4,,,,LD,ZA DES QUATRE VOIES,22170,PLELO,,,22182,,,,,,,,,,,,,,,,,,,1999-01-15,F,,,,,28.1A,NAF1993,O,,,0,,,,,,
323806562,00027,32380656200027,O,,,,,,true,1,,2,,PL,SAINT PIERRE,22170,PLELO,,,22182,,,,,,,,,,,,,,,,,,,1989-02-22,F,,,,,38.40,NAP,N,-2.947842,48.555364,0.85,housenumber,2 Place Saint Pierre 22170 Plélo,22182_0279_00002,G,2 PLACE SAINT PIERRE,
324051903,00015,32405190300015,O,,,,,,true,1,,,,,ST BLAISE,22170,PLELO,,,22182,,,,,,,,,,,,,,,,,,,1984-12-25,F,,,,,62.44,NAP,N,-2.932272,48.542567,0.77,street,Saint Blaise 22170 Plélo,22182_D087,G,SAINT BLAISE,
324447960,00018,32444796000018,O,,,,,,true,1,,,,,LA VILLE GARE,22170,PLELO,,,22182,,,,,,,,,,,,,,,,,,,1984-12-25,F,,,,,82.06,NAP,N,-2.971516,48.591885,0.95,street,La Ville Gare 22170 Plélo,22182_D226,G,LA VILLE GARE,
324723303,00057,32472330300057,O,1993-08-01,NN,,,2008-11-04T21:34:54,true,4,,,,,LA GUERCHE,22170,PLELO,,,22182,,,,,,,,,,,,,,,,,,,2008-10-31,F,,,,,49.41A,NAFRev2,N,-2.943638,48.526974,0.95,street,La Guerche 22170 Plélo,22182_1x4jbc,G,LA GUERCHE,
324777374,00012,32477737400012,O,,,,,,true,1,,,,,LES FONTAINES,22170,PLELO,,,22182,,,,,,,,,,,,,,,,,,,1984-12-25,F,,,,,64.44,NAP,N,-2.953969,48.575586,0.95,street,Les Fontaines 22170 Plélo,22182_49jkj1,G,LES FONTAINES,
324792928,00016,32479292800016,O,1982-04-05,NN,,,2006-10-27T01:30:53,true,3,,,,LD,LA VILLE RICHARD,22170,PLELO,,,22182,,,,,,,,,,,,,,,,,,,2005-06-30,F,,,,,70.2C,NAFRev1,N,-2.964658,48.544685,0.94,street,Rue de La Ville Richard 22170 Plélo,22182_0314,G,RUE DE LA VILLE RICHARD,
324813955,00014,32481395500014,O,1982-05-01,NN,,,2021-10-27T08:24:13,true,4,,,,,LA VILLE URVOY,22170,PLELO,,,22182,,,,,,,,,,,,,,,,,,,2012-12-31,A,,,,,01.41Z,NAFRev2,O,-2.949323,48.570122,0.95,street,La Ville Urvoy 22170 Plélo,22182_D249,G,LA VILLE URVOY,
324813963,00018,32481396300018,O,1982-07-01,NN,,,2008-01-04T19:00:41,true,3,,,,,VILLE AU BALLU,22170,PLELO,,,22182,,,,,,,,,,,,,,,,,,,2008-01-01,A,,,,,01.50Z,NAFRev2,N,-2.933452,48.526247,0.88,street,La Ville au Ballue 22170 Plélo,22182_D203,G,LA VILLE AU BALLUE,
324822477,00018,32482247700018,O,,,,,,true,1,,7,,RUE,DES QUATRE VENTS,22170,PLELO,,,22182,,,,,,,,,,,,,,,,,,,1987-12-31,F,,,,,55.60,NAP,N,-2.951772,48.557462,0.95,housenumber,7 Rue des Quatre Vents 22170 Plélo,22182_0245_00007,G,7 RUE DES QUATRE VENTS,
325229672,00010,32522967200010,O,1982-09-01,01,2021,,2023-11-30T10:23:31,true,3,,,,,LA SAUDRE,22170,PLELO,,,22182,,,,,,,,,,,,,,,,,,,2008-01-01,A,,,,,01.41Z,NAFRev2,N,-2.921553,48.56814,0.95,street,La Saudre 22170 Plélo,22182_85n12i,G,LA SAUDRE,