siren,nic,siret,statutDiffusionEtablissement,dateCreationEtablissement,trancheEffectifsEtablissement,anneeEffectifsEtablissement,activitePrincipaleRegistreMetiersEtablissement,dateDernierTraitementEtablissement,etablissementSiege,nombrePeriodesEtablissement,complementAdresseEtablissement,numeroVoieEtablissement,indiceRepetitionEtablissement,dernierNumeroVoieEtablissement,indiceRepetitionDernierNumeroVoieEtablissement,typeVoieEtablissement,libelleVoieEtablissement,codePostalEtablissement,libelleCommuneEtablissement,libelleCommuneEtrangerEtablissement,distributionSpecialeEtablissement,codeCommuneEtablissement,codeCedexEtablissement,libelleCedexEtablissement,codePaysEtrangerEtablissement,libellePaysEtrangerEtablissement,identifiantAdresseEtablissement,coordonneeLambertAbscisseEtablissement,coordonneeLambertOrdonneeEtablissement,complementAdresse2Etablissement,numeroVoie2Etablissement,indiceRepetition2Etablissement,typeVoie2Etablissement,libelleVoie2Etablissement,codePostal2Etablissement,libelleCommune2Etablissement,libelleCommuneEtranger2Etablissement,distributionSpeciale2Etablissement,codeCommune2Etablissement,codeCedex2Etablissement,libelleCedex2Etablissement,codePaysEtranger2Etablissement,libellePaysEtranger2Etablissement,dateDebut,etatAdministratifEtablissement,enseigne1Etablissement,enseigne2Etablissement,enseigne3Etablissement,denominationUsuelleEtablissement,activitePrincipaleEtablissement,nomenclatureActivitePrincipaleEtablissement,caractereEmployeurEtablissement,longitude,latitude,geo_score,geo_type,geo_adresse,geo_id,geo_ligne,geo_l4,geo_l5
213305113,00010,21330511300010,O,1983-03-01,02,2021,,2024-03-22T15:40:57,true,3,,,,,,,,33690,SENDETS,,,33511,,,,,,,,,,,,,,,,,,,,,,2008-01-01,A,MAIRIE,,,,84.11Z,NAFRev2,O,,,0,,,,,,
213305113,00028,21330511300028,O,2000-09-22,,,,2024-03-22T15:40:57,false,4,,,,,,,MAIRIE,33690,SENDETS,,,33511,,,,,,,,,,,,,,,,,,,,,,2008-01-01,A,LOGEMENTS SOCIAUX,,,,68.20A,NAFRev2,N,-0.086102,44.427464,0.37,street,Laprie 33690 Sendets,33511_3bqjrk,G,LAPRIE,
263304990,00017,26330499000017,O,1983-03-01,,,,2024-03-22T15:40:57,true,3,,,,,,,,33690,SENDETS,,,33511,,,,,,,,,,,,,,,,,,,,,,2008-01-01,A,CCAS,,,,88.99B,NAFRev2,N,,,0,,,,,,
305527913,00027,30552791300027,O,1900-01-01,,,,2024-03-22T15:40:57,true,5,,,,,,,HITTONS,33690,SENDETS,,,33511,,,,,,,,,,,,,,,,,,,,,,2010-08-31,F,,,,,43.32A,NAFRev2,O,-0.087648,44.437612,0.46,street,Mitton 33690 Sendets,33511_4pfen3,G,MITTON,
309602126,00042,30960212600042,O,2004-01-01,,,,2024-03-30T04:46:26,true,4,,,,,,,BACQUERISSE,33690,SENDETS,,,33511,,,,,33511B001_C,,,,,,,,,,,,,,,,,2016-12-25,F,,,,,85.59A,NAFRev2,N,-0.108912,44.430112,0.92,street,Lieu Dit Bacquerisse 33690 Sendets,33511_1tsyty,G,LIEU DIT BACQUERISSE,
311742431,00035,31174243100035,O,1900-01-01,,,,2024-03-30T08:04:12,true,3,,1,,,,,CHICOT,33690,SENDETS,,,33511,,,,,33511col8_B,452787.119274091,6376178.587188199,,,,,,,,,,,,,,,1996-06-30,A,,,,,02.10Z,NAFRev2,N,-0.107042,44.440877,0.93,housenumber,1 Chicot 33690 Sendets,33511_col8bt_00001,G,1 CHICOT,
314012394,00065,31401239400065,O,2008-01-06,,,,2024-03-30T04:31:47,true,2,,3,,,,,LA HARGUE-OUEST,33690,SENDETS,,,33511,,,,,33511B022_B,453408.40709554753,6375120.692800552,,,,,,,,,,,,,,,2010-09-30,F,LA GRANGE,,,,56.10A,NAFRev2,N,-0.099135,44.431464,0.94,housenumber,3 La Hargue-Ouest 33690 Sendets,33511_b022_00003,G,3 LA HARGUE OUEST,
315716936,00028,31571693600028,O,,,,,2024-03-22T15:40:57,true,1,,,,,,LD,AU MEOU,33690,SENDETS,,,33511,,,,,,,,,,,,,,,,,,,,,,1993-08-24,F,,,,,28.5D,NAF1993,N,-0.097201,44.425666,0.94,street,Au Meou 33690 Sendets,33511_mjpynp,G,AU MEOU,
316426469,00045,31642646900045,O,2016-04-10,,,,2024-03-30T00:06:03,true,1,,2,,,,LIEU DIT,CHARREOU,33690,SENDETS,,,33511,,,,,335116iue_B,455150.32983131806,6375562.265450157,,,,,,,,,,,,,,,2016-04-10,A,,,,,01.49Z,NAFRev2,N,-0.077069,44.436166,0.94,housenumber,2 Lieu Dit Charreou 33690 Sendets,33511_6iueif_00002,G,2 LIEU DIT CHARREOU,
323762054,00043,32376205400043,O,2009-07-01,,,,2024-03-30T19:05:06,true,2,,1,,,,,AU PARRE,33690,SENDETS,,,33511,,,,,33511B044_C,,,,,,,,,,,,,,,,,2021-12-31,F,,,,,47.89Z,NAFRev2,N,-0.102986,44.425943,0.59,housenumber,1 Le Parre 33690 Sendets,33511_6sdbzr_00001,G,1 LE PARRE,
325595684,00029,32559568400029,O,2007-09-18,,,,2024-03-22T15:40:57,true,3,,5,,,,RUE,MITTON,33690,SENDETS,,,33511,,,,,,,,,,,,,,,,,,,,,,2008-06-23,F,,,,,01.13Z,NAFRev2,N,-0.08787,44.43837,0.58,housenumber,5 Lieu Dit Mitton Ouest 33690 Sendets,33511_b039_00005,G,5 LIEU DIT MITTON OUEST,
327052122,00014,32705212200014,O,,,,,2024-03-22T15:40:57,true,1,,,,,,LD,AU BOURG,33690,SENDETS,,,33511,,,,,,,,,,,,,,,,,,,,,,1990-12-31,F,,,,,57.02,NAP,N,-0.088603,44.422981,0.62,street,Le Bourg 33690 Sendets,33511_fcz7n2,G,LE BOURG,
327982146,00026,32798214600026,O,2009-03-01,,,,2024-03-30T08:20:38,false,3,,,,,,LIEU DIT,PUZOS,33690,SENDETS,,,33511,,,,,33511tkzthv_B,455225.71836267144,6374988.90285093,,,,,,,,,,,,,,,2010-08-31,F,TOITURE SERVICES,,,,43.91B,NAFRev2,N,-0.075842,44.431035,0.94,street,Lieu Dit Puzos 33690 Sendets,33511_tkzthv,G,LIEU DIT PUZOS,
327982146,00034,32798214600034,O,2010-09-01,,,,2024-03-30T08:20:38,true,2,SENDETS,2,,,,LIEU DIT,PUZOS,33690,SENDETS,,,33511,,,,,33511tkzt_B,455302.8367229871,6374870.501119018,,,,,,,,,,,,,,,2014-06-10,F,,,,,95.29Z,NAFRev2,N,-0.074816,44.429997,0.94,housenumber,2 Lieu Dit Puzos 33690 Sendets,33511_tkzthv_00002,G,2 LIEU DIT PUZOS,
328303078,00039,32830307800039,O,1987-12-31,,,,2024-03-30T05:48:38,false,4,,,,,,,ROUZET,33690,SENDETS,,,33511,,,,,33511B051_C,,,,,,,,,,,,,,,,,2008-03-31,F,,,,,01.21Z,NAFRev2,N,-0.08206,44.426241,0.91,street,Lieu Dit Rouzet 33690 Sendets,33511_5xodzf,G,LIEU DIT ROUZET,
329382600,00099,32938260000099,O,2011-10-01,,,,2024-03-22T15:40:57,false,2,QUARTIER LE MITTON,,,,,,,33690,SENDETS,,,33511,,,,,,,,,,,,,,,,,,,,,,2015-07-01,F,,,,,47.78B,NAFRev2,N,-0.087648,44.437612,0.42,street,Mitton 33690 Sendets,33511_4pfen3,D,MITTON,
329954234,00012,32995423400012,O,1900-01-01,,,,2024-03-30T01:16:14,true,6,SANS,,,,,LIEU DIT,SANS,33690,SENDETS,,,33511,,,,,335114xtxdp_B,453209.9872084565,6373231.080960667,,,,,,,,,,,,,,,2021-01-01,A,,,,,02.10Z,NAFRev2,N,-0.100279,44.414514,0.94,street,Lieu Dit Sans 33690 Sendets,33511_4xtxdp,G,LIEU DIT SANS,
331026583,00012,33102658300012,O,,,,,2024-03-30T02:08:17,true,1,,,,,,LIEU DIT,MONON,33690,SENDETS,,,33511,,,,,335114w4c0a_B,454748.41789046733,6375403.630116367,,,,,,,,,,,,,,,1995-03-10,F,,,,,02.0B,NAF1993,N,-0.082037,44.434598,0.94,street,Lieu Dit Monon 33690 Sendets,33511_4w4c0a,G,LIEU DIT MONON,
331814210,00034,33181421000034,O,2022-11-01,,,,2024-03-30T09:12:22,true,1,,2,,,,,AU MAGISTER,33690,SENDETS,,,33511,,,,,33511uirn_B,453610.84047721094,6375441.931716718,,,,,,,,,,,,,,,2022-11-01,A,ATELIERS GRAPHIQUES DE L'ARDOISIERE,,,,18.13Z,NAFRev2,O,-0.096337,44.434542,0.94,housenumber,2 Au Magister 33690 Sendets,33511_uirntz_00002,G,2 AU MAGISTER,
337743025,00047,33774302500047,O,2017-11-01,,,,2024-03-30T13:18:15,true,2,,4,,,,,CHARREOU,33690,SENDETS,,,33511,,,,,33511B014_C,,,,,,,,,,,,,,,,,2018-12-31,F,,,,,46.49Z,NAFRev2,N,-0.077142,44.436261,0.84,housenumber,4 Lieu Dit Charreou 33690 Sendets,33511_6iueif_00004,G,4 LIEU DIT CHARREOU,
340116003,00013,34011600300013,O,1900-01-01,,,,2024-03-22T15:40:57,true,4,,2,,,,,MOUNON,33690,SENDETS,,,33511,,,,,,,,,,,,,,,,,,,,,,2010-06-15,A,,,,,95.29Z,NAFRev2,N,-0.082999,44.434412,0.51,housenumber,2 Lieu Dit Monon 33690 Sendets,33511_4w4c0a_00002,G,2 LIEU DIT MONON,
343708889,00039,34370888900039,O,1997-05-02,,,,2024-03-22T15:40:57,false,3,,7,,,,,MITTON OUEST,33690,SENDETS,,,33511,,,,,,,,,,,,,,,,,,,,,,2005-09-01,F,,,,,45.3C,NAFRev1,N,-0.08769,44.438074,0.87,housenumber,7 Lieu Dit Mitton Ouest 33690 Sendets,33511_b039_00007,G,7 LIEU DIT MITTON OUEST,
348486119,00020,34848611900020,O,1991-09-13,,,,2024-03-22T15:40:57,true,3,,3,,,,,MITTON OUEST,33690,SENDETS,,,33511,,,,,,,,,,,,,,,,,,,,,,1992-01-01,F,,,,,92.3H,NAF1993,N,-0.087998,44.438508,0.87,housenumber,3 Lieu Dit Mitton Ouest 33690 Sendets,33511_b039_00003,G,3 LIEU DIT MITTON OUEST,
348989427,00045,34898942700045,P,2014-05-10,,,,2024-03-22T15:40:57,false,2,[ND],[ND],[ND],[ND],[ND],[ND],[ND],[ND],SENDETS,,[ND],33511,[ND],[ND],,,[ND],[ND],[ND],[ND],[ND],[ND],[ND],[ND],[ND],,,[ND],,[ND],[ND],,,2020-07-28,F,[ND],[ND],[ND],[ND],56.10C,NAFRev2,N,,,0,,,,,,
349134007,00054,34913400700054,O,2014-03-03,,,,2024-03-30T15:12:59,true,3,,1,,,,,LAULLIEYRON,33690,SENDETS,,,33511,,,,,33511B030_C,,,,,,,,,,,,,,,,,2018-01-15,A,,,,,56.21Z,NAFRev2,N,-0.093639,44.421937,0.92,housenumber,1 Lieu Dit Laullieyron 33690 Sendets,33511_axmnc3_00001,G,1 LIEU DIT LAULLIEYRON,
349810648,00023,34981064800023,O,1900-01-01,,,,2024-03-22T15:40:57,false,3,,,,,,,PARADIS DES OISEAUX,33690,SENDETS,,,33511,,,,,,,,,,,,,,,,,,,,,,1994-12-31,F,,,,,01.2G,NAF1993,N,6.231725,49.4314463,0.89,poi.information,Le paradis des oiseaux (Informations) Cattenom,https://osm.org/node/4907922516,G,,
350373643,00021,35037364300021,O,,,,,2024-03-22T15:40:57,true,1,,,,,,,BOURG,33690,SENDETS,,,33511,,,,,,,,,,,,,,,,,,,,,,1989-08-31,F,,,,,85.01,NAP,N,-0.088603,44.422981,0.93,street,Le Bourg 33690 Sendets,33511_fcz7n2,G,LE BOURG,
350720629,00020,35072062900020,O,1994-10-01,,,,2024-03-30T09:56:39,false,4,,,,,,LIEU DIT,CACHAOU,33690,SENDETS,,,33511,,,,,33511angxz8_B,453628.17484659964,6374738.52551834,,,,,,,,,,,,,,,2008-10-20,F,,,,,96.02A,NAFRev2,N,-0.095773,44.428221,0.94,street,Lieu Dit Cachaou 33690 Sendets,33511_angxz8,G,LIEU DIT CACHAOU,
350720629,00038,35072062900038,O,2008-10-20,,,9602AB,2024-03-22T15:40:57,true,1,,4,,,,LD,MEOU,33690,SENDETS,,,33511,,,,,,,,,,,,,,,,,,,,,,2008-10-20,A,,,,,96.02A,NAFRev2,N,-0.097558,44.425453,0.79,housenumber,4 Au Meou 33690 Sendets,33511_mjpynp_00004,G,4 AU MEOU,
350720629,00046,35072062900046,O,2022-05-20,,,,2024-03-30T09:56:43,false,1,,1,,,,LIEU DIT,GLERE,33690,SENDETS,,,33511,,,,,33511mymo_B,453545.3769454203,6374307.418807474,,,,,,,,,,,,,,,2022-05-20,A,,,,,68.20A,NAFRev2,N,-0.0966,44.424314,0.94,housenumber,1 Lieu Dit Glere 33690 Sendets,33511_mymoaa_00001,G,1 LIEU DIT GLERE,
352364533,00013,35236453300013,O,1989-10-01,,,,2024-03-30T04:31:14,true,5,,,,,,LIEU DIT,MITTON EST,33690,SENDETS,,,33511,,,,,33511B038_B,454388.4981086742,6375783.564556612,,,,,,,,,,,,,,,2011-09-30,F,,,,,47.78B,NAFRev2,O,-0.086742,44.437889,0.94,street,Lieu Dit Mitton Est 33690 Sendets,33511_B038,G,LIEU DIT MITTON EST,
352636948,00023,35263694800023,O,1991-05-01,,,,2024-03-22T15:40:57,true,1,,,,,,LD,A BIDEAU N 1,33690,SENDETS,,,33511,,,,,,,,,,,,,,,,,,,,,,1999-08-31,F,,,,,55.5D,NAF1993,N,,,0,,,,,,
379280571,00017,37928057100017,O,1990-08-06,,,,2024-03-22T15:40:57,true,4,,,,,,LD,ROUZET,33690,SENDETS,,,33511,,,,,,,,,,,,,,,,,,,,,,2016-09-30,F,,,,,46.11Z,NAFRev2,N,-0.08206,44.426241,0.91,street,Lieu Dit Rouzet 33690 Sendets,33511_5xodzf,G,LIEU DIT ROUZET,
382368017,00051,38236801700051,O,2003-11-20,,,4332BB,2024-03-30T11:34:30,false,9,,5,,,,LIEU DIT,MITTON EST,33690,SENDETS,,,33511,,,,,33511b038_B,454368.4985604744,6375781.34513857,,,,,,,,,,,,,,,2017-05-26,F,,,,AB SERRURERIE MENUISERIES,43.32B,NAFRev2,N,-0.086992,44.437862,0.94,housenumber,5 Lieu Dit Mitton Est 33690 Sendets,33511_b038_00005,G,5 LIEU DIT MITTON EST,
382368017,00069,38236801700069,O,2008-06-24,,,,2024-03-22T15:40:57,false,2,,5,,,,,MITTON,33690,SENDETS,,,33511,,,,,,,,,,,,,,,,,,,,,,2011-06-16,F,,,,,01.13Z,NAFRev2,N,-0.08787,44.43837,0.82,housenumber,5 Lieu Dit Mitton Ouest 33690 Sendets,33511_b039_00005,G,5 LIEU DIT MITTON OUEST,
383821956,00018,38382195600018,O,1991-01-01,,,,2024-03-22T15:40:57,true,4,,,,,,,,33690,SENDETS,,,33511,,,,,,,,,,,,,,,,,,,,,,2004-08-31,F,,,,,01.2A,NAFRev1,N,,,0,,,,,,
385005426,00023,38500542600023,O,2003-10-01,,,1039BP,2024-03-22T15:40:57,true,8,,4,,,,HAM,DE RIPPES,33690,SENDETS,,,33511,,,,,,,,,,,,,,,,,,,,,,2020-04-15,A,TARTINES ET CONFITURES,,,TARTINES ET CONFITURES,10.39B,NAFRev2,N,-0.10007,44.420804,0.63,housenumber,4 Lieu Dit Rippes 33690 Sendets,33511_i8n35t_00004,G,4 LIEU DIT RIPPES,
387615255,00016,38761525500016,O,1992-05-04,,,,2024-03-22T15:40:57,true,1,,,,,,LD,LE BOURG,33690,SENDETS,,,33511,,,,,,,,,,,,,,,,,,,,,,1998-03-13,F,,,,,45.4C,NAF1993,N,-0.088603,44.422981,0.95,street,Le Bourg 33690 Sendets,33511_fcz7n2,G,LE BOURG,
387751407,00025,38775140700025,O,1998-10-01,,,,2024-03-22T15:40:57,false,4,,,,,,LD,LA HARGUE,33690,SENDETS,,,33511,,,,,,,,,,,,,,,,,,,,,,2003-02-01,F,CHEZ DEDEE,,,,55.5D,NAFRev1,N,-0.097874,44.431355,0.94,street,la Hargue 33690 Sendets,33511_r0jx4k,G,LA HARGUE,
387751407,00033,38775140700033,O,2003-02-01,,,,2024-03-30T07:16:44,true,3,,,,,,,LA HARGUE,33690,SENDETS,,,33511,,,,,33511r0jx4k_B,453474.71128006285,6375092.964664105,,,,,,,,,,,,,,,2008-01-01,A,,,,,01.47Z,NAFRev2,N,-0.097874,44.431355,0.94,street,la Hargue 33690 Sendets,33511_r0jx4k,G,LA HARGUE,
391961406,00017,39196140600017,O,1993-07-02,,,,2024-03-22T15:40:57,false,5,,3,,,,,MITTON OUEST,33690,SENDETS,,,33511,,,,,,,,,,,,,,,,,,,,,,2005-01-01,F,,,,,70.2C,NAFRev1,O,-0.087998,44.438508,0.87,housenumber,3 Lieu Dit Mitton Ouest 33690 Sendets,33511_b039_00003,G,3 LIEU DIT MITTON OUEST,
392985305,00011,39298530500011,O,1900-01-01,,,,2024-03-30T06:31:15,false,3,,1,,,,LIEU DIT,BAUYHAOU,33690,SENDETS,,,33511,,,,,3351194ei_B,454395.63368116063,6374890.56944716,,,,,,,,,,,,,,,1994-08-31,F,,,,,60.2E,NAF1993,N,-0.086214,44.429859,0.94,housenumber,1 Lieu Dit Bauyhaou 33690 Sendets,33511_94ei4z_00001,G,1 LIEU DIT BAUYHAOU,
393699293,00014,39369929300014,O,1994-01-01,,,,2024-03-22T15:40:57,true,4,,,,,,,,33690,SENDETS,,,33511,,,,,,,,,,,,,,,,,,,,,,2018-12-31,F,,,,,01.19Z,NAFRev2,N,,,0,,,,,,
394036172,00010,39403617200010,O,,,,,2024-03-30T05:53:24,true,1,,,,,,LIEU DIT,LARRAT,33690,SENDETS,,,33511,,,,,33511xb9bjm_B,453940.1606038611,6373121.950279946,,,,,,,,,,,,,,,1996-09-30,F,,,,,01.2C,NAF1993,N,-0.091062,44.41379,0.94,street,Lieu Dit Larrat 33690 Sendets,33511_xb9bjm,G,LIEU DIT LARRAT,
394594162,00015,39459416200015,O,1993-01-01,,,,2024-03-30T12:21:58,true,1,,,,,,,MITTON,33690,SENDETS,,,33511,,,,,335114pfen3_B,454315.24166091054,6375755.635353101,,,,,,,,,,,,,,,1998-01-20,F,,,,,01.1A,NAF1993,N,-0.087648,44.437612,0.94,street,Mitton 33690 Sendets,33511_4pfen3,G,MITTON,
395162621,00019,39516262100019,O,1993-01-01,,,,2024-03-22T15:40:57,true,3,,,,,,LD,LA ROUGUE,33690,SENDETS,,,33511,,,,,,,,,,,,,,,,,,,,,,1998-12-25,F,,,,,02.0A,NAF1993,N,-0.080033,44.429827,0.94,street,La Rougue 33690 Sendets,33511_v0eoy5,G,LA ROUGUE,
395390404,00014,39539040400014,O,1993-01-01,,,,2024-03-22T15:40:57,true,3,MOYE,,,,,,,33690,SENDETS,,,33511,,,,,,,,,,,,,,,,,,,,,,2008-01-01,A,,,,,01.21Z,NAFRev2,N,-0.08195,44.426966,0.5,street,À Joye 33690 Sendets,33511_ht0i4a,D,A JOYE,
400025318,00017,40002531800017,O,1995-01-01,,,,2024-03-22T15:40:57,true,4,,,,,,,LE ROUGUE,33690,SENDETS,,,33511,,,,,,,,,,,,,,,,,,,,,,2019-06-30,F,,,,,01.47Z,NAFRev2,N,-0.080033,44.429827,0.65,street,La Rougue 33690 Sendets,33511_v0eoy5,G,LA ROUGUE,
401242714,00020,40124271400020,O,1998-04-01,,,,2024-03-30T17:03:58,true,1,,,,,,LIEU DIT,RIPPES,33690,SENDETS,,,33511,,,,,33511i8n35t_B,453293.792818857,6373956.869299431,,,,,,,,,,,,,,,1998-06-15,F,,,,,60.2L,NAF1993,N,-0.099585,44.421072,0.94,street,Lieu Dit Rippes 33690 Sendets,33511_i8n35t,G,LIEU DIT RIPPES,
411067564,00012,41106756400012,O,1986-05-01,,,,2024-03-22T15:40:57,true,3,,,,,,,BERDON,33690,SENDETS,,,33511,,,,,,,,,,,,,,,,,,,,,,2008-01-01,A,,,,,01.47Z,NAFRev2,N,-0.106037,44.416541,0.91,street,Lieu Dit Berdon 33690 Sendets,33511_4sshst,G,LIEU DIT BERDON,
411614035,00011,41161403500011,O,1996-01-01,,,,2024-03-30T15:06:07,true,3,,1,,,,,LA RIVIERE,33690,SENDETS,,,33511,,,,,33511ecql_B,453394.81677878514,6374470.19413684,,,,,,,,,,,,,,,2008-01-01,A,,,,,01.42Z,NAFRev2,N,-0.09857,44.425725,0.94,housenumber,1 La Riviere 33690 Sendets,33511_ecqlrz_00001,G,1 LA RIVIERE,
412748279,00012,41274827900012,O,1987-12-31,,,,2024-03-22T15:40:57,false,4,,,,,,,BACANISSE,33690,SENDETS,,,33511,,,,,,,,,,,,,,,,,,,,,,2009-12-31,F,,,,,01.11Z,NAFRev2,N,,,0,,,,,,
412748279,00038,41274827900038,O,2009-08-20,,,,2024-03-30T08:15:32,true,2,,,,,,,BACQUERISSE,33690,SENDETS,,,33511,,,,,33511B001_C,,,,,,,,,,,,,,,,,2016-09-19,F,,,,,01.61Z,NAFRev2,N,-0.108912,44.430112,0.92,street,Lieu Dit Bacquerisse 33690 Sendets,33511_1tsyty,G,LIEU DIT BACQUERISSE,
412751711,00018,41275171100018,O,1987-12-31,,,,2024-03-22T15:40:57,true,3,,,,,,,RIPPES,33690,SENDETS,,,33511,,,,,,,,,,,,,,,,,,,,,,2005-05-01,F,,,,,01.1A,NAFRev1,N,-0.099585,44.421072,0.92,street,Lieu Dit Rippes 33690 Sendets,33511_i8n35t,G,LIEU DIT RIPPES,
412752644,00010,41275264400010,O,1995-01-01,,,,2024-03-22T15:40:57,true,3,,,,,,,BASQUERINE,33690,SENDETS,,,33511,,,,,,,,,,,,,,,,,,,,,,2008-01-01,A,,,,,01.21Z,NAFRev2,N,,,0,,,,,,
412754913,00017,41275491300017,O,1996-11-01,,,,2024-03-22T15:40:57,false,3,,,,,,,LARRAT,33690,SENDETS,,,33511,,,,,,,,,,,,,,,,,,,,,,1997-12-31,F,,,,,01.2C,NAF1993,N,-0.091062,44.41379,0.91,street,Lieu Dit Larrat 33690 Sendets,33511_xb9bjm,G,LIEU DIT LARRAT,
417613924,00022,41761392400022,O,2005-09-26,,,,2024-03-29T22:32:58,true,3,,,,,,,AU MAGISTER,33690,SENDETS,,,33511,,,,,33511uirn_B,453610.84047721094,6375441.931716718,,,,,,,,,,,,,,,2010-12-31,F,,,,,93.29Z,NAFRev2,N,-0.095125,44.434508,0.94,street,Au Magister 33690 Sendets,33511_uirntz,G,AU MAGISTER,
420000465,00013,42000046500013,O,,,,,2024-03-22T15:40:57,true,1,,,,,,,LARRAT,33690,SENDETS,,,33511,,,,,,,,,,,,,,,,,,,,,,1996-08-01,F,,,,,01.2C,NAF1993,N,-0.091062,44.41379,0.91,street,Lieu Dit Larrat 33690 Sendets,33511_xb9bjm,G,LIEU DIT LARRAT,
421654518,00016,42165451800016,O,1999-02-01,,,,2024-03-30T07:22:02,true,1,,,,,,,LA HARGUE,33690,SENDETS,,,33511,,,,,33511r0jx4k_B,453474.71128006285,6375092.964664105,,,,,,,,,,,,,,,2001-08-31,F,,,,,55.5D,NAF1993,N,-0.097874,44.431355,0.94,street,la Hargue 33690 Sendets,33511_r0jx4k,G,LA HARGUE,
422892471,00026,42289247100026,O,2010-09-06,,,,2024-03-30T06:26:51,true,2,,,,,,,LE PARRE,33690,SENDETS,,,33511,,,,,335116sdbzr_B,452992.7902770735,6374489.993329135,,,,,,,,,,,,,,,2012-12-31,F,,,,,47.82Z,NAFRev2,N,-0.103626,44.425761,0.94,street,Le Parre 33690 Sendets,33511_6sdbzr,G,LE PARRE,
423260751,00031,42326075100031,O,2005-04-01,,,,2024-03-22T15:40:57,false,2,,,,,,LD,LA VIGNE,33690,SENDETS,,,33511,,,,,,,,,,,,,,,,,,,,,,2006-01-31,F,,,,,45.2B,NAFRev1,O,-0.081711,44.419681,0.64,street,Lavigne 33690 Sendets,33511_9tpyya,G,LAVIGNE,
423806967,00018,42380696700018,O,1999-07-01,,,,2024-03-30T17:22:41,true,3,,,,,,LIEU DIT,BASSANE,33690,SENDETS,,,33511,,,,,335111ciwc6_B,455409.763940287,6375681.003956687,,,,,,,,,,,,,,,2008-01-01,A,,,,,01.42Z,NAFRev2,N,-0.07387,44.437325,0.94,street,Lieu Dit Bassane 33690 Sendets,33511_1ciwc6,G,LIEU DIT BASSANE,
423829001,00019,42382900100019,O,1999-07-16,,,,2024-03-22T15:40:57,true,4,CHEZ MME MORLANS DELPHINE,4,,,,,RIPPES,33690,SENDETS,,,33511,,,,,,,,,,,,,,,,,,,,,,2008-01-01,A,,,,,61.90Z,NAFRev2,N,-0.10007,44.420804,0.82,housenumber,4 Lieu Dit Rippes 33690 Sendets,33511_i8n35t_00004,G,4 LIEU DIT RIPPES,
425301785,00019,42530178500019,O,1974-01-01,,,,2024-03-22T15:40:57,true,4,,,,,,,GLAIRE,33690,SENDETS,,,33511,,,,,,,,,,,,,,,,,,,,,,2015-07-03,F,,,,,01.21Z,NAFRev2,N,-0.097478,44.423973,0.38,street,Lieu Dit Glere 33690 Sendets,33511_mymoaa,G,LIEU DIT GLERE,
428884563,00043,42888456300043,O,2010-03-30,,,,2024-03-30T12:46:16,true,2,,,,,,,LAVIGNE,33690,SENDETS,,,33511,,,,,335119tpyya_B,454709.6898810805,6373746.779395013,,,,,,,,,,,,,,,2011-07-26,F,,,,,47.89Z,NAFRev2,N,-0.081711,44.419681,0.94,street,Lavigne 33690 Sendets,33511_9tpyya,G,LAVIGNE,
430086546,00024,43008654600024,O,2021-01-15,,,4334ZC,2024-03-30T09:36:32,true,1,,2,,,,,LAULLIEYRON,33690,SENDETS,,,33511,,,,,33511B030_C,,,,,,,,,,,,,,,,,2021-01-15,A,,,,ENTREPRISE JOLO,43.34Z,NAFRev2,O,-0.091523,44.422168,0.92,housenumber,2 Lieu Dit Laullieyron 33690 Sendets,33511_axmnc3_00002,G,2 LIEU DIT LAULLIEYRON,
430564989,00019,43056498900019,O,1991-01-01,,,,2024-03-30T15:17:16,true,3,,,,,,,LE BOURG,33690,SENDETS,,,33511,,,,,33511fcz7n2_B,454175.73272069654,6374134.52378557,,,,,,,,,,,,,,,2008-01-01,A,,,,,02.40Z,NAFRev2,N,-0.088603,44.422981,0.95,street,Le Bourg 33690 Sendets,33511_fcz7n2,G,LE BOURG,
431266253,00019,43126625300019,O,1999-01-01,,,,2024-03-30T03:56:12,true,3,,,,,,LIEU DIT,BACQUERISSE,33690,SENDETS,,,33511,,,,,335111tsyty_B,452591.3377482166,6374989.512103324,,,,,,,,,,,,,,,2008-01-01,A,,,,,01.21Z,NAFRev2,N,-0.108912,44.430112,0.94,street,Lieu Dit Bacquerisse 33690 Sendets,33511_1tsyty,G,LIEU DIT BACQUERISSE,
433949344,00017,43394934400017,O,2001-01-01,,,,2024-03-30T15:49:18,true,6,,7,,,,,LE BOURG,33690,SENDETS,,,33511,,,,,33511fcz7_B,454172.0177747518,6374151.567506886,,,,,,,,,,,,,,,2011-12-31,F,,,,,70.22Z,NAFRev2,N,-0.088658,44.423133,0.95,housenumber,7 Le Bourg 33690 Sendets,33511_fcz7n2_00007,G,7 LE BOURG,
437762727,00075,43776272700075,P,2019-12-28,,,,2024-03-22T15:40:57,true,1,[ND],[ND],[ND],[ND],[ND],[ND],[ND],[ND],SENDETS,,[ND],33511,[ND],[ND],,,[ND],[ND],[ND],[ND],[ND],[ND],[ND],[ND],[ND],,,[ND],,[ND],[ND],,,2019-12-28,A,[ND],[ND],[ND],[ND],71.20B,NAFRev2,N,,,0,,,,,,
439600107,00015,43960010700015,O,2001-10-09,,,,2024-03-30T06:51:22,true,2,,,,,,,AU PARRE,33690,SENDETS,,,33511,,,,,33511B044_C,,,,,,,,,,,,,,,,,2002-08-31,F,,,,,,,,-0.103626,44.425761,0.61,street,Le Parre 33690 Sendets,33511_6sdbzr,G,LE PARRE,
441474921,00018,44147492100018,O,2002-04-02,,,,2024-03-22T15:40:57,false,4,LA SENIA,,,,,,,33690,SENDETS,,,33511,,,,,,,,,,,,,,,,,,,,,,2003-04-18,F,SARL ACTI-BOIS,,,,51.1E,NAFRev1,O,-0.097874,44.431355,0.51,street,la Hargue 33690 Sendets,33511_r0jx4k,D,LA HARGUE,
442321410,00015,44232141000015,O,2002-05-17,,,,2024-03-30T12:55:58,false,4,,,,,,LIEU DIT,GARRACHE,33690,SENDETS,,,33511,,,,,33511vaem32_B,453773.8563433442,6374428.975940565,,,,,,,,,,,,,,,2008-09-01,F,,,,,43.99C,NAFRev2,N,-0.093792,44.425488,0.94,street,Lieu Dit Garrache 33690 Sendets,33511_vaem32,G,LIEU DIT GARRACHE,
443201843,00010,44320184300010,O,2002-07-31,,,,2024-03-22T15:40:57,true,3,,,,,,,LA SENIA,33690,SENDETS,,,33511,,,,,,,,,,,,,,,,,,,,,,2008-01-01,A,,,,,68.20B,NAFRev2,N,-0.097874,44.431355,0.51,street,la Hargue 33690 Sendets,33511_r0jx4k,G,LA HARGUE,
447915646,00031,44791564600031,P,2012-07-09,,,4331ZB,2024-03-30T02:37:26,false,2,[ND],[ND],[ND],[ND],[ND],[ND],[ND],[ND],SENDETS,,[ND],33511,[ND],[ND],,,[ND],[ND],[ND],[ND],[ND],[ND],[ND],[ND],[ND],,,[ND],,[ND],[ND],,,2014-09-30,F,[ND],[ND],[ND],[ND],43.31Z,NAFRev2,N,,,0,,,,,,
450520200,00020,45052020000020,O,2003-11-03,,,,2024-03-30T06:54:37,false,4,,1,,,,,AU MAGISTER,33690,SENDETS,,,33511,,,,,33511uirn_B,453610.84047721094,6375441.931716718,,,,,,,,,,,,,,,2012-10-01,F,,,,,47.78C,NAFRev2,O,-0.096337,44.434542,0.94,housenumber,1 Au Magister 33690 Sendets,33511_uirntz_00001,G,1 AU MAGISTER,
452132509,00012,45213250900012,O,2004-02-10,,,,2024-03-30T17:34:45,true,3,,,,,,,JENDILLET,33690,SENDETS,,,33511,,,,,33511B024_C,,,,,,,,,,,,,,,,,2008-01-01,A,,,,,01.49Z,NAFRev2,N,-0.104251,44.434435,0.91,street,Lieu Dit Jendillet 33690 Sendets,33511_jkh0uh,G,LIEU DIT JENDILLET,
452644529,00011,45264452900011,O,2004-04-09,02,2021,,2024-06-04T12:01:23,true,3,,,,,,,LD JENDILLET RD9,33690,SENDETS,,,33511,,,,,,,,,,,,,,,,,,,,,,2008-01-01,A,,,,,45.32Z,NAFRev2,O,-0.104251,44.434435,0.66,street,Lieu Dit Jendillet 33690 Sendets,33511_jkh0uh,G,LIEU DIT JENDILLET,
453323040,00015,45332304000015,O,2004-04-13,,,,2024-03-22T15:40:57,true,3,,,,,,,A BIDEAU,33690,SENDETS,,,33511,,,,,,,,,,,,,,,,,,,,,,2005-03-31,F,,,,,51.8G,NAFRev1,N,-0.098829,44.410553,0.71,street,Lieu Dit Bideau 33690 Sendets,33511_zjjqbk,G,LIEU DIT BIDEAU,
466200268,00012,46620026800012,O,,,,,2024-03-22T15:40:57,true,1,,,,,,,,33690,SENDETS,,,33511,,,,,,,,,,,,,,,,,,,,,,1984-12-25,F,,,,,00.97,NAP,N,,,0,,,,,,
467110599,00058,46711059900058,O,1995-03-21,,,,2024-03-22T15:40:57,true,3,,3,,,,,MITTON OUEST,33690,SENDETS,,,33511,,,,,,,,,,,,,,,,,,,,,,2005-12-31,F,,,,,51.2E,NAFRev1,N,-0.087998,44.438508,0.87,housenumber,3 Lieu Dit Mitton Ouest 33690 Sendets,33511_b039_00003,G,3 LIEU DIT MITTON OUEST,