siren,nic,siret,statutDiffusionEtablissement,dateCreationEtablissement,trancheEffectifsEtablissement,anneeEffectifsEtablissement,activitePrincipaleRegistreMetiersEtablissement,dateDernierTraitementEtablissement,etablissementSiege,nombrePeriodesEtablissement,complementAdresseEtablissement,numeroVoieEtablissement,indiceRepetitionEtablissement,dernierNumeroVoieEtablissement,indiceRepetitionDernierNumeroVoieEtablissement,typeVoieEtablissement,libelleVoieEtablissement,codePostalEtablissement,libelleCommuneEtablissement,libelleCommuneEtrangerEtablissement,distributionSpecialeEtablissement,codeCommuneEtablissement,codeCedexEtablissement,libelleCedexEtablissement,codePaysEtrangerEtablissement,libellePaysEtrangerEtablissement,identifiantAdresseEtablissement,coordonneeLambertAbscisseEtablissement,coordonneeLambertOrdonneeEtablissement,complementAdresse2Etablissement,numeroVoie2Etablissement,indiceRepetition2Etablissement,typeVoie2Etablissement,libelleVoie2Etablissement,codePostal2Etablissement,libelleCommune2Etablissement,libelleCommuneEtranger2Etablissement,distributionSpeciale2Etablissement,codeCommune2Etablissement,codeCedex2Etablissement,libelleCedex2Etablissement,codePaysEtranger2Etablissement,libellePaysEtranger2Etablissement,dateDebut,etatAdministratifEtablissement,enseigne1Etablissement,enseigne2Etablissement,enseigne3Etablissement,denominationUsuelleEtablissement,activitePrincipaleEtablissement,nomenclatureActivitePrincipaleEtablissement,caractereEmployeurEtablissement,longitude,latitude,geo_score,geo_type,geo_adresse,geo_id,geo_ligne,geo_l4,geo_l5
218001766,00011,21800176600011,O,1983-03-01,02,2021,,2024-03-30T00:06:12,true,4,,3,,,,RUE,DE LA REPUBLIQUE,80800,CERISY,,,80184,,,,,801840055_B,674074.4239501558,6978844.457732523,,,,,,,,,,,,,,,2008-01-01,A,MAIRIE,,,,84.11Z,NAFRev2,O,2.639384,49.907751,0.95,housenumber,3 Rue de la République 80800 Cerisy,80184_0055_00003,G,3 RUE DE LA REPUBLIQUE,
218001766,00029,21800176600029,O,1983-12-21,01,2021,,2024-03-30T00:06:12,false,3,,,,,,RUE,DE LA REPUBLIQUE,80800,CERISY,,,80184,,,,,801840055_B,674042.1030418818,6978662.595514853,,,,,,,,,,,,,,,2008-01-01,A,ECOLE PRIMAIRE PUBLIQUE,,,,85.20Z,NAFRev2,N,2.638946,49.906116,0.95,street,Rue de la République 80800 Cerisy,80184_0055,G,RUE DE LA REPUBLIQUE,
218001766,00037,21800176600037,P,2006-05-30,,,,2024-03-30T00:06:12,false,3,[ND],[ND],[ND],[ND],[ND],[ND],[ND],[ND],CERISY,,[ND],80184,[ND],[ND],,,[ND],[ND],[ND],[ND],[ND],[ND],[ND],[ND],[ND],,,[ND],,[ND],[ND],,,2012-03-27,F,LOTISSEMENT,,,,42.99Z,NAFRev2,N,,,0,,,,,,
258000207,00013,25800020700013,O,1983-03-01,,,,2024-03-22T15:40:57,true,5,MAIRIE,3,,,,RUE,DE LA REPUBLIQUE,80800,CERISY,,,80184,,,,,,,,,,,,,,,,,,,,,,2020-12-31,F,,,,,36.00Z,NAFRev2,O,2.639384,49.907751,0.95,housenumber,3 Rue de la République 80800 Cerisy,80184_0055_00003,G,3 RUE DE LA REPUBLIQUE,
258002948,00010,25800294800010,O,1983-03-01,,,,2024-03-30T13:36:28,false,4,MAIRIE,,,,,RUE,DE LA REPUBLIQUE,80800,CERISY,,,80184,,,,,801840055_B,674042.1030418818,6978662.595514853,,,,,,,,,,,,,,,2003-01-07,F,,,,,75.1C,NAFRev1,O,2.638946,49.906116,0.95,street,Rue de la République 80800 Cerisy,80184_0055,G,RUE DE LA REPUBLIQUE,
258002948,00036,25800294800036,O,2023-11-13,,,,2024-03-30T14:01:44,true,1,,5,,,,RUE,DE LA REPUBLIQUE,80800,CERISY,,,80184,,,,,801840055_B,674077.0236780043,6978815.502363235,,,,,,,,,,,,,,,2023-11-13,A,,,,,84.12Z,NAFRev2,O,2.639422,49.907491,0.95,housenumber,5 Rue de la République 80800 Cerisy,80184_0055_00005,G,5 RUE DE LA REPUBLIQUE,
268002417,00015,26800241700015,O,1983-03-01,,,,2024-03-22T15:40:57,true,4,MAIRIE,3,,,,RUE,DE LA REPUBLIQUE,80800,CERISY,,,80184,,,,,,,,,,,,,,,,,,,,,,2017-12-13,F,CCAS,,,,88.99B,NAFRev2,N,2.639384,49.907751,0.95,housenumber,3 Rue de la République 80800 Cerisy,80184_0055_00003,G,3 RUE DE LA REPUBLIQUE,
298004813,00010,29800481300010,O,1984-05-10,,,,2024-03-22T15:40:57,true,4,,,,,,,,80800,CERISY,,,80184,,,,,,,,,,,,,,,,,,,,,,1992-10-01,F,,,,,70.1C,NAF1993,N,,,0,,,,,,
300980018,00018,30098001800018,O,,,,,2024-03-30T10:44:00,true,1,,,,,,RUE,DU PORT,80800,CERISY,,,80184,,,,,801840070_B,674043.5775127183,6979000.7824186925,,,,,,,,,,,,,,,1988-03-31,F,,,,,67.01,NAP,N,2.638945,49.909154,0.95,street,Rue du Port 80800 Cerisy,80184_0070,G,RUE DU PORT,
305774465,00010,30577446500010,O,,,,,2024-03-30T01:06:55,true,1,,3,,,,RUE,FAIDHERBE,80800,CERISY,,,80184,,,,,801840016_B,674125.500270039,6978804.149091518,,,,,,,,,,,,,,,1989-12-31,F,,,,,55.60,NAP,N,2.640097,49.907391,0.94,housenumber,3 Rue Faidherbe 80800 Cerisy,80184_0016_00003,G,3 RUE FAIDHERBE,
305871352,00012,30587135200012,O,,,,,2024-03-22T15:40:57,true,1,,,,,,,,80800,CERISY,,,80184,,,,,,,,,,,,,,,,,,,,,,1984-12-25,F,,,,,65.06,NAP,N,,,0,,,,,,
305872905,00016,30587290500016,O,,,,,2024-03-22T15:40:57,true,1,,,,,,,,80800,CERISY,,,80184,,,,,,,,,,,,,,,,,,,,,,1984-12-25,F,,,,,55.60,NAP,N,,,0,,,,,,
306670787,00010,30667078700010,O,,,,,2024-03-22T15:40:57,true,1,,,,,,,,80800,CERISY,,,80184,,,,,,,,,,,,,,,,,,,,,,,F,,,,,21.01,NAP,N,,,0,,,,,,
306670928,00010,30667092800010,O,,,,,2024-03-22T15:40:57,true,1,,,,,,,,80800,CERISY,,,80184,,,,,,,,,,,,,,,,,,,,,,1997-03-31,F,,,,,50.2Z,NAF1993,O,,,0,,,,,,
306770124,00015,30677012400015,O,,,,,2024-03-30T03:45:25,true,1,,,,,,RUE,DE LA REPUBLIQUE,80800,CERISY,,,80184,,,,,801840055_B,674042.1030418818,6978662.595514853,,,,,,,,,,,,,,,1989-06-30,F,,,,,62.41,NAP,N,2.638946,49.906116,0.95,street,Rue de la République 80800 Cerisy,80184_0055,G,RUE DE LA REPUBLIQUE,
307170894,00017,30717089400017,O,1964-01-01,,,,2024-03-30T06:46:47,true,1,,,,,,RUE,GAMBETTA,80800,CERISY,,,80184,,,,,801840030_B,673976.4841825824,6978981.051757759,,,,,,,,,,,,,,,2002-12-31,F,,,,,15.8C,NAF1993,N,2.638013,49.908974,0.95,street,Rue Gambetta 80800 Cerisy,80184_0030,G,RUE GAMBETTA,
307371070,00011,30737107000011,O,,,,,2024-03-22T15:40:57,true,1,,,,,,,,80800,CERISY,,,80184,,,,,,,,,,,,,,,,,,,,,,1984-12-25,F,,,,,67.13,NAP,N,,,0,,,,,,
309417723,00017,30941772300017,O,,,,,2024-03-30T12:07:50,true,1,,,,,,RUE,DE SAILLY,80800,CERISY,,,80184,,,,,801840052_B,673835.1788787263,6978458.0471972115,,,,,,,,,,,,,,,1984-12-25,F,,,,,67.05,NAP,N,2.636081,49.90427,0.95,street,Rue de Sailly 80800 Cerisy,80184_0052,G,RUE DE SAILLY,
312776230,00020,31277623000020,O,1983-06-01,,,,2024-03-30T02:07:10,false,4,,6,,,,RUE,DE MORCOURT,80800,CERISY,,,80184,,,,,801840060_B,674153.0032535458,6978607.54226774,,,,,,,,,,,,,,,2001-07-01,F,,,,,45.2V,NAF1993,N,2.640492,49.905626,0.95,housenumber,6 Rue de Morcourt 80800 Cerisy,80184_0060_00006,G,6 RUE DE MORCOURT,
313697450,00010,31369745000010,O,1978-01-01,,,,2024-03-30T15:34:55,true,5,,,,,,RUE,DU PORT,80800,CERISY,,,80184,,,,,801840070_B,674043.5775127183,6979000.7824186925,,,,,,,,,,,,,,,2008-01-01,F,,,,,01.11Z,NAFRev2,N,2.638945,49.909154,0.95,street,Rue du Port 80800 Cerisy,80184_0070,G,RUE DU PORT,
317658342,00041,31765834200041,O,1994-03-01,,,,2024-03-30T15:44:02,true,4,,,,,,RUE,DU PORT,80800,CERISY,,,80184,,,,,801840070_B,674043.5775127183,6979000.7824186925,,,,,,,,,,,,,,,1998-04-30,F,,,,,55.1A,NAF1993,O,2.638945,49.909154,0.95,street,Rue du Port 80800 Cerisy,80184_0070,G,RUE DU PORT,
317658342,00058,31765834200058,O,1995-03-10,,,,2024-03-30T15:44:02,false,3,,22,,,,RUE,DE LA REPUBLIQUE,80800,CERISY,,,80184,,,,,801840055_B,674045.018565174,6978545.472634016,,,,,,,,,,,,,,,1998-04-30,F,A L'YOHANN,,,,55.4B,NAF1993,N,2.638994,49.905064,0.95,housenumber,22 Rue de la République 80800 Cerisy,80184_0055_00022,G,22 RUE DE LA REPUBLIQUE,
318274784,00020,31827478400020,O,1987-11-01,,,,2024-03-30T15:02:10,true,1,,4,,,,RUE,JULES FERRY,80800,CERISY,,,80184,,,,,801840073_B,673929.3329244797,6978904.901701893,,,,,,,,,,,,,,,1998-09-30,F,,,,,45.3A,NAF1993,N,2.637362,49.908288,0.94,housenumber,4 Rue Jules Ferry 80800 Cerisy,80184_0073_00004,G,4 RUE JULES FERRY,
320763006,00014,32076300600014,O,1980-07-01,,,,2024-03-30T14:22:27,true,1,,,,,,IMPASSE,DU PRESBYTERE,80800,CERISY,,,80184,,,,,801840017_B,673944.1850146048,6978710.466826176,,,,,,,,,,,,,,,2000-07-28,F,,,,,55.2C,NAF1993,N,2.637581,49.906542,0.94,street,Impasse du Presbytère 80800 Cerisy,80184_0017,G,IMPASSE DU PRESBYTERE,
320764764,00017,32076476400017,O,,,,,2024-03-29T23:55:53,true,1,,,,,,RUE,DE MORCOURT,80800,CERISY,,,80184,,,,,801840060_B,674305.8066808515,6978549.184440842,,,,,,,,,,,,,,,1985-12-25,F,,,,,67.01,NAP,N,2.642621,49.905108,0.95,street,Rue de Morcourt 80800 Cerisy,80184_0060,G,RUE DE MORCOURT,
324950682,00025,32495068200025,O,1985-12-01,03,2021,,2024-03-30T13:43:57,true,5,,2,,,,RUE,DE LA REPUBLIQUE,80800,CERISY,,,80184,,,,,801840055_B,674009.3331170351,6978869.913960127,,,,,,,,,,,,,,,2008-01-01,A,,,,,43.13Z,NAFRev2,O,2.638477,49.907977,0.95,housenumber,2 Rue de la République 80800 Cerisy,80184_0055_00002,G,2 RUE DE LA REPUBLIQUE,
326586864,00018,32658686400018,O,,,,,2024-03-30T10:24:52,true,1,,,,,,RUE,GAMBETTA,80800,CERISY,,,80184,,,,,801840030_B,673976.4841825824,6978981.051757759,,,,,,,,,,,,,,,1997-12-31,F,,,,,50.1Z,NAF1993,O,2.638013,49.908974,0.95,street,Rue Gambetta 80800 Cerisy,80184_0030,G,RUE GAMBETTA,
327369153,00017,32736915300017,O,,,,,2024-03-30T08:13:11,true,1,,,,,,RUE,DE LA REPUBLIQUE,80800,CERISY,,,80184,,,,,801840055_B,674042.1030418818,6978662.595514853,,,,,,,,,,,,,,,,F,,,,,67.07,NAP,N,2.638946,49.906116,0.95,street,Rue de la République 80800 Cerisy,80184_0055,G,RUE DE LA REPUBLIQUE,
327737458,00015,32773745800015,O,1983-05-01,,,,2024-03-30T14:49:08,true,3,,,,,,RUE,DE MORCOURT,80800,CERISY,,,80184,,,,,801840060_B,674305.8066808515,6978549.184440842,,,,,,,,,,,,,,,2006-12-31,F,,,,,55.2C,NAFRev1,N,2.642621,49.905108,0.95,street,Rue de Morcourt 80800 Cerisy,80184_0060,G,RUE DE MORCOURT,
330165127,00060,33016512700060,O,2015-05-06,,,,2024-03-30T04:35:59,false,2,,83,,,,RUE,DES SAULES,80800,CERISY,,,80184,,,,,801840090_B,672272.4186109751,6978728.182315275,,,,,,,,,,,,,,,2015-12-31,F,,,,,47.99A,NAFRev2,N,2.614327,49.90663,0.95,housenumber,83 Rue des Saules 80800 Cerisy,80184_0090_00083,G,83 RUE DES SAULES,
331870618,00013,33187061800013,O,,,,,2024-03-30T11:32:02,true,1,,7,,,,RUE,DE MORCOURT,80800,CERISY,,,80184,,,,,801840060_B,674305.8066808515,6978549.184440842,,,,,,,,,,,,,,,1991-12-31,F,,,,,67.04,NAP,N,2.64298,49.905141,0.95,interpolation,7 Rue de Morcourt 80800 Cerisy,,G,5 RUE DE MORCOURT,
331921775,00044,33192177500044,P,2022-05-01,,,5610CQ,2024-03-30T00:35:41,false,1,[ND],[ND],[ND],[ND],[ND],[ND],[ND],[ND],CERISY,,[ND],80184,[ND],[ND],,,[ND],[ND],[ND],[ND],[ND],[ND],[ND],[ND],[ND],,,[ND],,[ND],[ND],,,2022-05-01,F,[ND],[ND],[ND],[ND],56.10C,NAFRev2,O,,,0,,,,,,
335041414,00012,33504141400012,O,,,,,2024-03-22T15:40:57,true,1,,,,,,RUE,DE LA REPUBLIQUE,80800,CERISY,,,80184,,,,,,,,,,,,,,,,,,,,,,1997-03-31,F,,,,,01.1A,NAF1993,N,2.638946,49.906116,0.95,street,Rue de la République 80800 Cerisy,80184_0055,G,RUE DE LA REPUBLIQUE,
343126280,00019,34312628000019,O,1987-11-15,,,,2024-03-30T01:51:07,true,3,,,,,,RUE,DE LA REPUBLIQUE,80800,CERISY,,,80184,,,,,801840055_B,674042.1030418818,6978662.595514853,,,,,,,,,,,,,,,1994-09-22,F,,,,,55.4B,NAF1993,N,2.638946,49.906116,0.95,street,Rue de la République 80800 Cerisy,80184_0055,G,RUE DE LA REPUBLIQUE,
344810338,00014,34481033800014,O,,,,,2024-03-30T16:31:44,true,1,,,,,,RUE,DU PORT,80800,CERISY,,,80184,,,,,801840070_B,674043.5775127183,6979000.7824186925,,,,,,,,,,,,,,,1990-09-30,F,,,,,67.08,NAP,N,2.638945,49.909154,0.95,street,Rue du Port 80800 Cerisy,80184_0070,G,RUE DU PORT,
348954868,00017,34895486800017,O,,,,,2024-03-30T10:43:52,true,1,,3,,,,RUE,FAIDHERBE,80800,CERISY,,,80184,,,,,801840016_B,674125.500270039,6978804.149091518,,,,,,,,,,,,,,,1989-12-31,F,,,,,55.60,NAP,N,2.640097,49.907391,0.94,housenumber,3 Rue Faidherbe 80800 Cerisy,80184_0016_00003,G,3 RUE FAIDHERBE,
348954975,00010,34895497500010,O,,,,,2024-03-30T05:22:36,true,1,,3,,,,RUE,FAIDHERBE,80800,CERISY,,,80184,,,,,801840016_B,674125.500270039,6978804.149091518,,,,,,,,,,,,,,,1989-12-31,F,,,,,55.60,NAP,N,2.640097,49.907391,0.94,housenumber,3 Rue Faidherbe 80800 Cerisy,80184_0016_00003,G,3 RUE FAIDHERBE,
353003668,00012,35300366800012,O,1990-01-02,,,,2024-03-30T02:37:44,true,4,,7,,,,RUE,DU CIMETIERE,80800,CERISY,,,80184,,,,,801840015_B,673808.8959827551,6978605.223161607,,,,,,,,,,,,,,,2004-06-30,F,,,,,45.2V,NAFRev1,O,2.635706,49.905591,0.94,housenumber,7 Rue du Cimetière 80800 Cerisy,80184_0015_00007,G,7 RUE DU CIMETIERE,
379281710,00036,37928171000036,O,2007-12-12,,,1399ZB,2024-03-30T17:54:46,false,3,,10,,,,RUE,SAINT-GEORGES,80800,CERISY,,,80184,,,,,801840080_B,673949.3227811151,6979078.025957811,,,,,,,,,,,,,,,2016-11-15,F,,,,,13.99Z,NAFRev2,N,2.637629,49.909844,0.94,housenumber,10 Rue Saint-georges 80800 Cerisy,80184_0080_00010,G,10 RUE SAINT GEORGES,
381561166,00012,38156116600012,O,1991-02-15,,,,2024-03-30T11:57:19,false,4,,,,,,RUE,DU PORT,80800,CERISY,,,80184,,,,,801840070_B,674043.5775127183,6979000.7824186925,,,,,,,,,,,,,,,1994-02-28,F,,,,,55.1A,NAF1993,N,2.638945,49.909154,0.95,street,Rue du Port 80800 Cerisy,80184_0070,G,RUE DU PORT,
382934198,00013,38293419800013,O,1991-09-01,,,,2024-03-30T04:01:55,true,4,,5,,,,RUE,DE SAILLY,80800,CERISY,,,80184,,,,,801840052_B,673950.4867693096,6978469.984856535,,,,,,,,,,,,,,,1999-09-16,F,,,,,74.2C,NAF1993,O,2.637684,49.904382,0.95,housenumber,5 Rue de Sailly 80800 Cerisy,80184_0052_00005,G,5 RUE DE SAILLY,
384404513,00010,38440451300010,O,1992-02-04,,,,2024-03-30T07:06:09,true,3,,7,,,,RUE,DE MORCOURT,80800,CERISY,,,80184,,,,,801840060_B,674305.8066808515,6978549.184440842,,,,,,,,,,,,,,,2005-09-01,F,,,,,55.4B,NAFRev1,N,2.64298,49.905141,0.95,interpolation,7 Rue de Morcourt 80800 Cerisy,,G,5 RUE DE MORCOURT,
389743535,00012,38974353500012,O,1993-01-04,,,,2024-03-22T15:40:57,false,4,,,,,,PL,DE L'EGLISE,80800,CERISY,,,80184,,,,,,,,,,,,,,,,,,,,,,2009-09-26,F,,,,,68.20A,NAFRev2,N,2.638291,49.906133,0.81,street,Place de la l’Eglise 80800 Cerisy,80184_0056,G,PLACE DE LA L EGLISE,
391185675,00017,39118567500017,O,1993-03-01,01,2021,,2024-03-30T17:26:54,true,4,,2,,,,RUE,DU PORT,80800,CERISY,,,80184,,,,,801840070_B,674057.9023901087,6978910.435361984,,,,,,,,,,,,,,,2011-12-31,A,,,,,01.11Z,NAFRev2,O,2.63915,49.908343,0.95,housenumber,2 Rue du Port 80800 Cerisy,80184_0070_00002,G,2 RUE DU PORT,
392040390,00016,39204039000016,O,1993-06-29,,,,2024-04-25T09:34:13,true,1,,10,,,,RUE,DE SAILLY LAURETTE,80800,CERISY,,,80184,,,,,,,,,,,,,,,,,,,,,,1998-08-04,F,,,,,01.1A,NAF1993,N,2.635709,49.904165,0.67,housenumber,10 Rue de Sailly 80800 Cerisy,80184_0052_00010,G,10 RUE DE SAILLY,
393579636,00019,39357963600019,O,1994-01-01,,,,2024-03-30T01:27:21,true,5,,,,,,RUE,DE LAMOTTE,80800,CERISY,,,80184,,,,,801840049_B,673960.2436326398,6978355.613802702,,,,,,,,,,,,,,,2004-03-31,F,,,,,51.8P,NAFRev1,O,2.637827,49.903355,0.94,street,Rue de Lamotte 80800 Cerisy,80184_0049,G,RUE DE LAMOTTE,
394652812,00014,39465281200014,O,1969-01-01,,,,2024-03-29T23:25:08,true,3,,10,,,,RUE,DU MARAIS,80800,CERISY,,,80184,,,,,801840054_B,673838.0210226999,6979105.922919523,,,,,,,,,,,,,,,2003-04-30,F,,,,,01.3Z,NAFRev1,,2.636079,49.91009,0.95,housenumber,10 Rue du Marais 80800 Cerisy,80184_0054_00010,G,10 RUE DU MARAIS,
394712731,00014,39471273100014,O,1994-04-16,,,,2024-03-30T03:25:08,true,1,,5,,,,RUE,VICTOR HUGO,80800,CERISY,,,80184,,,,,801840111_B,674205.9224416018,6978734.87536848,,,,,,,,,,,,,,,1999-12-31,F,,,,,01.1A,NAF1993,N,2.64122,49.906772,0.94,housenumber,5 Rue Victor Hugo 80800 Cerisy,80184_0111_00005,G,5 RUE VICTOR HUGO,
394712772,00018,39471277200018,O,1985-01-01,,,,2024-03-30T00:35:57,true,4,,6,,,,RUE,DE SAILLY,80800,CERISY,,,80184,,,,,801840052_B,673905.7227460165,6978476.201750939,,,,,,,,,,,,,,,2005-12-31,F,,,,,01.1A,NAFRev1,N,2.637061,49.904436,0.95,housenumber,6 Rue de Sailly 80800 Cerisy,80184_0052_00006,G,6 RUE DE SAILLY,
398178814,00016,39817881400016,O,1994-05-01,,,,2024-03-22T15:40:57,true,7,MAIRIE,,,,,,,80800,CERISY,,,80184,,,,,,,,,,,,,,,,,,,,,,2023-09-30,A,,,,,93.12Z,NAFRev2,N,,,0,,,,,,
399959881,00018,39995988100018,O,1975-01-01,NN,2021,,2024-03-30T18:16:20,true,3,,17,,,,RUE,DE LA REPUBLIQUE,80800,CERISY,,,80184,,,,,801840055_B,674067.9880890051,6978537.241248753,,,,,,,,,,,,,,,2008-01-01,A,,,,,01.11Z,NAFRev2,N,2.639314,49.904991,0.95,housenumber,17 Rue de la République 80800 Cerisy,80184_0055_00017,G,17 RUE DE LA REPUBLIQUE,
399960079,00016,39996007900016,O,1991-01-01,,,,2024-03-30T05:41:19,true,3,,14,,,,RUE,DE LA REPUBLIQUE,80800,CERISY,,,80184,,,,,801840055_B,674004.5165298624,6978728.669525406,,,,,,,,,,,,,,,2007-11-30,F,,,,,01.3Z,NAFRev1,N,2.638419,49.906708,0.95,housenumber,14 Rue de la République 80800 Cerisy,80184_0055_00014,G,14 RUE DE LA REPUBLIQUE,
401901038,00034,40190103800034,O,2003-03-01,,,,2024-03-30T14:32:32,true,7,,6,,,,RUE,JULES BARNI,80800,CERISY,,,80184,,,,,801840072_B,674119.8077517226,6978864.399779477,,,,,,,,,,,,,,,2012-12-31,F,SOSTHENE MAHIEU DEVELOPPEMENT,,,,71.12B,NAFRev2,N,2.640014,49.907932,0.94,housenumber,6 Rue Jules Barni 80800 Cerisy,80184_0072_00006,G,6 RUE JULES BARNI,
404290520,00026,40429052000026,O,2010-02-04,,,,2024-03-30T09:10:44,false,2,,6,,,,RUE,JULES BARNI,80800,CERISY,,,80184,,,,,801840072_B,674119.8077517226,6978864.399779477,,,,,,,,,,,,,,,2010-02-04,F,,,,,68.20A,NAFRev2,N,2.640014,49.907932,0.94,housenumber,6 Rue Jules Barni 80800 Cerisy,80184_0072_00006,G,6 RUE JULES BARNI,
407988666,00019,40798866600019,O,1973-10-01,,,,2024-03-30T02:54:24,true,3,,4,,,,RUE,CARNOT,80800,CERISY,,,80184,,,,,801840032_B,674138.9829112964,6978418.026890678,,,,,,,,,,,,,,,2004-11-30,F,,,,,01.1A,NAFRev1,N,2.640309,49.903923,0.94,housenumber,4 Rue Carnot 80800 Cerisy,80184_0032_00004,G,4 RUE CARNOT,
408936391,00015,40893639100015,O,1992-10-01,,,,2024-03-30T04:27:57,true,1,,,,,,RUE,DE MORCOURT,80800,CERISY,,,80184,,,,,801840060_B,674305.8066808515,6978549.184440842,,,,,,,,,,,,,,,2001-12-31,F,,,,,01.1A,NAF1993,N,2.642621,49.905108,0.95,street,Rue de Morcourt 80800 Cerisy,80184_0060,G,RUE DE MORCOURT,
412515058,00011,41251505800011,O,1997-07-01,,,2550BZ,2024-03-22T15:40:57,true,6,,20,T,,,RUE,MARAIS,80800,CERISY,,,80184,,,,,,,,,,,,,,,,,,,,,,2015-06-25,F,,,,,25.50B,NAFRev2,N,2.632388,49.910656,0.76,housenumber,20ter Rue du Marais 80800 Cerisy,80184_0054_00020_ter,G,20TER RUE DU MARAIS,
414033266,00027,41403326600027,O,2000-11-01,01,2021,4332AA,2024-03-30T02:55:31,true,5,,22,,,,RUE,DE LA REPUBLIQUE,80800,CERISY,,,80184,,,,,801840055_B,674045.018565174,6978545.472634016,,,,,,,,,,,,,,,2022-11-30,A,,,,,43.32A,NAFRev2,N,2.638994,49.905064,0.95,housenumber,22 Rue de la République 80800 Cerisy,80184_0055_00022,G,22 RUE DE LA REPUBLIQUE,
414301705,00011,41430170500011,O,1997-10-08,,,,2024-03-30T17:59:38,true,3,,6,,,,RUE,DE MORCOURT,80800,CERISY,,,80184,,,,,801840060_B,674153.0032535458,6978607.54226774,,,,,,,,,,,,,,,2008-01-01,A,,,,,68.20A,NAFRev2,N,2.640492,49.905626,0.95,housenumber,6 Rue de Morcourt 80800 Cerisy,80184_0060_00006,G,6 RUE DE MORCOURT,
415198241,00010,41519824100010,O,1997-12-07,,,,2024-03-22T15:40:57,true,3,,14,B,,,RUE,DE SAILLY,80800,CERISY,,,80184,,,,,,,,,,,,,,,,,,,,,,2006-12-20,F,,,,,50.1Z,NAFRev1,O,2.633246,49.903492,0.84,housenumber,14bis Rue de Sailly 80800 Cerisy,80184_0052_00014_bis,G,14BIS RUE DE SAILLY,
419405642,00036,41940564200036,O,2004-01-01,,,3299ZG,2024-03-30T03:20:44,true,7,,3,,,,RUE,DE LA GARE,80800,CERISY,,,80184,,,,,801840040_B,673620.325718461,6978298.851100244,,,,,,,,,,,,,,,2015-06-04,F,PERROQUETS ELEVAGE VOLIERE,ET NUTRITION,,,32.99Z,NAFRev2,N,2.633103,49.902831,0.94,housenumber,3 Rue de la Gare 80800 Cerisy,80184_0040_00003,G,3 RUE DE LA GARE,
419833728,00019,41983372800019,O,1998-08-04,,,,2024-04-25T09:37:53,true,4,,10,,,,RUE,DE SAILLY LAURETTE,80800,CERISY,,,80184,,,,,,,,,,,,,,,,,,,,,,2003-12-31,F,,,,,01.1A,NAFRev1,N,2.635709,49.904165,0.67,housenumber,10 Rue de Sailly 80800 Cerisy,80184_0052_00010,G,10 RUE DE SAILLY,
421619685,00017,42161968500017,O,1999-01-08,,,,2024-03-30T13:17:52,false,5,,6,,,,RUE,DE SAILLY,80800,CERISY,,,80184,,,,,801840052_B,673905.7227460165,6978476.201750939,,,,,,,,,,,,,,,2008-06-01,F,,,,,49.41B,NAFRev2,O,2.637061,49.904436,0.95,housenumber,6 Rue de Sailly 80800 Cerisy,80184_0052_00006,G,6 RUE DE SAILLY,
421619685,00025,42161968500025,O,2008-06-01,01,2021,,2024-03-30T13:17:53,true,1,,10,,,,RUE,JULES BARNI,80800,CERISY,,,80184,,,,,801840072_B,674133.1719062569,6978909.980563767,,,,,,,,,,,,,,,2008-06-01,A,,,,,49.41B,NAFRev2,O,2.640197,49.908342,0.94,housenumber,10 Rue Jules Barni 80800 Cerisy,80184_0072_00010,G,10 RUE JULES BARNI,
422911925,00028,42291192500028,O,2005-01-02,,,,2024-03-29T22:45:04,true,3,,24,,,,RUE,DE LA REPUBLIQUE,80800,CERISY,,,80184,,,,,801840055_B,674049.4655029211,6978480.218344078,,,,,,,,,,,,,,,2012-12-31,A,,,,,01.11Z,NAFRev2,O,2.63906,49.904478,0.95,housenumber,24 Rue de la République 80800 Cerisy,80184_0055_00024,G,24 RUE DE LA REPUBLIQUE,
424562999,00013,42456299900013,O,2000-01-01,,,,2024-03-30T07:57:24,true,1,,5,,,,RUE,VICTOR HUGO,80800,CERISY,,,80184,,,,,801840111_B,674205.9224416018,6978734.87536848,,,,,,,,,,,,,,,2001-12-01,F,,,,,01.1A,NAF1993,N,2.64122,49.906772,0.94,housenumber,5 Rue Victor Hugo 80800 Cerisy,80184_0111_00005,G,5 RUE VICTOR HUGO,
432519122,00019,43251912200019,O,2000-07-28,,,,2024-03-30T04:28:51,true,3,,1,,,,IMPASSE,DU PRESBYTERE,80800,CERISY,,,80184,,,,,801840017_B,673943.9703554627,6978710.690453433,,,,,,,,,,,,,,,2008-01-01,A,,,,,68.20B,NAFRev2,N,2.637578,49.906544,0.94,housenumber,1 Impasse du Presbytère 80800 Cerisy,80184_0017_00001,G,1 IMPASSE DU PRESBYTERE,
432822922,00014,43282292200014,O,2000-08-01,,,,2024-03-29T23:22:24,true,4,,1,,,,IMPASSE,DU PRESBYTERE,80800,CERISY,,,80184,,,,,801840017_B,673943.9703554627,6978710.690453433,,,,,,,,,,,,,,,2013-09-13,F,,,,,55.30Z,NAFRev2,N,2.637578,49.906544,0.94,housenumber,1 Impasse du Presbytère 80800 Cerisy,80184_0017_00001,G,1 IMPASSE DU PRESBYTERE,
433233509,00010,43323350900010,O,2000-10-01,,,,2024-03-22T15:40:57,true,3,,10,,,,RUE,DE MORCOURT,80800,CERISY,,,80184,,,,,,,,,,,,,,,,,,,,,,2004-09-30,F,,,,,45.2V,NAFRev1,N,2.641205,49.905704,0.95,housenumber,10 Rue de Morcourt 80800 Cerisy,80184_0060_00010,G,10 RUE DE MORCOURT,
433302692,00010,43330269200010,O,2000-10-01,NN,2021,,2024-03-30T10:13:56,true,3,,6,,,,RUE,DE SAILLY,80800,CERISY,,,80184,,,,,801840052_B,673905.7227460165,6978476.201750939,,,,,,,,,,,,,,,2008-01-01,A,,,,,01.11Z,NAFRev2,N,2.637061,49.904436,0.95,housenumber,6 Rue de Sailly 80800 Cerisy,80184_0052_00006,G,6 RUE DE SAILLY,
442605028,00012,44260502800012,O,2002-05-03,,,,2024-03-22T15:40:57,true,3,,6,,,,,BARNI,80800,CERISY,,,80184,,,,,,,,,,,,,,,,,,,,,,2008-01-01,A,,,,,68.20B,NAFRev2,N,2.640014,49.907932,0.8,housenumber,6 Rue Jules Barni 80800 Cerisy,80184_0072_00006,G,6 RUE JULES BARNI,
444079503,00017,44407950300017,O,2002-09-28,,,,2024-03-30T16:30:48,false,4,,3,,,,PLACE,DE LA L’EGLISE,80800,CERISY,,,80184,,,,,801840056_B,673997.6958342127,6978667.919504336,,,,,,,,,,,,,,,2009-12-20,F,,,,,68.20B,NAFRev2,N,2.638328,49.906162,0.94,housenumber,3 Place de la l’Eglise 80800 Cerisy,80184_0056_00003,G,3 PLACE DE LA L EGLISE,
448163410,00013,44816341000013,O,2003-05-01,,,,2024-03-30T12:58:11,true,4,,10,,,,RUE,DU MARAIS,80800,CERISY,,,80184,,,,,801840054_B,673838.0210226999,6979105.922919523,,,,,,,,,,,,,,,2015-12-31,F,,,,,01.11Z,NAFRev2,N,2.636079,49.91009,0.95,housenumber,10 Rue du Marais 80800 Cerisy,80184_0054_00010,G,10 RUE DU MARAIS,
451582050,00014,45158205000014,O,2004-01-26,,,,2024-03-30T18:22:51,true,4,,4,,,,RUE,CARNOT,80800,CERISY,,,80184,,,,,801840032_B,674138.9829112964,6978418.026890678,,,,,,,,,,,,,,,2009-03-31,F,,,,,66.22Z,NAFRev2,N,2.640309,49.903923,0.94,housenumber,4 Rue Carnot 80800 Cerisy,80184_0032_00004,G,4 RUE CARNOT,
451582050,00022,45158205000022,O,2004-11-30,,,,2024-03-30T18:22:51,false,3,,4,,,,RUE,CARNOT,80800,CERISY,,,80184,,,,,801840032_B,674138.9829112964,6978418.026890678,,,,,,,,,,,,,,,2006-12-31,F,,,,,01.1A,NAFRev1,O,2.640309,49.903923,0.94,housenumber,4 Rue Carnot 80800 Cerisy,80184_0032_00004,G,4 RUE CARNOT,