siren,nic,siret,statutDiffusionEtablissement,dateCreationEtablissement,trancheEffectifsEtablissement,anneeEffectifsEtablissement,activitePrincipaleRegistreMetiersEtablissement,dateDernierTraitementEtablissement,etablissementSiege,nombrePeriodesEtablissement,complementAdresseEtablissement,numeroVoieEtablissement,indiceRepetitionEtablissement,typeVoieEtablissement,libelleVoieEtablissement,codePostalEtablissement,libelleCommuneEtablissement,libelleCommuneEtrangerEtablissement,distributionSpecialeEtablissement,codeCommuneEtablissement,codeCedexEtablissement,libelleCedexEtablissement,codePaysEtrangerEtablissement,libellePaysEtrangerEtablissement,complementAdresse2Etablissement,numeroVoie2Etablissement,indiceRepetition2Etablissement,typeVoie2Etablissement,libelleVoie2Etablissement,codePostal2Etablissement,libelleCommune2Etablissement,libelleCommuneEtranger2Etablissement,distributionSpeciale2Etablissement,codeCommune2Etablissement,codeCedex2Etablissement,libelleCedex2Etablissement,codePaysEtranger2Etablissement,libellePaysEtranger2Etablissement,dateDebut,etatAdministratifEtablissement,enseigne1Etablissement,enseigne2Etablissement,enseigne3Etablissement,denominationUsuelleEtablissement,activitePrincipaleEtablissement,nomenclatureActivitePrincipaleEtablissement,caractereEmployeurEtablissement,longitude,latitude,geo_score,geo_type,geo_adresse,geo_id,geo_ligne,geo_l4,geo_l5
210103149,00014,21010314900014,O,1983-03-01,11,2021,,2023-11-30T10:17:58,true,4,,177,,,GRANDE RUE DE LA COTIERE,01160,PRIAY,,,01314,,,,,,,,,,,,,,,,,,,2008-01-01,A,MAIRIE,,,,84.11Z,NAFRev2,O,5.289368,46.003086,0.96,housenumber,177 Grande Rue de la Cotiere 01160 Priay,01314_0045_00177,G,177 GRANDE RUE DE LA COTIERE,
210103149,00022,21010314900022,O,1983-12-21,11,2021,,2023-11-30T10:17:58,false,3,,,,PL,LAURENT FERRAND,01160,PRIAY,,,01314,,,,,,,,,,,,,,,,,,,2008-01-01,A,ECOLE PRIMAIRE PUBLIQUE,,,,85.20Z,NAFRev2,N,5.289893,46.003186,0.85,street,Place Laurent Ferrand 01160 Priay,01314_0080,G,PLACE LAURENT FERRAND,
210103149,00030,21010314900030,O,1996-01-01,NN,,,2008-01-04T18:23:23,false,3,MAIRIE,,,,,01160,PRIAY,,,01314,,,,,,,,,,,,,,,,,,,2008-01-01,A,SERVICE ASSAINISSEMENT,,,,37.00Z,NAFRev2,N,,,0,,,,,,
260101969,00012,26010196900012,O,1986-05-01,NN,,,2008-01-04T18:54:45,true,3,MAIRIE,,,,,01160,PRIAY,,,01314,,,,,,,,,,,,,,,,,,,2008-01-01,A,CCAS,,,,88.99B,NAFRev2,N,,,0,,,,,,
301575254,00018,30157525400018,O,,NN,,,,true,1,,,,,,01160,PRIAY,,,01314,,,,,,,,,,,,,,,,,,,1997-09-30,F,,,,,52.2C,NAF1993,O,,,0,,,,,,
301899803,00011,30189980300011,O,,,,,,true,1,,,,,,01160,PRIAY,,,01314,,,,,,,,,,,,,,,,,,,1984-12-25,F,,,,,67.01,NAP,N,,,0,,,,,,
302458344,00017,30245834400017,O,1900-01-01,NN,,,2011-04-23T04:27:06,false,4,,,,,GRANDE RUE DE LA COTIERE,01160,PRIAY,,,01314,,,,,,,,,,,,,,,,,,,2008-01-01,A,,,,,22.29A,NAFRev2,O,5.28582,46.000486,0.96,street,Grande Rue de la Cotiere 01160 Priay,01314_0045,G,GRANDE RUE DE LA COTIERE,
302458344,00033,30245834400033,O,1988-06-01,12,2021,,2023-11-30T10:19:37,true,4,,400,,RUE,DES CHAMPAGNES,01160,PRIAY,,,01314,,,,,,,,,,,,,,,,,,,2008-01-01,A,,,,,22.29A,NAFRev2,O,5.283592,45.9998,0.96,housenumber,400 Rue des Champagnes 01160 Priay,01314_0043_00400,G,400 RUE DES CHAMPAGNES,
302545884,00033,30254588400033,O,,NN,,,,true,1,,,,,,01160,PRIAY,,,01314,,,,,,,,,,,,,,,,,,,1995-12-31,F,,,,,52.4W,NAF1993,N,,,0,,,,,,
302723572,00012,30272357200012,O,,,,,,true,1,,,,,LES CARRONNIERES,01160,PRIAY,,,01314,,,,,,,,,,,,,,,,,,,,F,,,,,21.08,NAP,N,5.298771,46.027552,0.83,street,Rue des Carronnieres 01160 Priay,01314_0042,G,RUE DES CARRONNIERES,
302723580,00015,30272358000015,O,,NN,,,,true,1,,,,,,01160,PRIAY,,,01314,,,,,,,,,,,,,,,,,,,1987-11-27,F,,,,,55.60,NAP,N,,,0,,,,,,
304975105,00012,30497510500012,O,1964-01-01,NN,,,,true,1,,,,,,01160,PRIAY,,,01314,,,,,,,,,,,,,,,,,,,1996-09-30,F,,,,,45.2V,NAF1993,O,,,0,,,,,,
307652941,00047,30765294100047,O,1999-07-02,NN,,,2006-12-15T00:16:23,false,5,,,,,GRANDE RUE DE LA COTIERE,01160,PRIAY,,,01314,,,,,,,,,,,,,,,,,,,2002-07-21,F,,,,,55.4A,NAF1993,O,5.28582,46.000486,0.96,street,Grande Rue de la Cotiere 01160 Priay,01314_0045,G,GRANDE RUE DE LA COTIERE,
308189653,00014,30818965300014,P,1976-01-01,NN,,,2012-05-05T00:57:39,false,4,[ND],[ND],[ND],[ND],[ND],[ND],PRIAY,,[ND],01314,[ND],[ND],,,[ND],[ND],[ND],[ND],[ND],[ND],,,[ND],,[ND],[ND],,,2010-07-31,F,[ND],[ND],[ND],[ND],47.73Z,NAFRev2,O,,,0,,,,,,
308189653,00022,30818965300022,P,2011-06-01,,,,2024-01-17T20:46:44,true,1,[ND],[ND],[ND],[ND],[ND],[ND],PRIAY,,[ND],01314,[ND],[ND],,,[ND],[ND],[ND],[ND],[ND],[ND],,,[ND],,[ND],[ND],,,2011-06-01,A,[ND],[ND],[ND],[ND],68.20B,NAFRev2,N,,,0,,,,,,
308614767,00025,30861476700025,O,1900-01-01,NN,,,,false,3,,,,,,01160,PRIAY,,,01314,,,,,,,,,,,,,,,,,,,2001-04-01,F,,,,,85.1C,NAF1993,,,,0,,,,,,
309478733,00020,30947873300020,O,2000-01-01,NN,,,2021-02-23T10:38:17,true,3,ANCIENNE RTE DE VARAMBON,1900,,RTE,DE GENEVE,01160,PRIAY,,,01314,,,,,,,,,,,,,,,,,,,2008-01-01,A,ELEVAGE DE L'EMPEREUR,,,,01.41Z,NAFRev2,N,5.302488,46.01803,0.86,housenumber,1900 Route de Geneve 01160 Priay,01314_0065_01900,G,1900 ROUTE DE GENEVE,
309531739,00014,30953173900014,O,,,,,,true,1,,,,,,01160,PRIAY,,,01314,,,,,,,,,,,,,,,,,,,1984-12-25,F,,,,,47.09,NAP,N,,,0,,,,,,
309671725,00047,30967172500047,O,1980-01-01,NN,,,,false,3,,,,RTE,DE CHALAMONT,01160,PRIAY,,,01314,,,,,,,,,,,,,,,,,,,1993-10-01,F,,,,,92.3A,NAF1993,N,5.291784,46.003224,0.4,street,Rue Charriere du Pont 01160 Priay,01314_0056,G,RUE CHARRIERE DU PONT,
309671725,00054,30967172500054,O,1993-10-01,NN,,,2013-10-06T03:16:17,true,4,,140,,RTE,DE LA DOMBE,01160,PRIAY,,,01314,,,,,,,,,,,,,,,,,,,2012-12-31,F,,,,,90.03B,NAFRev2,N,5.288181,46.003792,0.82,housenumber,140 Route de la Dombes 01160 Priay,01314_0055_00140,G,140 ROUTE DE LA DOMBES,
310793492,00029,31079349200029,O,1986-01-01,NN,,,2008-11-07T00:25:47,true,4,,,,RTE,N 84,01160,PRIAY,,,01314,,,,,,,,,,,,,,,,,,,2001-10-01,F,,,,,51.6C,NAF1993,N,5.277382,46.011758,0.31,locality,Chez Carte 01160 Priay,01314_B043,G,CHEZ CARTE,
310982913,00017,31098291300017,O,,NN,,,,true,1,,,,,LES CARRONNIERES,01160,PRIAY,,,01314,,,,,,,,,,,,,,,,,,,1989-08-01,F,,,,,81.11,NAP,N,5.298771,46.027552,0.83,street,Rue des Carronnieres 01160 Priay,01314_0042,G,RUE DES CARRONNIERES,
311483176,00013,31148317600013,O,1977-01-01,NN,,,2010-04-18T03:36:46,true,5,,,,,LES CARRONNIERES,01160,PRIAY,,,01314,,,,,,,,,,,,,,,,,,,2008-12-12,F,,,,,22.29B,NAFRev2,O,5.298771,46.027552,0.83,street,Rue des Carronnieres 01160 Priay,01314_0042,G,RUE DES CARRONNIERES,
311713978,00014,31171397800014,O,,,,,,true,1,,,,,,01160,PRIAY,,,01314,,,,,,,,,,,,,,,,,,,1984-12-25,F,,,,,67.01,NAP,N,,,0,,,,,,
311834972,00029,31183497200029,O,,,,,,true,1,,,,,LA VIOLLIERE HAM BELLEGARD,01160,PRIAY,,,01314,,,,,,,,,,,,,,,,,,,1991-05-31,F,,,,,55.73,NAP,N,5.297594,46.013685,0.47,street,La Violiere 01160 Priay,01314_54gyrt,G,LA VIOLIERE,
312833999,00047,31283399900047,O,1998-01-06,NN,,,,true,4,,,,QUAI,DE LA RIVIERE,01160,PRIAY,,,01314,,,,,,,,,,,,,,,,,,,2003-09-26,F,,,,,52.6E,NAFRev1,N,5.290929,46.003136,0.72,street,Rue de la Riviére 01160 Priay,01314_0009,G,RUE DE LA RIVIERE,
313554248,00010,31355424800010,O,,,,,,true,1,,,,PL,DE PRIAY,01160,PRIAY,,,01314,,,,,,,,,,,,,,,,,,,1991-03-31,F,,,,,67.08,NAP,N,5.288103,46.003515,0.77,street,Place de l’Eglise 01160 Priay,01314_0006,G,PLACE DE L EGLISE,
316143072,00015,31614307200015,O,,,,,,true,1,,,,,LES CARRONNIERES,01160,PRIAY,,,01314,,,,,,,,,,,,,,,,,,,1985-12-25,F,,,,,55.72,NAP,N,5.298771,46.027552,0.83,street,Rue des Carronnieres 01160 Priay,01314_0042,G,RUE DES CARRONNIERES,
316296078,00033,31629607800033,O,,NN,,,,true,1,,,,CHE,,01160,PRIAY,,,01314,,,,,,,,,,,,,,,,,,,1994-09-30,F,,,,,45.4F,NAF1993,N,5.298794,46.020113,0.91,street,Che du Bief 01160 Priay,01314_0027,G,CHE DU BIEF,
317960151,00023,31796015100023,O,1993-01-01,NN,,,,true,1,,,,HAM,DE BELLEGARDE,01160,PRIAY,,,01314,,,,,,,,,,,,,,,,,,,2002-05-31,F,,,,,45.3E,NAF1993,O,5.294649,46.015211,0.94,street,Rue de Bellegarde 01160 Priay,01314_0036,G,RUE DE BELLEGARDE,
317981462,00011,31798146200011,O,,,,,,true,1,,,,,,01160,PRIAY,,,01314,,,,,,,,,,,,,,,,,,,,F,,,,,81.21,NAP,N,,,0,,,,,,
318708260,00019,31870826000019,O,1900-01-01,,,,2011-11-18T00:11:04,true,2,,,,,,01160,PRIAY,,,01314,,,,,,,,,,,,,,,,,,,1987-05-15,F,,,,,,,,,,0,,,,,,
319062253,00012,31906225300012,O,,,,,,true,1,,,,,,01160,PRIAY,,,01314,,,,,,,,,,,,,,,,,,,1984-12-25,F,,,,,55.60,NAP,N,,,0,,,,,,
319648515,00017,31964851500017,O,,NN,,,,true,1,,,,,LES BARRIERES,01160,PRIAY,,,01314,,,,,,,,,,,,,,,,,,,,F,,,,,47.04,NAP,N,5.274728,46.010381,0.8,street,Rue des Barrieres 01160 Priay,01314_0031,G,RUE DES BARRIERES,
320390743,00013,32039074300013,O,,,,,,true,1,,,,,LES CARRONNIERES,01160,PRIAY,,,01314,,,,,,,,,,,,,,,,,,,1984-12-25,F,,,,,65.06,NAP,N,5.298771,46.027552,0.83,street,Rue des Carronnieres 01160 Priay,01314_0042,G,RUE DES CARRONNIERES,
320390834,00028,32039083400028,O,,NN,,,,true,1,,,,,,01160,PRIAY,,,01314,,,,,,,,,,,,,,,,,,,1988-03-31,F,,,,,67.01,NAP,N,,,0,,,,,,
321108672,00056,32110867200056,O,2005-01-01,,,,2021-09-03T08:54:23,true,3,,392,,,GRANDE RUE DE LA COTIERE,01160,PRIAY,,,01314,,,,,,,,,,,,,,,,,,,2021-09-30,F,,,,,86.23Z,NAFRev2,N,5.287411,46.001698,0.96,housenumber,392 Grande Rue de la Cotiere 01160 Priay,01314_0045_00392,G,392 GRANDE RUE DE LA COTIERE,
321352221,00030,32135222100030,O,2018-06-01,02,2021,,2023-11-30T10:22:35,false,1,,817,,,GRANDE RUE DE LA COTIERE,01160,PRIAY,,,01314,,,,,,,,,,,,,,,,,,,2018-06-01,A,,,,,46.69B,NAFRev2,N,5.283787,45.998815,0.96,housenumber,817 Grande Rue de la Cotiere 01160 Priay,01314_0045_00817,G,817 GRANDE RUE DE LA COTIERE,
321443913,00025,32144391300025,O,2009-11-01,,,,2021-10-13T11:08:19,true,2,,369,,RTE,DES TUILERIES,01160,PRIAY,,,01314,,,,,,,,,,,,,,,,,,,2020-01-19,A,,,,,50.30Z,NAFRev2,N,5.295534,46.029754,0.86,housenumber,369 Route des Tuileries 01160 Priay,01314_0097_00369,G,369 ROUTE DES TUILERIES,
321551194,00012,32155119400012,O,,NN,,,,true,1,,,,,LE BOURG,01160,PRIAY,,,01314,,,,,,,,,,,,,,,,,,,,F,,,,,64.49,NAP,N,5.286195,46.000142,0.42,street,Lotissement le Beau Rivage 01160 Priay,01314_q6g9vp,G,LOTISSEMENT LE BEAU RIVAGE,
323174797,00064,32317479700064,O,2008-09-02,NN,,,2021-10-27T08:23:14,true,4,,392,,GR,RUE DE LA COTIERE,01160,PRIAY,,,01314,,,,,,,,,,,,,,,,,,,2019-07-31,F,,,,,86.23Z,NAFRev2,N,5.287411,46.001698,0.89,housenumber,392 Grande Rue de la Cotiere 01160 Priay,01314_0045_00392,G,392 GRANDE RUE DE LA COTIERE,
323291757,00025,32329175700025,O,,NN,,,,true,1,,,,PL,DE LA MAIRIE,01160,PRIAY,,,01314,,,,,,,,,,,,,,,,,,,1987-04-30,F,,,,,62.11,NAP,N,5.28582,46.000486,0.39,street,Grande Rue de la Cotiere 01160 Priay,01314_0045,G,GRANDE RUE DE LA COTIERE,
324322957,00022,32432295700022,O,2011-01-03,,,4722ZB,2016-09-30T04:28:21,true,2,LES BATISSES,69,,CHE,DE LA FORGE,01160,PRIAY,,,01314,,,,,,,,,,,,,,,,,,,2016-06-30,F,,,,,47.22Z,NAFRev2,N,5.295184,46.02471,0.85,housenumber,69 Chemin de la Forge 01160 Priay,01314_0061_00069,G,69 CHEMIN DE LA FORGE,
324511898,00052,32451189800052,O,1990-11-15,NN,,,,true,1,,,,HAM,DES CARRONNIERES,01160,PRIAY,,,01314,,,,,,,,,,,,,,,,,,,2000-10-31,F,,,,,51.6G,NAF1993,N,5.298771,46.027552,0.94,street,Rue des Carronnieres 01160 Priay,01314_0042,G,RUE DES CARRONNIERES,
324779628,00050,32477962800050,O,2020-06-01,,,,2021-09-22T11:27:21,false,2,,352,,MTE,DE BELLEGARDE,01160,PRIAY,,,01314,,,,,,,,,,,,,,,,,,,2021-08-31,F,LES ABEILLES D'AXEL,,,,01.49Z,NAFRev2,N,5.295469,46.012433,0.82,housenumber,352 Montee de Bellegarde 01160 Priay,01314_0037_00352,G,352 MONTEE DE BELLEGARDE,
324779628,00068,32477962800068,O,2021-09-06,,,4332AA,2021-10-02T12:51:00,true,1,,352,,MTE,DE BELLEGARDE,01160,PRIAY,,,01314,,,,,,,,,,,,,,,,,,,2021-09-06,A,,,,,43.32A,NAFRev2,N,5.295469,46.012433,0.82,housenumber,352 Montee de Bellegarde 01160 Priay,01314_0037_00352,G,352 MONTEE DE BELLEGARDE,
325042299,00017,32504229900017,O,,NN,,,,true,1,,,,,,01160,PRIAY,,,01314,,,,,,,,,,,,,,,,,,,1994-03-31,F,,,,,55.3A,NAF1993,N,,,0,,,,,,
326594728,00015,32659472800015,O,1983-02-14,NN,,,2016-10-17T03:50:01,true,2,,,,,LES CARRONNIERES,01160,PRIAY,,,01314,,,,,,,,,,,,,,,,,,,1993-03-31,F,,,,,,,,5.298771,46.027552,0.83,street,Rue des Carronnieres 01160 Priay,01314_0042,G,RUE DES CARRONNIERES,
326877487,00032,32687748700032,O,2018-07-26,,,,2020-03-10T12:12:37,true,1,,1900,,RTE,DE GENEVE,01160,PRIAY,,,01314,,,,,,,,,,,,,,,,,,,2018-07-26,A,,,,,68.20A,NAFRev2,N,5.302488,46.01803,0.86,housenumber,1900 Route de Geneve 01160 Priay,01314_0065_01900,G,1900 ROUTE DE GENEVE,
326893534,00080,32689353400080,O,2007-11-16,,,,2011-07-20T05:53:50,true,3,SARL GM CONFORT,2,,LOT,LE BEAU RIVAGE,01160,PRIAY,,,01314,,,,,,,,,,,,,,,,,,,2010-06-25,F,,,,,70.10Z,NAFRev2,N,5.285875,46.000206,0.9,housenumber,2 Lotissement le Beau Rivage 01160 Priay,01314_q6g9vp_00002,G,2 LOTISSEMENT LE BEAU RIVAGE,
330326729,00010,33032672900010,O,,NN,,,,true,1,,,,CHE,DES CAMPAGNES,01160,PRIAY,,,01314,,,,,,,,,,,,,,,,,,,1987-04-24,F,,,,,55.71,NAP,N,5.28366,45.999734,0.74,street,Rue des Champagnes 01160 Priay,01314_0043,G,RUE DES CHAMPAGNES,
330416959,00014,33041695900014,O,,NN,,,,true,1,,,,,LES CARRONNIERES,01160,PRIAY,,,01314,,,,,,,,,,,,,,,,,,,1988-09-28,F,,,,,55.72,NAP,N,5.298771,46.027552,0.83,street,Rue des Carronnieres 01160 Priay,01314_0042,G,RUE DES CARRONNIERES,
331455006,00014,33145500600014,O,,NN,,,,true,1,,,,,,01160,PRIAY,,,01314,,,,,,,,,,,,,,,,,,,1987-12-21,F,,,,,60.11,NAP,N,,,0,,,,,,
331749069,00026,33174906900026,O,2000-10-16,NN,,,2016-02-05T09:54:49,false,4,,,,RTE,DE LA DOMBE,01160,PRIAY,,,01314,,,,,,,,,,,,,,,,,,,2001-09-30,F,,,,,72.1Z,NAF1993,N,5.287624,46.004033,0.78,street,Route de la Dombes 01160 Priay,01314_0055,G,ROUTE DE LA DOMBES,
332508100,00036,33250810000036,O,1990-11-15,NN,,,,true,1,,,,HAM,DES CARRONNIERES,01160,PRIAY,,,01314,,,,,,,,,,,,,,,,,,,1997-09-12,F,,,,,51.6G,NAF1993,O,5.298771,46.027552,0.94,street,Rue des Carronnieres 01160 Priay,01314_0042,G,RUE DES CARRONNIERES,
333013274,00035,33301327400035,O,2001-08-19,,,,2012-01-19T09:34:21,false,4,,,,RUE,DE LA COTIERE,01160,PRIAY,,,01314,,,,,,,,,,,,,,,,,,,2011-05-01,F,,,,,86.21Z,NAFRev2,N,5.28582,46.000486,0.95,street,Grande Rue de la Cotiere 01160 Priay,01314_0045,G,GRANDE RUE DE LA COTIERE,
333013274,00043,33301327400043,O,2011-05-01,,,,2021-05-18T08:54:40,true,2,,332,,,GRANDE RUE LA COTIERE,01160,PRIAY,,,01314,,,,,,,,,,,,,,,,,,,2021-06-30,F,,,,,86.21Z,NAFRev2,N,5.288001,46.002156,0.96,housenumber,332 Grande Rue de la Cotiere 01160 Priay,01314_0045_00332,G,332 GRANDE RUE DE LA COTIERE,
333015097,00020,33301509700020,O,1994-07-11,NN,,,2007-01-26T13:27:08,true,3,,,,,GRANDE RUE DE LA COTIERE,01160,PRIAY,,,01314,,,,,,,,,,,,,,,,,,,2006-12-31,F,,,,,52.5Z,NAFRev1,N,5.28582,46.000486,0.96,street,Grande Rue de la Cotiere 01160 Priay,01314_0045,G,GRANDE RUE DE LA COTIERE,
333258325,00047,33325832500047,O,2012-02-03,,,,2016-03-15T13:55:07,false,2,,48,,RUE,DE L'EGLISE,01160,PRIAY,,,01314,,,,,,,,,,,,,,,,,,,2013-12-30,F,,,,,47.99A,NAFRev2,N,5.288635,46.003269,0.95,housenumber,48 Rue de l'Eglise 01160 Priay,01314_0060_00048,G,48 RUE DE L EGLISE,
334460078,00010,33446007800010,O,,NN,,,,true,1,,,,,MAS FALCON LES CARRONNIERE,01160,PRIAY,,,01314,,,,,,,,,,,,,,,,,,,,F,,,,,65.06,NAP,N,5.294251,46.027854,0.47,street,Mas Falcon 01160 Priay,01314_B109,G,MAS FALCON,
334801941,00033,33480194100033,O,1900-01-01,NN,,,2011-04-28T00:29:24,false,3,,,,RTE,GENEVE,01160,PRIAY,,,01314,,,,,,,,,,,,,,,,,,,1997-06-27,F,,,,,85.1G,NAF1993,N,5.296345,46.006511,0.78,street,Route de Geneve 01160 Priay,01314_0065,G,ROUTE DE GENEVE,
335018313,00023,33501831300023,O,2006-08-28,,,,2014-01-09T19:29:25,true,3,,,,GR,GRANDE RUE DE LA COTIERE,01160,PRIAY,,,01314,,,,,,,,,,,,,,,,,,,2013-03-01,F,,,,,47.11B,NAFRev2,N,5.28582,46.000486,0.9,street,Grande Rue de la Cotiere 01160 Priay,01314_0045,G,GRANDE RUE DE LA COTIERE,
337818637,00015,33781863700015,O,1986-05-14,NN,,,2009-08-21T03:45:22,true,5,,,,,LES CARRONNIERES,01160,PRIAY,,,01314,,,,,,,,,,,,,,,,,,,2001-12-31,F,,,,,70.2C,NAF1993,N,5.298771,46.027552,0.83,street,Rue des Carronnieres 01160 Priay,01314_0042,G,RUE DES CARRONNIERES,
337855373,00011,33785537300011,O,,NN,,,,true,1,,,,,LES CARRONNIERES,01160,PRIAY,,,01314,,,,,,,,,,,,,,,,,,,1987-03-31,F,,,,,39.04,NAP,N,5.298771,46.027552,0.83,street,Rue des Carronnieres 01160 Priay,01314_0042,G,RUE DES CARRONNIERES,
338847122,00011,33884712200011,O,1900-01-01,NN,,,2013-02-01T14:09:50,false,4,,,,,LES CARRONNIERES,01160,PRIAY,,,01314,,,,,,,,,,,,,,,,,,,1987-12-31,F,,,,,77.14,NAP,N,5.298771,46.027552,0.83,street,Rue des Carronnieres 01160 Priay,01314_0042,G,RUE DES CARRONNIERES,
338847122,00037,33884712200037,O,2016-03-01,,,,2021-02-23T10:55:16,true,1,,55,,CHE,DES GUERS,01160,PRIAY,,,01314,,,,,,,,,,,,,,,,,,,2016-03-01,A,,,,,49.32Z,NAFRev2,N,5.299665,46.028102,0.84,housenumber,55 Chemin des Guers 01160 Priay,01314_0075_00055,G,55 CHEMIN DES GUERS,
338847593,00013,33884759300013,O,1900-01-01,NN,,,2011-04-28T00:31:15,false,3,,,,,LES CARRONNIERES,01160,PRIAY,,,01314,,,,,,,,,,,,,,,,,,,1990-08-22,F,,,,,,,N,5.298771,46.027552,0.83,street,Rue des Carronnieres 01160 Priay,01314_0042,G,RUE DES CARRONNIERES,
338879703,00027,33887970300027,O,,,,,,true,1,,,,PL,DU VILLAGE,01160,PRIAY,,,01314,,,,,,,,,,,,,,,,,,,1991-11-25,F,,,,,64.47,NAP,N,2.2389236,48.6678573,0.77,poi.park,Place du Village (Parc) Nozay,https://osm.org/way/26978864,G,,
339858292,00016,33985829200016,O,,NN,,,,true,1,,,,,BELLEGARDE,01160,PRIAY,,,01314,,,,,,,,,,,,,,,,,,,1992-09-30,F,,,,,45.4C,NAF1993,N,5.294649,46.015211,0.93,street,Rue de Bellegarde 01160 Priay,01314_0036,G,RUE DE BELLEGARDE,
340296623,00010,34029662300010,O,,,,,2006-11-25T10:38:00,true,1,,,,,SALLES DES REUNIONS,01160,PRIAY,,,01314,,,,,,,,,,,,,,,,,,,1987-09-30,F,,,,,96.25,NAP,N,5.283959,46.001018,0.43,street,Allee des Sapins 01160 Priay,01314_0099,G,ALLEE DES SAPINS,
340637917,00014,34063791700014,O,1986-04-01,NN,,,,true,1,,,,RTE,DE CHALAMONT,01160,PRIAY,,,01314,,,,,,,,,,,,,,,,,,,1998-12-31,F,,,,,01.3Z,NAF1993,N,5.291784,46.003224,0.4,street,Rue Charriere du Pont 01160 Priay,01314_0056,G,RUE CHARRIERE DU PONT,
341402220,00014,34140222000014,O,,NN,,,,true,1,,,,PL,DE LA MAIRIE,01160,PRIAY,,,01314,,,,,,,,,,,,,,,,,,,1992-09-25,F,,,,,52.1B,NAF1993,N,5.28582,46.000486,0.39,street,Grande Rue de la Cotiere 01160 Priay,01314_0045,G,GRANDE RUE DE LA COTIERE,
341424091,00013,34142409100013,O,,NN,,,,true,1,,,,,LES CARRONNIERES,01160,PRIAY,,,01314,,,,,,,,,,,,,,,,,,,1988-09-17,F,,,,,82.02,NAP,N,5.298771,46.027552,0.83,street,Rue des Carronnieres 01160 Priay,01314_0042,G,RUE DES CARRONNIERES,
341538718,00048,34153871800048,O,1999-02-01,NN,,,2006-12-15T00:30:49,false,4,,,,RUE,CHARRIERE DU TOUR,01160,PRIAY,,,01314,,,,,,,,,,,,,,,,,,,2001-06-01,F,,,,,70.1F,NAF1993,N,5.287757,46.002901,0.94,street,Rue Charriere du Tour 01160 Priay,01314_0058,G,RUE CHARRIERE DU TOUR,
342037181,00019,34203718100019,O,1987-09-01,,,,2006-11-25T10:43:08,true,4,MAIRIE,,,,,01160,PRIAY,,,01314,,,,,,,,,,,,,,,,,,,1997-12-25,F,,,,,92.6C,NAF1993,N,,,0,,,,,,
342116225,00018,34211622500018,O,1987-05-25,01,2021,9602AA,2023-11-30T10:28:04,true,4,,,,PL,LAURENT FERRAND,01160,PRIAY,,,01314,,,,,,,,,,,,,,,,,,,2008-01-01,A,,,,,96.02A,NAFRev2,O,5.289893,46.003186,0.85,street,Place Laurent Ferrand 01160 Priay,01314_0080,G,PLACE LAURENT FERRAND,
342559580,00036,34255958000036,O,2016-01-15,,,4333ZZ,2016-12-11T04:35:06,true,2,,106,,CHE,DE CHANOZ,01160,PRIAY,,,01314,,,,,,,,,,,,,,,,,,,2016-11-30,F,,,,,43.33Z,NAFRev2,N,5.296115,46.012618,0.84,housenumber,106 Chemin de Chanoz 01160 Priay,01314_0047_00106,G,106 CHEMIN DE CHANOZ,
343043030,00018,34304303000018,O,1987-11-01,NN,,,2018-07-18T04:07:39,true,3,PRIAY,,,LD,LES GRANDES CHAMPAGNES,01160,PRIAY,,,01314,,,,,,,,,,,,,,,,,,,2008-01-01,A,,,,,68.20B,NAFRev2,N,5.280737,45.999754,0.95,street,Les Grandes Champagnes 01160 Priay,01314_B090,G,LES GRANDES CHAMPAGNES,
343685277,00018,34368527700018,O,,NN,,,,true,1,,,,,,01160,PRIAY,,,01314,,,,,,,,,,,,,,,,,,,1993-05-18,F,,,,,28.5D,NAF1993,N,,,0,,,,,,
344184924,00019,34418492400019,O,1988-01-01,NN,,,,true,4,,,,,,01160,PRIAY,,,01314,,,,,,,,,,,,,,,,,,,1994-12-25,F,,,,,74.8K,NAF1993,N,,,0,,,,,,
344554621,00013,34455462100013,O,,NN,,,,true,1,,,,,,01160,PRIAY,,,01314,,,,,,,,,,,,,,,,,,,1993-03-31,F,,,,,45.4J,NAF1993,N,,,0,,,,,,
344868005,00010,34486800500010,O,1988-04-30,NN,,,,true,1,,,,RUE,PRINCIPALE,01160,PRIAY,,,01314,,,,,,,,,,,,,,,,,,,1997-11-04,F,,,,,70.2C,NAF1993,N,5.28582,46.000486,0.46,street,Grande Rue de la Cotiere 01160 Priay,01314_0045,G,GRANDE RUE DE LA COTIERE,
345038756,00010,34503875600010,O,,NN,,,,true,1,,,,,GRANDE RUE,01160,PRIAY,,,01314,,,,,,,,,,,,,,,,,,,1988-07-01,F,,,,,64.40,NAP,N,5.288092,46.002249,0.94,street,Grande Rue 01160 Priay,01314_0023,G,GRANDE RUE,
345365514,00016,34536551400016,O,1988-07-02,NN,,,,true,1,,,,,,01160,PRIAY,,,01314,,,,,,,,,,,,,,,,,,,2001-09-30,F,,,,,17.3Z,NAF1993,N,,,0,,,,,,
347958415,00023,34795841500023,O,2022-09-01,,,,2023-09-25T11:06:02,true,1,,12,,IMP,DU SABOTIER,01160,PRIAY,,,01314,,,,,,,,,,,,,,,,,,,2022-09-01,A,,,,,85.51Z,NAFRev2,N,5.287925,46.003475,0.84,housenumber,12 Impasse du Sabotier 01160 Priay,01314_0092_00012,G,12 IMPASSE DU SABOTIER,
350081568,00023,35008156800023,O,2009-05-04,,,,2012-11-09T00:40:53,false,2,,643,,RUE,DE LA COTIERE,01160,PRIAY,,,01314,,,,,,,,,,,,,,,,,,,2010-03-25,F,,,,,43.12A,NAFRev2,N,5.285325,45.999992,0.91,housenumber,643 Grande Rue de la Cotiere 01160 Priay,01314_0045_00643,G,643 GRANDE RUE DE LA COTIERE,
350264826,00016,35026482600016,O,1989-03-15,NN,,,,true,1,,,,LD,LES BROTTEAUX,01160,PRIAY,,,01314,,,,,,,,,,,,,,,,,,,1999-09-30,F,,,,,55.2C,NAF1993,N,5.293844,46.026114,0.35,street,Les Valettes 01160 Priay,01314_bdxypc,G,LES VALETTES,
351246400,00011,35124640000011,O,,NN,,,,true,1,,,,,,01160,PRIAY,,,01314,,,,,,,,,,,,,,,,,,,1993-05-01,F,,,,,70.2A,NAF1993,N,,,0,,,,,,
351485032,00020,35148503200020,O,2000-04-01,NN,,,2010-04-18T05:23:49,false,5,,,,LD,LES BROTTEAUX,01160,PRIAY,,,01314,,,,,,,,,,,,,,,,,,,2008-12-31,F,,,,,55.30Z,NAFRev2,N,5.293844,46.026114,0.35,street,Les Valettes 01160 Priay,01314_bdxypc,G,LES VALETTES,
352339725,00025,35233972500025,O,2001-11-01,NN,,,2009-03-04T20:57:59,true,4,,,,CHE,DES SABLONS,01160,PRIAY,,,01314,,,,,,,,,,,,,,,,,,,2006-10-31,F,,,,,74.1J,NAFRev1,N,5.297037,46.014583,0.84,street,Chemin des Sablons 01160 Priay,01314_0096,G,CHEMIN DES SABLONS,
352637912,00010,35263791200010,O,1988-05-26,NN,,,2006-11-25T11:13:07,true,1,,,,PL,DU VILLAGE,01160,PRIAY,,,01314,,,,,,,,,,,,,,,,,,,1996-06-09,F,,,,,74.1J,NAF1993,N,2.2389236,48.6678573,0.77,poi.park,Place du Village (Parc) Nozay,https://osm.org/way/26978864,G,,
353972318,00011,35397231800011,O,,NN,,,,true,1,,,,,HAMEAU DE BELLEGARDE,01160,PRIAY,,,01314,,,,,,,,,,,,,,,,,,,1996-06-30,F,,,,,93.0E,NAF1993,N,5.294649,46.015211,0.65,street,Rue de Bellegarde 01160 Priay,01314_0036,G,RUE DE BELLEGARDE,
354025991,00010,35402599100010,O,1990-02-10,NN,,,2023-06-07T03:44:56,true,3,,46,,IMP,DES CHENES,01160,PRIAY,,,01314,,,,,,,,,,,,,,,,,,,2008-01-01,A,,,,,68.20A,NAFRev2,N,5.294187,46.02565,0.84,housenumber,46 Impasse des Chenes 01160 Priay,01314_0048_00046,G,46 IMPASSE DES CHENES,
356000828,03145,35600082803145,O,1991-01-01,NN,,,2006-10-28T00:12:13,false,3,,,,,LE BOURG,01160,PRIAY,,,01314,,,,,,,,,,,,,,,,,,,2006-06-15,F,BUREAU DE POSTE,,,,64.1A,NAFRev1,N,5.286195,46.000142,0.42,street,Lotissement le Beau Rivage 01160 Priay,01314_q6g9vp,G,LOTISSEMENT LE BEAU RIVAGE,
377811047,00036,37781104700036,O,2019-06-03,,,1610AQ,2021-02-23T11:06:37,true,1,,195,,,MONTEE DE BELLEGARDE,01160,PRIAY,,,01314,,,,,,,,,,,,,,,,,,,2019-06-03,A,,,,,16.10A,NAFRev2,N,5.295993,46.010796,0.95,housenumber,195 Montee de Bellegarde 01160 Priay,01314_0037_00195,G,195 MONTEE DE BELLEGARDE,
377905500,00015,37790550000015,O,1990-04-01,NN,,,,false,4,,,,,,01160,PRIAY,,,01314,,,,,,,,,,,,,,,,,,,1996-12-25,F,,,,,15.1A,NAF1993,O,,,0,,,,,,