siren,nic,siret,statutDiffusionEtablissement,dateCreationEtablissement,trancheEffectifsEtablissement,anneeEffectifsEtablissement,activitePrincipaleRegistreMetiersEtablissement,dateDernierTraitementEtablissement,etablissementSiege,nombrePeriodesEtablissement,complementAdresseEtablissement,numeroVoieEtablissement,indiceRepetitionEtablissement,typeVoieEtablissement,libelleVoieEtablissement,codePostalEtablissement,libelleCommuneEtablissement,libelleCommuneEtrangerEtablissement,distributionSpecialeEtablissement,codeCommuneEtablissement,codeCedexEtablissement,libelleCedexEtablissement,codePaysEtrangerEtablissement,libellePaysEtrangerEtablissement,complementAdresse2Etablissement,numeroVoie2Etablissement,indiceRepetition2Etablissement,typeVoie2Etablissement,libelleVoie2Etablissement,codePostal2Etablissement,libelleCommune2Etablissement,libelleCommuneEtranger2Etablissement,distributionSpeciale2Etablissement,codeCommune2Etablissement,codeCedex2Etablissement,libelleCedex2Etablissement,codePaysEtranger2Etablissement,libellePaysEtranger2Etablissement,dateDebut,etatAdministratifEtablissement,enseigne1Etablissement,enseigne2Etablissement,enseigne3Etablissement,denominationUsuelleEtablissement,activitePrincipaleEtablissement,nomenclatureActivitePrincipaleEtablissement,caractereEmployeurEtablissement,longitude,latitude,geo_score,geo_type,geo_adresse,geo_id,geo_ligne,geo_l4,geo_l5
211404454,00012,21140445400012,O,1983-03-01,NN,,,2022-08-29T09:06:02,true,4,,,,,LA CAVEE,14490,MONTFIQUET,,,14445,,,,,,,,,,,,,,,,,,,2008-01-01,A,MAIRIE,,,,84.11Z,NAFRev2,N,-0.884445,49.171748,0.3,street,la Rue Cudeville 14490 Montfiquet,14445_B175,G,LA RUE CUDEVILLE,
211404454,00020,21140445400020,O,2000-01-01,NN,,,2006-10-26T23:40:18,false,3,MAIRIE,,,,LA CAVEE,14490,MONTFIQUET,,,14445,,,,,,,,,,,,,,,,,,,2004-12-31,F,SERVICE DES ORDURES MENAGERES,,,,90.0B,NAFRev1,N,-0.884445,49.171748,0.3,street,la Rue Cudeville 14490 Montfiquet,14445_B175,G,LA RUE CUDEVILLE,
251401840,00029,25140184000029,O,1986-03-28,NN,,,2008-11-19T15:40:05,true,3,MAIRIE,,,,LA CAVEE,14490,MONTFIQUET,,,14445,,,,,,,,,,,,,,,,,,,2004-01-07,F,,,,,75.1E,NAFRev1,N,-0.884445,49.171748,0.3,street,la Rue Cudeville 14490 Montfiquet,14445_B175,G,LA RUE CUDEVILLE,
261405013,00010,26140501300010,O,1995-12-25,,,,2018-01-25T09:15:12,true,3,MAIRIE,,,,LA CAVEE,14490,MONTFIQUET,,,14445,,,,,,,,,,,,,,,,,,,2017-12-31,F,CCAS,,,,88.99B,NAFRev2,N,-0.884445,49.171748,0.3,street,la Rue Cudeville 14490 Montfiquet,14445_B175,G,LA RUE CUDEVILLE,
303923924,00037,30392392400037,O,1992-09-01,NN,,,2014-05-16T14:32:43,true,1,,,,,L'EMBRANCHEMENT,14490,MONTFIQUET,,,14445,,,,,,,,,,,,,,,,,,,2002-12-31,F,,,,,50.5Z,NAF1993,N,4.3850838,45.4644546,0.89,poi.motorway_junction,Saint-Priest (Embranchement d'autoroute) Saint-Étienne,https://osm.org/node/614711183,G,,
308821552,00012,30882155200012,O,,,,,,true,1,,,,LD,L EMBRANCHEMENT,14490,MONTFIQUET,,,14445,,,,,,,,,,,,,,,,,,,1984-12-25,F,,,,,65.02,NAP,N,4.3850838,45.4644546,0.89,poi.motorway_junction,Saint-Priest (Embranchement d'autoroute) Saint-Étienne,https://osm.org/node/614711183,G,,
314948639,00039,31494863900039,O,,,,,,true,1,,,,LD,L EMBRANCHEMENT,14490,MONTFIQUET,,,14445,,,,,,,,,,,,,,,,,,,1988-07-04,F,,,,,67.01,NAP,N,4.3850838,45.4644546,0.89,poi.motorway_junction,Saint-Priest (Embranchement d'autoroute) Saint-Étienne,https://osm.org/node/614711183,G,,
327748562,00029,32774856200029,O,1986-08-01,,,,,true,1,,,,,,14490,MONTFIQUET,,,14445,,,,,,,,,,,,,,,,,,,1999-04-10,F,,,,,45.2V,NAF1993,N,,,0,,,,,,
330544719,00025,33054471900025,O,1994-10-10,,,,,false,3,,,,LD,L'EMBRANCHEMENT,14490,MONTFIQUET,,,14445,,,,,,,,,,,,,,,,,,,1997-03-01,F,,,,,50.1Z,NAF1993,N,4.3850838,45.4644546,0.89,poi.motorway_junction,Saint-Priest (Embranchement d'autoroute) Saint-Étienne,https://osm.org/node/614711183,G,,
331225607,00018,33122560700018,O,,NN,,,,true,1,,,,,FERME DE L'ETANG,14490,MONTFIQUET,,,14445,,,,,,,,,,,,,,,,,,,1987-06-30,F,,,,,01.80,NAP,N,-0.87802,49.173652,0.5,street,l'Étang 14490 Montfiquet,14445_s0ltxu,G,L ETANG,
332250257,00059,33225025700059,O,1994-10-01,NN,,,,false,3,,,,LD,L'EMBRANCHEMENT,14490,MONTFIQUET,,,14445,,,,,,,,,,,,,,,,,,,1995-08-31,F,,,,,50.1Z,NAF1993,,4.3850838,45.4644546,0.89,poi.motorway_junction,Saint-Priest (Embranchement d'autoroute) Saint-Étienne,https://osm.org/node/614711183,G,,
347900458,00014,34790045800014,O,,NN,,,,true,1,,,,LD,L EMBRANCHEMENT,14490,MONTFIQUET,,,14445,,,,,,,,,,,,,,,,,,,1994-03-01,F,,,,,55.1A,NAF1993,O,4.3850838,45.4644546,0.89,poi.motorway_junction,Saint-Priest (Embranchement d'autoroute) Saint-Étienne,https://osm.org/node/614711183,G,,
351534631,00012,35153463100012,O,,NN,,,,true,1,,,,,L'EMBRANCHEMENT,14490,MONTFIQUET,,,14445,,,,,,,,,,,,,,,,,,,1992-08-31,F,,,,,50.5Z,NAF1993,N,4.3850838,45.4644546,0.89,poi.motorway_junction,Saint-Priest (Embranchement d'autoroute) Saint-Étienne,https://osm.org/node/614711183,G,,
353982135,00017,35398213500017,O,1990-04-02,,,,,false,4,,,,,,14490,MONTFIQUET,,,14445,,,,,,,,,,,,,,,,,,,2003-06-30,F,,,,,67.2Z,NAFRev1,N,,,0,,,,,,
353982135,00025,35398213500025,O,1990-01-01,NN,,,2006-10-28T00:08:31,true,3,,,,,FERME DE LA BUTTE,14490,MONTFIQUET,,,14445,,,,,,,,,,,,,,,,,,,2004-06-25,F,,,,,01.1A,NAFRev1,N,-1.1807173,47.3533197,0.87,poi.farmyard,La Butte de la Pierre (Corps de ferme) Orée-d'Anjou,https://osm.org/way/401624491,G,,
392501052,00014,39250105200014,O,1993-08-28,NN,,,2008-01-05T20:03:54,true,3,,,,LD,LA FERME DE L'ETANG,14490,MONTFIQUET,,,14445,,,,,,,,,,,,,,,,,,,2008-01-01,A,,,,,68.20B,NAFRev2,N,-0.87802,49.173652,0.44,street,l'Étang 14490 Montfiquet,14445_s0ltxu,G,L ETANG,
394136451,00017,39413645100017,O,1994-03-02,NN,,,2021-10-27T08:22:12,true,5,MONTFIQUET,,,LD,L'EMBRANCHEMENT,14490,MONTFIQUET,,,14445,,,,,,,,,,,,,,,,,,,2016-09-30,A,,,,,55.10Z,NAFRev2,N,-0.87802,49.173652,0.49,street,l'Étang 14490 Montfiquet,14445_s0ltxu,D,L ETANG,
394212245,00010,39421224500010,O,1994-02-28,NN,,,2013-05-26T03:53:58,true,3,,,,LD,L'EMBRANCHEMENT,14490,MONTFIQUET,,,14445,,,,,,,,,,,,,,,,,,,2008-01-01,A,,,,,68.20B,NAFRev2,N,4.3850838,45.4644546,0.89,poi.motorway_junction,Saint-Priest (Embranchement d'autoroute) Saint-Étienne,https://osm.org/node/614711183,G,,
395079411,00017,39507941100017,O,1994-03-02,NN,,,2006-11-25T12:27:14,true,1,,,,,,14490,MONTFIQUET,,,14445,,,,,,,,,,,,,,,,,,,1998-12-31,F,,,,,74.1J,NAF1993,N,,,0,,,,,,
395272529,00029,39527252900029,O,1900-01-01,NN,,,2011-04-28T00:59:48,false,3,,,,,FERME DE L'ETANG,14490,MONTFIQUET,,,14445,,,,,,,,,,,,,,,,,,,1996-03-18,F,,,,,70.3A,NAF1993,N,-0.87802,49.173652,0.5,street,l'Étang 14490 Montfiquet,14445_s0ltxu,G,L ETANG,
403631674,00013,40363167400013,O,1996-01-12,NN,,,2008-01-05T20:20:18,true,3,,,,,LIEUDIT  L'EMBRANCHEMENT,14490,MONTFIQUET,,,14445,,,,,,,,,,,,,,,,,,,2008-01-01,A,,,,,68.20B,NAFRev2,N,4.3850838,45.4644546,0.89,poi.motorway_junction,Saint-Priest (Embranchement d'autoroute) Saint-Étienne,https://osm.org/node/614711183,G,,
407549542,00014,40754954200014,O,1995-01-01,NN,,,2008-01-04T20:56:28,true,3,,,,,,14490,MONTFIQUET,,,14445,,,,,,,,,,,,,,,,,,,2008-01-01,A,,,,,01.41Z,NAFRev2,N,,,0,,,,,,
451110993,00016,45111099300016,P,2003-12-15,NN,,,2022-09-19T17:13:38,false,4,[ND],[ND],[ND],[ND],[ND],[ND],MONTFIQUET,,[ND],14445,[ND],[ND],,,[ND],[ND],[ND],[ND],[ND],[ND],,,[ND],,[ND],[ND],,,2021-12-31,F,[ND],[ND],[ND],[ND],90.03B,NAFRev2,N,,,0,,,,,,
483553020,00015,48355302000015,O,2004-12-25,NN,,,2022-06-14T03:48:14,true,3,,,,,FERME DE LA BUTTE,14490,MONTFIQUET,,,14445,,,,,,,,,,,,,,,,,,,2022-04-15,F,,,,,01.11Z,NAFRev2,N,-1.1807173,47.3533197,0.87,poi.farmyard,La Butte de la Pierre (Corps de ferme) Orée-d'Anjou,https://osm.org/way/401624491,G,,
499862407,00032,49986240700032,O,2019-09-01,,,,2021-05-10T09:49:12,false,2,,,,,LIEU DIT CANTEPIE,14490,MONTFIQUET,,,14445,,,,,,,,,,,,,,,,,,,2021-03-11,F,,,,,68.20A,NAFRev2,N,0.0646767,49.1394481,0.88,poi.castle,Manoir de Cantepie (Château) Cambremer,https://osm.org/way/329806545,G,,
506610336,00014,50661033600014,O,,,,,,true,1,,,,CAR,DE L EMBRANCHEMENT,14490,MONTFIQUET,,,14445,,,,,,,,,,,,,,,,,,,1984-12-25,F,,,,,81.21,NAP,N,2.4348247,50.9637801,0.77,poi,Ancienne portion de voie de la Compagnie des chemins de fer des Flandres située sur l'embranchement de Rexpoëde à la gare de Bergues. (Pont) Quaëdypre,https://osm.org/way/444906764,G,,
507812337,00016,50781233700016,O,2008-07-21,NN,,,2019-06-24T13:12:52,true,3,,,,,L EMBRANCHEMENT,14490,MONTFIQUET,,,14445,,,,,,,,,,,,,,,,,,,2017-06-30,A,,,,,94.99Z,NAFRev2,N,4.3850838,45.4644546,0.89,poi.motorway_junction,Saint-Priest (Embranchement d'autoroute) Saint-Étienne,https://osm.org/node/614711183,G,,
509739892,00024,50973989200024,P,2022-04-03,,,,2022-07-07T08:46:02,true,2,[ND],[ND],[ND],[ND],[ND],[ND],MONTFIQUET,,[ND],14445,[ND],[ND],,,[ND],[ND],[ND],[ND],[ND],[ND],,,[ND],,[ND],[ND],,,2022-06-09,F,[ND],[ND],[ND],[ND],90.01Z,NAFRev2,N,,,0,,,,,,
534672266,00028,53467226600028,P,2023-07-15,,,,2023-10-18T10:21:02,true,1,[ND],[ND],[ND],[ND],[ND],[ND],MONTFIQUET,,[ND],14445,[ND],[ND],,,[ND],[ND],[ND],[ND],[ND],[ND],,,[ND],,[ND],[ND],,,2023-07-15,F,[ND],[ND],[ND],[ND],43.12A,NAFRev2,N,,,0,,,,,,
780750998,00012,78075099800012,O,1900-01-01,,,,2014-10-07T10:57:48,false,2,,,,,,14490,MONTFIQUET,,,14445,,,,,,,,,,,,,,,,,,,1984-12-25,F,,,,,47.04,NAP,N,,,0,,,,,,
790564942,00015,79056494200015,O,2013-01-30,,,,2013-02-06T07:36:33,true,1,,,,,L'EMBRANCHEMENT,14490,MONTFIQUET,,,14445,,,,,,,,,,,,,,,,,,,2013-01-30,A,,,,,68.20B,NAFRev2,N,4.3850838,45.4644546,0.89,poi.motorway_junction,Saint-Priest (Embranchement d'autoroute) Saint-Étienne,https://osm.org/node/614711183,G,,
793264433,00020,79326443300020,O,2014-05-31,01,2021,4520AB,2023-11-30T10:52:48,false,2,,,,,L'EMBRANCHEMENT,14490,MONTFIQUET,,,14445,,,,,,,,,,,,,,,,,,,2014-06-01,A,,,,,47.30Z,NAFRev2,O,4.3850838,45.4644546,0.89,poi.motorway_junction,Saint-Priest (Embranchement d'autoroute) Saint-Étienne,https://osm.org/node/614711183,G,,
793460361,00017,79346036100017,O,2013-06-11,,,5610CR,2017-03-10T05:16:35,true,2,,,,RUE,DE CUDEVILLE,14490,MONTFIQUET,,,14445,,,,,,,,,,,,,,,,,,,2017-02-28,F,,,,PIZZA-YOYO,56.10C,NAFRev2,N,-0.884445,49.171748,0.75,street,la Rue Cudeville 14490 Montfiquet,14445_B175,G,LA RUE CUDEVILLE,
808094155,00013,80809415500013,O,2014-12-01,,,,2014-12-03T09:59:47,true,1,,,,,LA VALLEE,14490,MONTFIQUET,,,14445,,,,,,,,,,,,,,,,,,,2014-12-01,A,LE CINEMA SE PROMENE,,,LE CINEMA SE PROMENE,59.14Z,NAFRev2,N,-0.884445,49.171748,0.37,street,la Rue Cudeville 14490 Montfiquet,14445_B175,G,LA RUE CUDEVILLE,
809712391,00014,80971239100014,O,2015-01-17,,,,2020-04-21T03:44:48,false,2,,,,,LES LOGES,14490,MONTFIQUET,,,14445,,,,,,,,,,,,,,,,,,,2020-01-04,F,,,,,68.20B,NAFRev2,N,-0.901029,49.175542,0.4,locality,La Belle Loge 14490 Montfiquet,14445_B013,G,LA BELLE LOGE,
827694746,00013,82769474600013,O,2017-02-06,,,,2017-02-15T08:51:33,true,1,,,,,L'ETANG,14490,MONTFIQUET,,,14445,,,,,,,,,,,,,,,,,,,2017-02-06,A,,,,,70.10Z,NAFRev2,N,-0.87802,49.173652,0.93,street,l'Étang 14490 Montfiquet,14445_s0ltxu,G,L ETANG,
827756982,00019,82775698200019,O,2017-02-15,,,,2021-07-12T03:43:54,true,2,,,,,LA CAVEE,14490,MONTFIQUET,,,14445,,,,,,,,,,,,,,,,,,,2020-12-31,F,,,,,47.76Z,NAFRev2,N,-0.884445,49.171748,0.3,street,la Rue Cudeville 14490 Montfiquet,14445_B175,G,LA RUE CUDEVILLE,
833662273,00014,83366227300014,O,2017-10-05,,,4520AC,2023-07-07T19:45:49,true,3,,,,,L'EMBRANCHEMENT,14490,MONTFIQUET,,,14445,,,,,,,,,,,,,,,,,,,2022-09-29,F,,,,GARAGE DE L'EMBRANCHEMENT,45.20A,NAFRev2,N,4.3850838,45.4644546,0.89,poi.motorway_junction,Saint-Priest (Embranchement d'autoroute) Saint-Étienne,https://osm.org/node/614711183,G,,
837875459,00013,83787545900013,O,2018-02-01,NN,,4221ZA,2020-08-25T11:40:33,true,2,,,,RUE,RUE DES ECOLES,14490,MONTFIQUET,,,14445,,,,,,,,,,,,,,,,,,,2018-07-01,A,,,,,43.12A,NAFRev2,O,1.5268927,43.5319194,0.88,poi.cycleway,Piste Cyclable Rue des Écoles Labège,https://osm.org/way/377971705,G,,
839139052,00030,83913905200030,P,2022-10-28,,,,2023-04-14T15:31:37,true,2,[ND],[ND],[ND],[ND],[ND],[ND],MONTFIQUET,,[ND],14445,[ND],[ND],,,[ND],[ND],[ND],[ND],[ND],[ND],,,[ND],,[ND],[ND],,,2023-04-17,A,[ND],[ND],[ND],[ND],47.91B,NAFRev2,N,,,0,,,,,,
847955663,00020,84795566300020,P,2019-09-21,,,,2022-05-21T04:14:02,true,2,[ND],[ND],[ND],[ND],[ND],[ND],MONTFIQUET,,[ND],14445,[ND],[ND],,,[ND],[ND],[ND],[ND],[ND],[ND],,,[ND],,[ND],[ND],,,2022-05-19,A,[ND],[ND],[ND],[ND],59.11B,NAFRev2,N,,,0,,,,,,
850823287,00014,85082328700014,P,2019-05-14,,,,2019-08-07T03:56:12,true,2,[ND],[ND],[ND],[ND],[ND],[ND],MONTFIQUET,,[ND],14445,[ND],[ND],,,[ND],[ND],[ND],[ND],[ND],[ND],,,[ND],,[ND],[ND],,,2019-07-14,F,[ND],[ND],[ND],[ND],01.49Z,NAFRev2,N,,,0,,,,,,
851602094,00019,85160209400019,O,2019-06-03,,,4391BZ,2022-09-23T09:06:58,true,2,,,,,LIEU DIT LA CAVEE,14490,MONTFIQUET,,,14445,,,,,,,,,,,,,,,,,,,2021-12-31,F,,,,MARCOTTE DA VID,43.91B,NAFRev2,N,-0.884445,49.171748,0.3,street,la Rue Cudeville 14490 Montfiquet,14445_B175,G,LA RUE CUDEVILLE,
877905380,00011,87790538000011,O,2019-06-29,,,,2019-10-08T11:45:18,true,1,,,,,LE BAS DE MONTFIQUET,14490,MONTFIQUET,,,14445,,,,,,,,,,,,,,,,,,,2019-06-29,A,,,,,47.99A,NAFRev2,N,-0.87292,49.17572,0.91,street,Lieu Dit le Bas de Montfiquet 14490 Montfiquet,14445_B009,G,LIEU DIT LE BAS DE MONTFIQUET,
882392830,00015,88239283000015,O,2019-08-19,,,,2020-03-11T16:09:17,true,1,,,,RUE,DE CUDEVILLE,14490,MONTFIQUET,,,14445,,,,,,,,,,,,,,,,,,,2019-08-19,A,,,,,68.20A,NAFRev2,N,-0.884445,49.171748,0.75,street,la Rue Cudeville 14490 Montfiquet,14445_B175,G,LA RUE CUDEVILLE,
904870904,00011,90487090400011,O,2021-09-24,,,,2021-11-19T14:53:24,true,1,,,,LD,L'EMBRANCHEMENT,14490,MONTFIQUET,,,14445,,,,,,,,,,,,,,,,,,,2021-09-24,A,,,,,64.20Z,NAFRev2,N,4.3850838,45.4644546,0.89,poi.motorway_junction,Saint-Priest (Embranchement d'autoroute) Saint-Étienne,https://osm.org/node/614711183,G,,
906371307,00024,90637130700024,O,,NN,,,,true,1,,,,,L'EMBRANCHEMENT,14490,MONTFIQUET,,,14445,,,,,,,,,,,,,,,,,,,1989-06-30,F,,,,,65.02,NAP,N,4.3850838,45.4644546,0.89,poi.motorway_junction,Saint-Priest (Embranchement d'autoroute) Saint-Étienne,https://osm.org/node/614711183,G,,
913687711,00014,91368771100014,O,1996-03-22,,,,2022-05-19T10:48:29,true,1,MAIRIE,,,,LA CAVEE,14490,MONTFIQUET,,,14445,,,,,,,,,,,,,,,,,,,1996-03-22,A,,,,,94.99Z,NAFRev2,N,-0.884445,49.171748,0.3,street,la Rue Cudeville 14490 Montfiquet,14445_B175,G,LA RUE CUDEVILLE,
